{"text_format":"1","workbook":"xlsx","n_sheets":7,"sheets":["Liste","Partie 1","Partie 2","Partie 3","Partie 4","Recap","Classement Joueurs"],"not_rendered":{"charts":0,"images":0,"macros":1,"external_links":3,"defined_names":65,"comments":0,"pivot_tables":0},"unopened":[],"bounds":{"document_bytes":16777216,"sheet_cells":100000,"rows_first":2000,"rows_last":500,"rows_between":2000,"halvings":0,"cell_chars":16384,"cell_head_chars":4096},"cells_cut":0,"cells_raw":0,"read":"whole","date_system":"1900"}

{"sheet":"Liste","index":0,"n_rows":200,"n_cols":57,"rows_kept":200,"cut":false,"hidden":false,"merged":[[1,7,1,8],[2,7,2,8],[0,7,0,8],[4,7,4,8],[5,52,5,54],[3,7,3,8],[5,31,5,33],[5,38,5,40],[5,45,5,47]]}
[null,null,null,null,null,null,null,"Tournoi du :  ",null,null,null,null,null,null,null,null,null,null,null,null,null,null,null,null,null,null,30072022,null,null,null,null,null,null,null,null,null,null,null,null,null,null,null,null,null,null,null,null,null,null,null,null,null,null,null,null,"4 parties"]
[null,null,"Nombre de Licenciés",null,{"$f":"COUNTA(I7:I198)","v":192},null,null,"B1",null,null,null,null,null,null,null,null,null,null,null,null,null,null,null,null,null,null,null,null,null,null,null,null,null,null,null,null,null,null,null,null,null,null,null,null,null,null,null,null,null,null,null,null,null,null,null,"3 parties"]
[null,null,"Nombre de joueurs inscrits ",null,{"$f":"COUNTA(J7:J198)","v":192},null,null,"C1",null,null,null,null,null,null,null,null,null,null,null,null,null,null,null,null,null,null,null,null,null,null,null,null,null,null,null,null,null,null,null,null,null,null,null,null,null,null,null,null,null,null,null,null,null,null,null,"2 parties"]
[null,null,"Nombre de triplettes possibles",null,{"$f":"QUOTIENT(E3,3)","v":64},null,null,"A1",null,null,null,null,null,null,null,null,null,null,null,null,null,null,null,null,null,null,null,null,null,null,null,null,null,null,null,null,null,null,null,null,null,null,null,null,null,null,null,null,null,null,null,null,null,null,null,"1 partie"]
[null,null,"Répartition :",{"$f":"COUNTA(J7:J70)","v":64},{"$f":"COUNTA(J71:J198)","v":128},null,null,"LPPTC",null,null,null,null,null,null,null,null,null,null,null,null,null,null,null,null,null,null,null,null,null,null,null,null,null,null,null,null,null,null,null,null,null,null,null,null,null,null,null,null,null,null,null,null,null,null,null,"0 partie"]
[null,null,"Report joueurs inscrits ",null,{"$f":"COUNTA(J7:J198)","v":192},null,"CLUBS","Présents","Liste des inscrits","N° équipe",null,null,null,null,"N° Equipe","Tireur","Milieu","Pointeur ",null,"Tireur","Pointeur 1","Pointeur 2",null,"Tireur","Pointeur 1","Pointeur 2",null,"Tireur","Pointeur 1","Pointeur 2",null,"Partie 1",null,null,"G","P",null,null,"Partie 2",null,null,"G","P",null,null,"Partie 3",null,null,"G","P",null,null,"Partie 4",null,null,"G","P"]
[null,null,null,null,null,null,null,null,"A1",1,{"$f":"J7&\"/\"&COUNTIF(J$7:J7,J7)","v":"1/1"},{"$f":"COUNTIF($J$7:J7,\">0\")","v":1},null,null,1,{"$f":"IFERROR(INDEX($I$7:$I$198,MATCH($O7&\"/1\",$K$7:$K$198,0)),\"\")","v":"A1"},{"$f":"IFERROR(INDEX($I$7:$I$198,MATCH($O7&\"/2\",$K$7:$K$198,0)),\"\")","v":"B1"},{"$f":"IFERROR(INDEX($I$7:$I$198,MATCH($O7&\"/3\",$K$7:$K$198,0)),\"\")","v":"C1"},1,{"$f":"P7","v":"A1"},{"$f":"Q7","v":"B1"},"C1",1,{"$f":"T7","v":"A1"},{"$f":"U7","v":"B1"},"C1",1,{"$f":"X7","v":"A1"},{"$f":"Y7","v":"B1"},{"$f":"Z7","v":"C1"},null,{"$f":"IF(E3>0,1,\"\")","v":1},{"$f":"IF(AF7=\"\",\"\",\"vs\")","v":"vs"},{"$f":"IF(E3>1,2,\"\")","v":2},{"$f":"IF('Partie 1'!$E$3=\"\",\"\",IFERROR(IF(VLOOKUP(AF7,'Partie 1'!$A$3:$E$19,5,0)=13,AF7,AH7),IFERROR(IF(INDEX('Partie 1'!$G$3:$G$19,MATCH(AF7,'Partie 1'!$K$3:$K$19,0))=13,AF7,AH7),IFERROR(IF(VLOOKUP(AF7,'Partie 1'!$M$3:$Q$19,5,0)=13,AF7,AH7),IFERROR(IF(INDEX('Partie 1'!$S$3:$S$19,MATCH(AF7,'Partie 1'!$W$3:$W$19,0))=13,AF7,AH7),\"\")))))","v":1},{"$f":"IF(AI7=\"\",\"\",IF(AI7=AF7,AH7,AF7))","v":2},1,{"$f":"MAX(AK:AK)+1","v":49},{"$f":"IF(AI7=\"\",\"\",IFERROR(INDEX(AI:AI,MATCH(ROW()-6,AK:AK,0)),INDEX(AJ:AJ,MATCH(ROW()-6,AL:AL,0))))","v":1},{"$f":"IF(AM7=\"\",\"\",\"vs\")","v":"vs"},{"$f":"IF(AI7=\"\",\"\",IFERROR(INDEX(AI:AI,MATCH(ROW()-6+$D$5/2,AK:AK,0)),INDEX(AJ:AJ,MATCH(ROW()-6+$D$5/2,AL:AL,0))))","v":4},{"$f":"IFERROR(IF(VLOOKUP(AM7,'Partie 2'!$A$3:$E$19,5,0)=13,AM7,AO7),IFERROR(IF(INDEX('Partie 2'!$G$3:$G$19,MATCH(AM7,'Partie 2'!$K$3:$K$19,0))=13,AM7,AO7),IFERROR(IF(VLOOKUP(AM7,'Partie 2'!$M$3:$Q$19,5,0)=13,AM7,AO7),IFERROR(IF(INDEX('Partie 2'!$S$3:$S$19,MATCH(AM7,'Partie 2'!$W$3:$W$19,0))=13,AM7,AO7),\"\"))))","v":4},{"$f":"IF(AP7=AM7,AO7,AM7)","v":1},{"$f":"AK7","v":1},{"$f":"AL7","v":49},{"$f":"IF(AP7=\"\",\"\",IFERROR(INDEX(AP:AP,MATCH(ROW()-6,AR:AR,0)),INDEX(AQ:AQ,MATCH(ROW()-6,AS:AS,0))))","v":4},{"$f":"IF(AT7=\"\",\"\",\"vs\")","v":"vs"},{"$f":"IF(AP7=\"\",\"\",IFERROR(INDEX(AP:AP,MATCH(ROW()-6+$D$5/2,AR:AR,0)),INDEX(AQ:AQ,MATCH(ROW()-6+$D$5/2,AS:AS,0))))","v":6},{"$f":"IFERROR(IF(VLOOKUP(AT7,'Partie 3'!$A$3:$E$19,5,0)=13,AT7,AV7),IFERROR(IF(INDEX('Partie 3'!$G$3:$G$19,MATCH(AT7,'Partie 3'!$K$3:$K$19,0))=13,AT7,AV7),IFERROR(IF(VLOOKUP(AT7,'Partie 3'!$M$3:$Q$19,5,0)=13,AT7,AV7),IFERROR(IF(INDEX('Partie 3'!$S$3:$S$19,MATCH(AT7,'Partie 3'!$W$3:$W$19,0))=13,AT7,AV7),\"\"))))","v":6},{"$f":"IF(AW7=AT7,AV7,AT7)","v":4},{"$f":"AR7","v":1},{"$f":"AS7","v":49},{"$f":"IF(AW7=\"\",\"\",IFERROR(INDEX(AW:AW,MATCH(ROW()-6,AY:AY,0)),INDEX(AX:AX,MATCH(ROW()-6,AZ:AZ,0))))","v":6},{"$f":"IF(BA7=\"\",\"\",\"vs\")","v":"vs"},{"$f":"IF(AW7=\"\",\"\",IFERROR(INDEX(AW:AW,MATCH(ROW()-6+$D$5/2,AY:AY,0)),INDEX(AX:AX,MATCH(ROW()-6+$D$5/2,AZ:AZ,0))))","v":9},{"$f":"IFERROR(IF(VLOOKUP(BA7,'Partie 4'!$A$3:$E$19,5,0)=13,BA7,BC7),IFERROR(IF(INDEX('Partie 4'!$G$3:$G$19,MATCH(BA7,'Partie 4'!$K$3:$K$19,0))=13,BA7,BC7),IFERROR(IF(VLOOKUP(BA7,'Partie 4'!$M$3:$Q$19,5,0)=13,BA7,BC7),IFERROR(IF(INDEX('Partie 4'!$S$3:$S$19,MATCH(BA7,'Partie 4'!$W$3:$W$19,0))=13,BA7,BC7),\"\"))))","v":9},{"$f":"IF(BD7=BA7,BC7,BA7)","v":6}]
[null,null,null,null,null,null,null,null,"A2",2,{"$f":"J8&\"/\"&COUNTIF(J$7:J8,J8)","v":"2/1"},{"$f":"COUNTIF($J$7:J8,\">0\")","v":2},null,null,2,{"$f":"IFERROR(INDEX($I$7:$I$198,MATCH($O8&\"/1\",$K$7:$K$198,0)),\"\")","v":"A2"},{"$f":"IFERROR(INDEX($I$7:$I$198,MATCH($O8&\"/2\",$K$7:$K$198,0)),\"\")","v":"B2"},{"$f":"IFERROR(INDEX($I$7:$I$198,MATCH($O8&\"/3\",$K$7:$K$198,0)),\"\")","v":"C2"},2,{"$f":"P8","v":"A2"},{"$f":"Q8","v":"B2"},{"$f":"R8","v":"C2"},2,{"$f":"T8","v":"A2"},{"$f":"U8","v":"B2"},{"$f":"V8","v":"C2"},2,{"$f":"X8","v":"A2"},{"$f":"Y8","v":"B2"},{"$f":"Z8","v":"C2"},null,{"$f":"IF(E3>2,3,\"\")","v":3},"vs",{"$f":"IF(E3>3,4,\"\")","v":4},{"$f":"IF('Partie 1'!$E$3=\"\",\"\",IFERROR(IF(VLOOKUP(AF8,'Partie 1'!$A$3:$E$19,5,0)=13,AF8,AH8),IFERROR(IF(INDEX('Partie 1'!$G$3:$G$19,MATCH(AF8,'Partie 1'!$K$3:$K$19,0))=13,AF8,AH8),IFERROR(IF(VLOOKUP(AF8,'Partie 1'!$M$3:$Q$19,5,0)=13,AF8,AH8),IFERROR(IF(INDEX('Partie 1'!$S$3:$S$19,MATCH(AF8,'Partie 1'!$W$3:$W$19,0))=13,AF8,AH8),\"\")))))","v":4},{"$f":"IF(AI8=\"\",\"\",IF(AI8=AF8,AH8,AF8))","v":3},{"$f":"AK7+$D$5/2","v":33},{"$f":"IF(AK8=\"\",\"\",ROUNDUP($D$5/4,0)+1)","v":17},6,"vs",8,{"$f":"IFERROR(IF(VLOOKUP(AM8,'Partie 2'!$A$3:$E$19,5,0)=13,AM8,AO8),IFERROR(IF(INDEX('Partie 2'!$G$3:$G$19,MATCH(AM8,'Partie 2'!$K$3:$K$19,0))=13,AM8,AO8),IFERROR(IF(VLOOKUP(AM8,'Partie 2'!$M$3:$Q$19,5,0)=13,AM8,AO8),IFERROR(IF(INDEX('Partie 2'!$S$3:$S$19,MATCH(AM8,'Partie 2'!$W$3:$W$19,0))=13,AM8,AO8),\"\"))))","v":6},8,{"$f":"AK8","v":33},17,{"$f":"IF(AP8=\"\",\"\",IFERROR(INDEX(AP:AP,MATCH(ROW()-6,AR:AR,0)),INDEX(AQ:AQ,MATCH(ROW()-6,AS:AS,0))))","v":9},"vs",14,{"$f":"IFERROR(IF(VLOOKUP(AT8,'Partie 3'!$A$3:$E$19,5,0)=13,AT8,AV8),IFERROR(IF(INDEX('Partie 3'!$G$3:$G$19,MATCH(AT8,'Partie 3'!$K$3:$K$19,0))=13,AT8,AV8),IFERROR(IF(VLOOKUP(AT8,'Partie 3'!$M$3:$Q$19,5,0)=13,AT8,AV8),IFERROR(IF(INDEX('Partie 3'!$S$3:$S$19,MATCH(AT8,'Partie 3'!$W$3:$W$19,0))=13,AT8,AV8),\"\"))))","v":9},14,{"$f":"AR8","v":33},17,{"$f":"IF(AW8=\"\",\"\",IFERROR(INDEX(AW:AW,MATCH(ROW()-6,AY:AY,0)),INDEX(AX:AX,MATCH(ROW()-6,AZ:AZ,0))))","v":20},"vs",25,{"$f":"IFERROR(IF(VLOOKUP(BA8,'Partie 4'!$A$3:$E$19,5,0)=13,BA8,BC8),IFERROR(IF(INDEX('Partie 4'!$G$3:$G$19,MATCH(BA8,'Partie 4'!$K$3:$K$19,0))=13,BA8,BC8),IFERROR(IF(VLOOKUP(BA8,'Partie 4'!$M$3:$Q$19,5,0)=13,BA8,BC8),IFERROR(IF(INDEX('Partie 4'!$S$3:$S$19,MATCH(BA8,'Partie 4'!$W$3:$W$19,0))=13,BA8,BC8),\"\"))))","v":20},{"$f":"IF(BD8=BA8,BC8,BA8)","v":25}]
[null,"Cocher les présents est facultaif",null,null,null,null,null,null,"A3",3,{"$f":"J9&\"/\"&COUNTIF(J$7:J9,J9)","v":"3/1"},{"$f":"COUNTIF($J$7:J9,\">0\")","v":3},null,null,3,"A3","B3","C3",3,"A3","B3","C3",3,"A3","B3","C3",3,"A3","B3","C3",null,{"$f":"IF(ROW()-6<=$E$4/2,AF8+2,\"\")","v":5},{"$f":"IF(AF9=\"\",\"\",\"vs\")","v":"vs"},{"$f":"IF(AF9=\"\",\"\",AF9+1)","v":6},{"$f":"IF('Partie 1'!$E$3=\"\",\"\",IFERROR(IF(VLOOKUP(AF9,'Partie 1'!$A$3:$E$19,5,0)=13,AF9,AH9),IFERROR(IF(INDEX('Partie 1'!$G$3:$G$19,MATCH(AF9,'Partie 1'!$K$3:$K$19,0))=13,AF9,AH9),IFERROR(IF(VLOOKUP(AF9,'Partie 1'!$M$3:$Q$19,5,0)=13,AF9,AH9),IFERROR(IF(INDEX('Partie 1'!$S$3:$S$19,MATCH(AF9,'Partie 1'!$W$3:$W$19,0))=13,AF9,AH9),\"\")))))","v":6},5,{"$f":"IF(AF9=\"\",\"\",AK7+1)","v":2},{"$f":"IF(AK9=\"\",\"\",AL7+1)","v":50},9,{"$f":"IF(AM9=\"\",\"\",\"vs\")","v":"vs"},12,{"$f":"IFERROR(IF(VLOOKUP(AM9,'Partie 2'!$A$3:$E$19,5,0)=13,AM9,AO9),IFERROR(IF(INDEX('Partie 2'!$G$3:$G$19,MATCH(AM9,'Partie 2'!$K$3:$K$19,0))=13,AM9,AO9),IFERROR(IF(VLOOKUP(AM9,'Partie 2'!$M$3:$Q$19,5,0)=13,AM9,AO9),IFERROR(IF(INDEX('Partie 2'!$S$3:$S$19,MATCH(AM9,'Partie 2'!$W$3:$W$19,0))=13,AM9,AO9),\"\"))))","v":9},12,2,50,20,{"$f":"IF(AT9=\"\",\"\",\"vs\")","v":"vs"},22,{"$f":"IFERROR(IF(VLOOKUP(AT9,'Partie 3'!$A$3:$E$19,5,0)=13,AT9,AV9),IFERROR(IF(INDEX('Partie 3'!$G$3:$G$19,MATCH(AT9,'Partie 3'!$K$3:$K$19,0))=13,AT9,AV9),IFERROR(IF(VLOOKUP(AT9,'Partie 3'!$M$3:$Q$19,5,0)=13,AT9,AV9),IFERROR(IF(INDEX('Partie 3'!$S$3:$S$19,MATCH(AT9,'Partie 3'!$W$3:$W$19,0))=13,AT9,AV9),\"\"))))","v":20},22,2,50,37,"vs",42,{"$f":"IFERROR(IF(VLOOKUP(BA9,'Partie 4'!$A$3:$E$19,5,0)=13,BA9,BC9),IFERROR(IF(INDEX('Partie 4'!$G$3:$G$19,MATCH(BA9,'Partie 4'!$K$3:$K$19,0))=13,BA9,BC9),IFERROR(IF(VLOOKUP(BA9,'Partie 4'!$M$3:$Q$19,5,0)=13,BA9,BC9),IFERROR(IF(INDEX('Partie 4'!$S$3:$S$19,MATCH(BA9,'Partie 4'!$W$3:$W$19,0))=13,BA9,BC9),\"\"))))","v":37},42]
[null,"C'est le n° d'équipe en J qui permet de former",null,null,null,null,null,null,"A4",4,{"$f":"J10&\"/\"&COUNTIF(J$7:J10,J10)","v":"4/1"},{"$f":"COUNTIF($J$7:J10,\">0\")","v":4},null,null,4,"A4","B4","C4",4,"A4","B4","C4",4,"A4","B4","C4",4,"A4","B4","C4",null,{"$f":"IF(ROW()-6<=$E$4/2,AF9+2,\"\")","v":7},{"$f":"IF(AF10=\"\",\"\",\"vs\")","v":"vs"},8,{"$f":"IF('Partie 1'!$E$3=\"\",\"\",IFERROR(IF(VLOOKUP(AF10,'Partie 1'!$A$3:$E$19,5,0)=13,AF10,AH10),IFERROR(IF(INDEX('Partie 1'!$G$3:$G$19,MATCH(AF10,'Partie 1'!$K$3:$K$19,0))=13,AF10,AH10),IFERROR(IF(VLOOKUP(AF10,'Partie 1'!$M$3:$Q$19,5,0)=13,AF10,AH10),IFERROR(IF(INDEX('Partie 1'!$S$3:$S$19,MATCH(AF10,'Partie 1'!$W$3:$W$19,0))=13,AF10,AH10),\"\")))))","v":8},7,{"$f":"IF(AF10=\"\",\"\",AK9+$D$5/2)","v":34},{"$f":"IF(AK10=\"\",\"\",AL8+1)","v":18},14,{"$f":"IF(AM10=\"\",\"\",\"vs\")","v":"vs"},15,{"$f":"IFERROR(IF(VLOOKUP(AM10,'Partie 2'!$A$3:$E$19,5,0)=13,AM10,AO10),IFERROR(IF(INDEX('Partie 2'!$G$3:$G$19,MATCH(AM10,'Partie 2'!$K$3:$K$19,0))=13,AM10,AO10),IFERROR(IF(VLOOKUP(AM10,'Partie 2'!$M$3:$Q$19,5,0)=13,AM10,AO10),IFERROR(IF(INDEX('Partie 2'!$S$3:$S$19,MATCH(AM10,'Partie 2'!$W$3:$W$19,0))=13,AM10,AO10),\"\"))))","v":14},15,34,18,25,{"$f":"IF(AT10=\"\",\"\",\"vs\")","v":"vs"},31,{"$f":"IFERROR(IF(VLOOKUP(AT10,'Partie 3'!$A$3:$E$19,5,0)=13,AT10,AV10),IFERROR(IF(INDEX('Partie 3'!$G$3:$G$19,MATCH(AT10,'Partie 3'!$K$3:$K$19,0))=13,AT10,AV10),IFERROR(IF(VLOOKUP(AT10,'Partie 3'!$M$3:$Q$19,5,0)=13,AT10,AV10),IFERROR(IF(INDEX('Partie 3'!$S$3:$S$19,MATCH(AT10,'Partie 3'!$W$3:$W$19,0))=13,AT10,AV10),\"\"))))","v":25},31,34,18,52,"vs",63,{"$f":"IFERROR(IF(VLOOKUP(BA10,'Partie 4'!$A$3:$E$19,5,0)=13,BA10,BC10),IFERROR(IF(INDEX('Partie 4'!$G$3:$G$19,MATCH(BA10,'Partie 4'!$K$3:$K$19,0))=13,BA10,BC10),IFERROR(IF(VLOOKUP(BA10,'Partie 4'!$M$3:$Q$19,5,0)=13,BA10,BC10),IFERROR(IF(INDEX('Partie 4'!$S$3:$S$19,MATCH(BA10,'Partie 4'!$W$3:$W$19,0))=13,BA10,BC10),\"\"))))","v":52},63]
[null,"les équipes dans les tableaux",null,null,null,null,null,null,"A5",5,{"$f":"J11&\"/\"&COUNTIF(J$7:J11,J11)","v":"5/1"},{"$f":"COUNTIF($J$7:J11,\">0\")","v":5},null,null,5,"A5","B5","C5",5,"A5","B5","C5",5,"A5","B5","C5",5,"A5","B5","C5",null,9,"vs",10,{"$f":"IF('Partie 1'!$E$3=\"\",\"\",IFERROR(IF(VLOOKUP(AF11,'Partie 1'!$A$3:$E$19,5,0)=13,AF11,AH11),IFERROR(IF(INDEX('Partie 1'!$G$3:$G$19,MATCH(AF11,'Partie 1'!$K$3:$K$19,0))=13,AF11,AH11),IFERROR(IF(VLOOKUP(AF11,'Partie 1'!$M$3:$Q$19,5,0)=13,AF11,AH11),IFERROR(IF(INDEX('Partie 1'!$S$3:$S$19,MATCH(AF11,'Partie 1'!$W$3:$W$19,0))=13,AF11,AH11),\"\")))))","v":9},10,{"$f":"IF(AF11=\"\",\"\",AK9+1)","v":3},51,17,"vs",20,{"$f":"IFERROR(IF(VLOOKUP(AM11,'Partie 2'!$A$3:$E$19,5,0)=13,AM11,AO11),IFERROR(IF(INDEX('Partie 2'!$G$3:$G$19,MATCH(AM11,'Partie 2'!$K$3:$K$19,0))=13,AM11,AO11),IFERROR(IF(VLOOKUP(AM11,'Partie 2'!$M$3:$Q$19,5,0)=13,AM11,AO11),IFERROR(IF(INDEX('Partie 2'!$S$3:$S$19,MATCH(AM11,'Partie 2'!$W$3:$W$19,0))=13,AM11,AO11),\"\"))))","v":20},17,3,51,35,"vs",37,{"$f":"IFERROR(IF(VLOOKUP(AT11,'Partie 3'!$A$3:$E$19,5,0)=13,AT11,AV11),IFERROR(IF(INDEX('Partie 3'!$G$3:$G$19,MATCH(AT11,'Partie 3'!$K$3:$K$19,0))=13,AT11,AV11),IFERROR(IF(VLOOKUP(AT11,'Partie 3'!$M$3:$Q$19,5,0)=13,AT11,AV11),IFERROR(IF(INDEX('Partie 3'!$S$3:$S$19,MATCH(AT11,'Partie 3'!$W$3:$W$19,0))=13,AT11,AV11),\"\"))))","v":37},35,3,51,5,"vs",10,{"$f":"IFERROR(IF(VLOOKUP(BA11,'Partie 4'!$A$3:$E$19,5,0)=13,BA11,BC11),IFERROR(IF(INDEX('Partie 4'!$G$3:$G$19,MATCH(BA11,'Partie 4'!$K$3:$K$19,0))=13,BA11,BC11),IFERROR(IF(VLOOKUP(BA11,'Partie 4'!$M$3:$Q$19,5,0)=13,BA11,BC11),IFERROR(IF(INDEX('Partie 4'!$S$3:$S$19,MATCH(BA11,'Partie 4'!$W$3:$W$19,0))=13,BA11,BC11),\"\"))))","v":10},5]
[null,null,null,null,null,null,null,null,"A6",6,{"$f":"J12&\"/\"&COUNTIF(J$7:J12,J12)","v":"6/1"},{"$f":"COUNTIF($J$7:J12,\">0\")","v":6},null,null,6,"A6","B6","C6",6,"A6","B6","C6",6,"A6","B6","C6",6,"A6","B6","C6",null,11,"vs",12,{"$f":"IF('Partie 1'!$E$3=\"\",\"\",IFERROR(IF(VLOOKUP(AF12,'Partie 1'!$A$3:$E$19,5,0)=13,AF12,AH12),IFERROR(IF(INDEX('Partie 1'!$G$3:$G$19,MATCH(AF12,'Partie 1'!$K$3:$K$19,0))=13,AF12,AH12),IFERROR(IF(VLOOKUP(AF12,'Partie 1'!$M$3:$Q$19,5,0)=13,AF12,AH12),IFERROR(IF(INDEX('Partie 1'!$S$3:$S$19,MATCH(AF12,'Partie 1'!$W$3:$W$19,0))=13,AF12,AH12),\"\")))))","v":12},11,{"$f":"IF(AF12=\"\",\"\",AK11+$D$5/2)","v":35},19,22,"vs",24,{"$f":"IFERROR(IF(VLOOKUP(AM12,'Partie 2'!$A$3:$E$19,5,0)=13,AM12,AO12),IFERROR(IF(INDEX('Partie 2'!$G$3:$G$19,MATCH(AM12,'Partie 2'!$K$3:$K$19,0))=13,AM12,AO12),IFERROR(IF(VLOOKUP(AM12,'Partie 2'!$M$3:$Q$19,5,0)=13,AM12,AO12),IFERROR(IF(INDEX('Partie 2'!$S$3:$S$19,MATCH(AM12,'Partie 2'!$W$3:$W$19,0))=13,AM12,AO12),\"\"))))","v":22},24,35,19,42,"vs",45,{"$f":"IFERROR(IF(VLOOKUP(AT12,'Partie 3'!$A$3:$E$19,5,0)=13,AT12,AV12),IFERROR(IF(INDEX('Partie 3'!$G$3:$G$19,MATCH(AT12,'Partie 3'!$K$3:$K$19,0))=13,AT12,AV12),IFERROR(IF(VLOOKUP(AT12,'Partie 3'!$M$3:$Q$19,5,0)=13,AT12,AV12),IFERROR(IF(INDEX('Partie 3'!$S$3:$S$19,MATCH(AT12,'Partie 3'!$W$3:$W$19,0))=13,AT12,AV12),\"\"))))","v":42},45,35,19,19,"vs",26,{"$f":"IFERROR(IF(VLOOKUP(BA12,'Partie 4'!$A$3:$E$19,5,0)=13,BA12,BC12),IFERROR(IF(INDEX('Partie 4'!$G$3:$G$19,MATCH(BA12,'Partie 4'!$K$3:$K$19,0))=13,BA12,BC12),IFERROR(IF(VLOOKUP(BA12,'Partie 4'!$M$3:$Q$19,5,0)=13,BA12,BC12),IFERROR(IF(INDEX('Partie 4'!$S$3:$S$19,MATCH(BA12,'Partie 4'!$W$3:$W$19,0))=13,BA12,BC12),\"\"))))","v":19},26]
[null,null,null,null,null,null,null,null,"A7",7,{"$f":"J13&\"/\"&COUNTIF(J$7:J13,J13)","v":"7/1"},{"$f":"COUNTIF($J$7:J13,\">0\")","v":7},null,null,7,"A7","B7","C7",7,"A7","B7","C7",7,"A7","B7","C7",7,"A7","B7","C7",null,13,"vs",14,{"$f":"IF('Partie 1'!$E$3=\"\",\"\",IFERROR(IF(VLOOKUP(AF13,'Partie 1'!$A$3:$E$19,5,0)=13,AF13,AH13),IFERROR(IF(INDEX('Partie 1'!$G$3:$G$19,MATCH(AF13,'Partie 1'!$K$3:$K$19,0))=13,AF13,AH13),IFERROR(IF(VLOOKUP(AF13,'Partie 1'!$M$3:$Q$19,5,0)=13,AF13,AH13),IFERROR(IF(INDEX('Partie 1'!$S$3:$S$19,MATCH(AF13,'Partie 1'!$W$3:$W$19,0))=13,AF13,AH13),\"\")))))","v":14},13,{"$f":"IF(AF13=\"\",\"\",AK11+1)","v":4},52,25,"vs",28,{"$f":"IFERROR(IF(VLOOKUP(AM13,'Partie 2'!$A$3:$E$19,5,0)=13,AM13,AO13),IFERROR(IF(INDEX('Partie 2'!$G$3:$G$19,MATCH(AM13,'Partie 2'!$K$3:$K$19,0))=13,AM13,AO13),IFERROR(IF(VLOOKUP(AM13,'Partie 2'!$M$3:$Q$19,5,0)=13,AM13,AO13),IFERROR(IF(INDEX('Partie 2'!$S$3:$S$19,MATCH(AM13,'Partie 2'!$W$3:$W$19,0))=13,AM13,AO13),\"\"))))","v":25},28,4,52,52,"vs",54,{"$f":"IFERROR(IF(VLOOKUP(AT13,'Partie 3'!$A$3:$E$19,5,0)=13,AT13,AV13),IFERROR(IF(INDEX('Partie 3'!$G$3:$G$19,MATCH(AT13,'Partie 3'!$K$3:$K$19,0))=13,AT13,AV13),IFERROR(IF(VLOOKUP(AT13,'Partie 3'!$M$3:$Q$19,5,0)=13,AT13,AV13),IFERROR(IF(INDEX('Partie 3'!$S$3:$S$19,MATCH(AT13,'Partie 3'!$W$3:$W$19,0))=13,AT13,AV13),\"\"))))","v":52},54,4,52,38,"vs",41,{"$f":"IFERROR(IF(VLOOKUP(BA13,'Partie 4'!$A$3:$E$19,5,0)=13,BA13,BC13),IFERROR(IF(INDEX('Partie 4'!$G$3:$G$19,MATCH(BA13,'Partie 4'!$K$3:$K$19,0))=13,BA13,BC13),IFERROR(IF(VLOOKUP(BA13,'Partie 4'!$M$3:$Q$19,5,0)=13,BA13,BC13),IFERROR(IF(INDEX('Partie 4'!$S$3:$S$19,MATCH(BA13,'Partie 4'!$W$3:$W$19,0))=13,BA13,BC13),\"\"))))","v":38},41]
[null,null,null,null,null,null,null,null,"A8",8,{"$f":"J14&\"/\"&COUNTIF(J$7:J14,J14)","v":"8/1"},{"$f":"COUNTIF($J$7:J14,\">0\")","v":8},null,null,8,"A8","B8","C8",8,"A8","B8","C8",8,"A8","B8","C8",8,"A8","B8","C8",null,15,"vs",16,{"$f":"IF('Partie 1'!$E$3=\"\",\"\",IFERROR(IF(VLOOKUP(AF14,'Partie 1'!$A$3:$E$19,5,0)=13,AF14,AH14),IFERROR(IF(INDEX('Partie 1'!$G$3:$G$19,MATCH(AF14,'Partie 1'!$K$3:$K$19,0))=13,AF14,AH14),IFERROR(IF(VLOOKUP(AF14,'Partie 1'!$M$3:$Q$19,5,0)=13,AF14,AH14),IFERROR(IF(INDEX('Partie 1'!$S$3:$S$19,MATCH(AF14,'Partie 1'!$W$3:$W$19,0))=13,AF14,AH14),\"\")))))","v":15},16,{"$f":"IF(AF14=\"\",\"\",AK13+$D$5/2)","v":36},20,30,"vs",31,{"$f":"IFERROR(IF(VLOOKUP(AM14,'Partie 2'!$A$3:$E$19,5,0)=13,AM14,AO14),IFERROR(IF(INDEX('Partie 2'!$G$3:$G$19,MATCH(AM14,'Partie 2'!$K$3:$K$19,0))=13,AM14,AO14),IFERROR(IF(VLOOKUP(AM14,'Partie 2'!$M$3:$Q$19,5,0)=13,AM14,AO14),IFERROR(IF(INDEX('Partie 2'!$S$3:$S$19,MATCH(AM14,'Partie 2'!$W$3:$W$19,0))=13,AM14,AO14),\"\"))))","v":31},30,36,20,57,"vs",63,{"$f":"IFERROR(IF(VLOOKUP(AT14,'Partie 3'!$A$3:$E$19,5,0)=13,AT14,AV14),IFERROR(IF(INDEX('Partie 3'!$G$3:$G$19,MATCH(AT14,'Partie 3'!$K$3:$K$19,0))=13,AT14,AV14),IFERROR(IF(VLOOKUP(AT14,'Partie 3'!$M$3:$Q$19,5,0)=13,AT14,AV14),IFERROR(IF(INDEX('Partie 3'!$S$3:$S$19,MATCH(AT14,'Partie 3'!$W$3:$W$19,0))=13,AT14,AV14),\"\"))))","v":63},57,36,20,51,"vs",64,{"$f":"IFERROR(IF(VLOOKUP(BA14,'Partie 4'!$A$3:$E$19,5,0)=13,BA14,BC14),IFERROR(IF(INDEX('Partie 4'!$G$3:$G$19,MATCH(BA14,'Partie 4'!$K$3:$K$19,0))=13,BA14,BC14),IFERROR(IF(VLOOKUP(BA14,'Partie 4'!$M$3:$Q$19,5,0)=13,BA14,BC14),IFERROR(IF(INDEX('Partie 4'!$S$3:$S$19,MATCH(BA14,'Partie 4'!$W$3:$W$19,0))=13,BA14,BC14),\"\"))))","v":64},51]
[null,null,null,null,null,null,null,null,"A9",9,{"$f":"J15&\"/\"&COUNTIF(J$7:J15,J15)","v":"9/1"},{"$f":"COUNTIF($J$7:J15,\">0\")","v":9},null,null,9,"A9","B9","C9",9,"A9","B9","C9",9,"A9","B9","C9",9,"A9","B9","C9",null,17,"vs",18,{"$f":"IF('Partie 1'!$E$3=\"\",\"\",IFERROR(IF(VLOOKUP(AF15,'Partie 1'!$A$3:$E$19,5,0)=13,AF15,AH15),IFERROR(IF(INDEX('Partie 1'!$G$3:$G$19,MATCH(AF15,'Partie 1'!$K$3:$K$19,0))=13,AF15,AH15),IFERROR(IF(VLOOKUP(AF15,'Partie 1'!$M$3:$Q$19,5,0)=13,AF15,AH15),IFERROR(IF(INDEX('Partie 1'!$S$3:$S$19,MATCH(AF15,'Partie 1'!$W$3:$W$19,0))=13,AF15,AH15),\"\")))))","v":17},18,{"$f":"IF(AF15=\"\",\"\",AK13+1)","v":5},53,34,"vs",35,{"$f":"IFERROR(IF(VLOOKUP(AM15,'Partie 2'!$A$3:$E$19,5,0)=13,AM15,AO15),IFERROR(IF(INDEX('Partie 2'!$G$3:$G$19,MATCH(AM15,'Partie 2'!$K$3:$K$19,0))=13,AM15,AO15),IFERROR(IF(VLOOKUP(AM15,'Partie 2'!$M$3:$Q$19,5,0)=13,AM15,AO15),IFERROR(IF(INDEX('Partie 2'!$S$3:$S$19,MATCH(AM15,'Partie 2'!$W$3:$W$19,0))=13,AM15,AO15),\"\"))))","v":35},34,5,53,3,"vs",5,{"$f":"IFERROR(IF(VLOOKUP(AT15,'Partie 3'!$A$3:$E$19,5,0)=13,AT15,AV15),IFERROR(IF(INDEX('Partie 3'!$G$3:$G$19,MATCH(AT15,'Partie 3'!$K$3:$K$19,0))=13,AT15,AV15),IFERROR(IF(VLOOKUP(AT15,'Partie 3'!$M$3:$Q$19,5,0)=13,AT15,AV15),IFERROR(IF(INDEX('Partie 3'!$S$3:$S$19,MATCH(AT15,'Partie 3'!$W$3:$W$19,0))=13,AT15,AV15),\"\"))))","v":5},3,5,53,8,"vs",12,{"$f":"IFERROR(IF(VLOOKUP(BA15,'Partie 4'!$A$3:$E$19,5,0)=13,BA15,BC15),IFERROR(IF(INDEX('Partie 4'!$G$3:$G$19,MATCH(BA15,'Partie 4'!$K$3:$K$19,0))=13,BA15,BC15),IFERROR(IF(VLOOKUP(BA15,'Partie 4'!$M$3:$Q$19,5,0)=13,BA15,BC15),IFERROR(IF(INDEX('Partie 4'!$S$3:$S$19,MATCH(BA15,'Partie 4'!$W$3:$W$19,0))=13,BA15,BC15),\"\"))))","v":12},8]
[null,null,null,null,null,null,null,null,"A10",10,{"$f":"J16&\"/\"&COUNTIF(J$7:J16,J16)","v":"10/1"},{"$f":"COUNTIF($J$7:J16,\">0\")","v":10},null,null,10,"A10","B10","C10",10,"A10","B10","C10",10,"A10","B10","C10",10,"A10","B10","C10",null,19,"vs",20,{"$f":"IF('Partie 1'!$E$3=\"\",\"\",IFERROR(IF(VLOOKUP(AF16,'Partie 1'!$A$3:$E$19,5,0)=13,AF16,AH16),IFERROR(IF(INDEX('Partie 1'!$G$3:$G$19,MATCH(AF16,'Partie 1'!$K$3:$K$19,0))=13,AF16,AH16),IFERROR(IF(VLOOKUP(AF16,'Partie 1'!$M$3:$Q$19,5,0)=13,AF16,AH16),IFERROR(IF(INDEX('Partie 1'!$S$3:$S$19,MATCH(AF16,'Partie 1'!$W$3:$W$19,0))=13,AF16,AH16),\"\")))))","v":20},19,{"$f":"IF(AF16=\"\",\"\",AK15+$D$5/2)","v":37},21,37,"vs",39,{"$f":"IFERROR(IF(VLOOKUP(AM16,'Partie 2'!$A$3:$E$19,5,0)=13,AM16,AO16),IFERROR(IF(INDEX('Partie 2'!$G$3:$G$19,MATCH(AM16,'Partie 2'!$K$3:$K$19,0))=13,AM16,AO16),IFERROR(IF(VLOOKUP(AM16,'Partie 2'!$M$3:$Q$19,5,0)=13,AM16,AO16),IFERROR(IF(INDEX('Partie 2'!$S$3:$S$19,MATCH(AM16,'Partie 2'!$W$3:$W$19,0))=13,AM16,AO16),\"\"))))","v":37},39,37,21,10,"vs",13,{"$f":"IFERROR(IF(VLOOKUP(AT16,'Partie 3'!$A$3:$E$19,5,0)=13,AT16,AV16),IFERROR(IF(INDEX('Partie 3'!$G$3:$G$19,MATCH(AT16,'Partie 3'!$K$3:$K$19,0))=13,AT16,AV16),IFERROR(IF(VLOOKUP(AT16,'Partie 3'!$M$3:$Q$19,5,0)=13,AT16,AV16),IFERROR(IF(INDEX('Partie 3'!$S$3:$S$19,MATCH(AT16,'Partie 3'!$W$3:$W$19,0))=13,AT16,AV16),\"\"))))","v":10},13,37,21,17,"vs",28,{"$f":"IFERROR(IF(VLOOKUP(BA16,'Partie 4'!$A$3:$E$19,5,0)=13,BA16,BC16),IFERROR(IF(INDEX('Partie 4'!$G$3:$G$19,MATCH(BA16,'Partie 4'!$K$3:$K$19,0))=13,BA16,BC16),IFERROR(IF(VLOOKUP(BA16,'Partie 4'!$M$3:$Q$19,5,0)=13,BA16,BC16),IFERROR(IF(INDEX('Partie 4'!$S$3:$S$19,MATCH(BA16,'Partie 4'!$W$3:$W$19,0))=13,BA16,BC16),\"\"))))","v":17},28]
[null,null,null,null,null,null,null,null,"A11",11,{"$f":"J17&\"/\"&COUNTIF(J$7:J17,J17)","v":"11/1"},{"$f":"COUNTIF($J$7:J17,\">0\")","v":11},null,null,11,"A11","B11","C11",11,"A11","B11","C11",11,"A11","B11","C11",11,"A11","B11","C11",null,21,"vs",22,{"$f":"IF('Partie 1'!$E$3=\"\",\"\",IFERROR(IF(VLOOKUP(AF17,'Partie 1'!$A$3:$E$19,5,0)=13,AF17,AH17),IFERROR(IF(INDEX('Partie 1'!$G$3:$G$19,MATCH(AF17,'Partie 1'!$K$3:$K$19,0))=13,AF17,AH17),IFERROR(IF(VLOOKUP(AF17,'Partie 1'!$M$3:$Q$19,5,0)=13,AF17,AH17),IFERROR(IF(INDEX('Partie 1'!$S$3:$S$19,MATCH(AF17,'Partie 1'!$W$3:$W$19,0))=13,AF17,AH17),\"\")))))","v":22},21,{"$f":"IF(AF17=\"\",\"\",AK15+1)","v":6},54,42,"vs",43,{"$f":"IFERROR(IF(VLOOKUP(AM17,'Partie 2'!$A$3:$E$19,5,0)=13,AM17,AO17),IFERROR(IF(INDEX('Partie 2'!$G$3:$G$19,MATCH(AM17,'Partie 2'!$K$3:$K$19,0))=13,AM17,AO17),IFERROR(IF(VLOOKUP(AM17,'Partie 2'!$M$3:$Q$19,5,0)=13,AM17,AO17),IFERROR(IF(INDEX('Partie 2'!$S$3:$S$19,MATCH(AM17,'Partie 2'!$W$3:$W$19,0))=13,AM17,AO17),\"\"))))","v":42},43,6,54,19,"vs",21,{"$f":"IFERROR(IF(VLOOKUP(AT17,'Partie 3'!$A$3:$E$19,5,0)=13,AT17,AV17),IFERROR(IF(INDEX('Partie 3'!$G$3:$G$19,MATCH(AT17,'Partie 3'!$K$3:$K$19,0))=13,AT17,AV17),IFERROR(IF(VLOOKUP(AT17,'Partie 3'!$M$3:$Q$19,5,0)=13,AT17,AV17),IFERROR(IF(INDEX('Partie 3'!$S$3:$S$19,MATCH(AT17,'Partie 3'!$W$3:$W$19,0))=13,AT17,AV17),\"\"))))","v":19},21,6,54,39,"vs",43,{"$f":"IFERROR(IF(VLOOKUP(BA17,'Partie 4'!$A$3:$E$19,5,0)=13,BA17,BC17),IFERROR(IF(INDEX('Partie 4'!$G$3:$G$19,MATCH(BA17,'Partie 4'!$K$3:$K$19,0))=13,BA17,BC17),IFERROR(IF(VLOOKUP(BA17,'Partie 4'!$M$3:$Q$19,5,0)=13,BA17,BC17),IFERROR(IF(INDEX('Partie 4'!$S$3:$S$19,MATCH(BA17,'Partie 4'!$W$3:$W$19,0))=13,BA17,BC17),\"\"))))","v":39},43]
[null,null,null,null,null,null,null,null,"A12",12,{"$f":"J18&\"/\"&COUNTIF(J$7:J18,J18)","v":"12/1"},{"$f":"COUNTIF($J$7:J18,\">0\")","v":12},null,null,12,"A12","B12","C12",12,"A12","B12","C12",12,"A12","B12","C12",12,"A12","B12","C12",null,23,"vs",24,{"$f":"IF('Partie 1'!$E$3=\"\",\"\",IFERROR(IF(VLOOKUP(AF18,'Partie 1'!$A$3:$E$19,5,0)=13,AF18,AH18),IFERROR(IF(INDEX('Partie 1'!$G$3:$G$19,MATCH(AF18,'Partie 1'!$K$3:$K$19,0))=13,AF18,AH18),IFERROR(IF(VLOOKUP(AF18,'Partie 1'!$M$3:$Q$19,5,0)=13,AF18,AH18),IFERROR(IF(INDEX('Partie 1'!$S$3:$S$19,MATCH(AF18,'Partie 1'!$W$3:$W$19,0))=13,AF18,AH18),\"\")))))","v":24},23,{"$f":"IF(AF18=\"\",\"\",AK17+$D$5/2)","v":38},22,45,"vs",48,{"$f":"IFERROR(IF(VLOOKUP(AM18,'Partie 2'!$A$3:$E$19,5,0)=13,AM18,AO18),IFERROR(IF(INDEX('Partie 2'!$G$3:$G$19,MATCH(AM18,'Partie 2'!$K$3:$K$19,0))=13,AM18,AO18),IFERROR(IF(VLOOKUP(AM18,'Partie 2'!$M$3:$Q$19,5,0)=13,AM18,AO18),IFERROR(IF(INDEX('Partie 2'!$S$3:$S$19,MATCH(AM18,'Partie 2'!$W$3:$W$19,0))=13,AM18,AO18),\"\"))))","v":45},48,38,22,26,"vs",32,{"$f":"IFERROR(IF(VLOOKUP(AT18,'Partie 3'!$A$3:$E$19,5,0)=13,AT18,AV18),IFERROR(IF(INDEX('Partie 3'!$G$3:$G$19,MATCH(AT18,'Partie 3'!$K$3:$K$19,0))=13,AT18,AV18),IFERROR(IF(VLOOKUP(AT18,'Partie 3'!$M$3:$Q$19,5,0)=13,AT18,AV18),IFERROR(IF(INDEX('Partie 3'!$S$3:$S$19,MATCH(AT18,'Partie 3'!$W$3:$W$19,0))=13,AT18,AV18),\"\"))))","v":26},32,38,22,49,"vs",62,{"$f":"IFERROR(IF(VLOOKUP(BA18,'Partie 4'!$A$3:$E$19,5,0)=13,BA18,BC18),IFERROR(IF(INDEX('Partie 4'!$G$3:$G$19,MATCH(BA18,'Partie 4'!$K$3:$K$19,0))=13,BA18,BC18),IFERROR(IF(VLOOKUP(BA18,'Partie 4'!$M$3:$Q$19,5,0)=13,BA18,BC18),IFERROR(IF(INDEX('Partie 4'!$S$3:$S$19,MATCH(BA18,'Partie 4'!$W$3:$W$19,0))=13,BA18,BC18),\"\"))))","v":49},62]
[null,null,null,null,null,null,null,null,"A13",13,{"$f":"J19&\"/\"&COUNTIF(J$7:J19,J19)","v":"13/1"},{"$f":"COUNTIF($J$7:J19,\">0\")","v":13},null,null,13,"A13","B13","C13",13,"A13","B13","C13",13,"A13","B13","C13",13,"A13","B13","C13",null,25,"vs",26,{"$f":"IF('Partie 1'!$E$3=\"\",\"\",IFERROR(IF(VLOOKUP(AF19,'Partie 1'!$A$3:$E$19,5,0)=13,AF19,AH19),IFERROR(IF(INDEX('Partie 1'!$G$3:$G$19,MATCH(AF19,'Partie 1'!$K$3:$K$19,0))=13,AF19,AH19),IFERROR(IF(VLOOKUP(AF19,'Partie 1'!$M$3:$Q$19,5,0)=13,AF19,AH19),IFERROR(IF(INDEX('Partie 1'!$S$3:$S$19,MATCH(AF19,'Partie 1'!$W$3:$W$19,0))=13,AF19,AH19),\"\")))))","v":25},26,{"$f":"IF(AF19=\"\",\"\",AK17+1)","v":7},55,49,"vs",52,{"$f":"IFERROR(IF(VLOOKUP(AM19,'Partie 2'!$A$3:$E$19,5,0)=13,AM19,AO19),IFERROR(IF(INDEX('Partie 2'!$G$3:$G$19,MATCH(AM19,'Partie 2'!$K$3:$K$19,0))=13,AM19,AO19),IFERROR(IF(VLOOKUP(AM19,'Partie 2'!$M$3:$Q$19,5,0)=13,AM19,AO19),IFERROR(IF(INDEX('Partie 2'!$S$3:$S$19,MATCH(AM19,'Partie 2'!$W$3:$W$19,0))=13,AM19,AO19),\"\"))))","v":52},49,7,55,36,"vs",38,{"$f":"IFERROR(IF(VLOOKUP(AT19,'Partie 3'!$A$3:$E$19,5,0)=13,AT19,AV19),IFERROR(IF(INDEX('Partie 3'!$G$3:$G$19,MATCH(AT19,'Partie 3'!$K$3:$K$19,0))=13,AT19,AV19),IFERROR(IF(VLOOKUP(AT19,'Partie 3'!$M$3:$Q$19,5,0)=13,AT19,AV19),IFERROR(IF(INDEX('Partie 3'!$S$3:$S$19,MATCH(AT19,'Partie 3'!$W$3:$W$19,0))=13,AT19,AV19),\"\"))))","v":38},36,7,55,7,"vs",11,{"$f":"IFERROR(IF(VLOOKUP(BA19,'Partie 4'!$A$3:$E$19,5,0)=13,BA19,BC19),IFERROR(IF(INDEX('Partie 4'!$G$3:$G$19,MATCH(BA19,'Partie 4'!$K$3:$K$19,0))=13,BA19,BC19),IFERROR(IF(VLOOKUP(BA19,'Partie 4'!$M$3:$Q$19,5,0)=13,BA19,BC19),IFERROR(IF(INDEX('Partie 4'!$S$3:$S$19,MATCH(BA19,'Partie 4'!$W$3:$W$19,0))=13,BA19,BC19),\"\"))))","v":11},7]
[null,null,null,null,null,null,null,null,"A14",14,{"$f":"J20&\"/\"&COUNTIF(J$7:J20,J20)","v":"14/1"},{"$f":"COUNTIF($J$7:J20,\">0\")","v":14},null,null,14,"A14","B14","C14",14,"A14","B14","C14",14,"A14","B14","C14",14,"A14","B14","C14",null,27,"vs",28,{"$f":"IF('Partie 1'!$E$3=\"\",\"\",IFERROR(IF(VLOOKUP(AF20,'Partie 1'!$A$3:$E$19,5,0)=13,AF20,AH20),IFERROR(IF(INDEX('Partie 1'!$G$3:$G$19,MATCH(AF20,'Partie 1'!$K$3:$K$19,0))=13,AF20,AH20),IFERROR(IF(VLOOKUP(AF20,'Partie 1'!$M$3:$Q$19,5,0)=13,AF20,AH20),IFERROR(IF(INDEX('Partie 1'!$S$3:$S$19,MATCH(AF20,'Partie 1'!$W$3:$W$19,0))=13,AF20,AH20),\"\")))))","v":28},27,{"$f":"IF(AF20=\"\",\"\",AK19+$D$5/2)","v":39},23,54,"vs",56,{"$f":"IFERROR(IF(VLOOKUP(AM20,'Partie 2'!$A$3:$E$19,5,0)=13,AM20,AO20),IFERROR(IF(INDEX('Partie 2'!$G$3:$G$19,MATCH(AM20,'Partie 2'!$K$3:$K$19,0))=13,AM20,AO20),IFERROR(IF(VLOOKUP(AM20,'Partie 2'!$M$3:$Q$19,5,0)=13,AM20,AO20),IFERROR(IF(INDEX('Partie 2'!$S$3:$S$19,MATCH(AM20,'Partie 2'!$W$3:$W$19,0))=13,AM20,AO20),\"\"))))","v":54},56,39,23,41,"vs",46,{"$f":"IFERROR(IF(VLOOKUP(AT20,'Partie 3'!$A$3:$E$19,5,0)=13,AT20,AV20),IFERROR(IF(INDEX('Partie 3'!$G$3:$G$19,MATCH(AT20,'Partie 3'!$K$3:$K$19,0))=13,AT20,AV20),IFERROR(IF(VLOOKUP(AT20,'Partie 3'!$M$3:$Q$19,5,0)=13,AT20,AV20),IFERROR(IF(INDEX('Partie 3'!$S$3:$S$19,MATCH(AT20,'Partie 3'!$W$3:$W$19,0))=13,AT20,AV20),\"\"))))","v":41},46,39,23,18,"vs",27,{"$f":"IFERROR(IF(VLOOKUP(BA20,'Partie 4'!$A$3:$E$19,5,0)=13,BA20,BC20),IFERROR(IF(INDEX('Partie 4'!$G$3:$G$19,MATCH(BA20,'Partie 4'!$K$3:$K$19,0))=13,BA20,BC20),IFERROR(IF(VLOOKUP(BA20,'Partie 4'!$M$3:$Q$19,5,0)=13,BA20,BC20),IFERROR(IF(INDEX('Partie 4'!$S$3:$S$19,MATCH(BA20,'Partie 4'!$W$3:$W$19,0))=13,BA20,BC20),\"\"))))","v":18},27]
[null,null,null,null,null,null,null,null,"A15",15,{"$f":"J21&\"/\"&COUNTIF(J$7:J21,J21)","v":"15/1"},{"$f":"COUNTIF($J$7:J21,\">0\")","v":15},null,null,15,"A15","B15","C15",15,"A15","B15","C15",15,"A15","B15","C15",15,"A15","B15","C15",null,29,"vs",30,{"$f":"IF('Partie 1'!$E$3=\"\",\"\",IFERROR(IF(VLOOKUP(AF21,'Partie 1'!$A$3:$E$19,5,0)=13,AF21,AH21),IFERROR(IF(INDEX('Partie 1'!$G$3:$G$19,MATCH(AF21,'Partie 1'!$K$3:$K$19,0))=13,AF21,AH21),IFERROR(IF(VLOOKUP(AF21,'Partie 1'!$M$3:$Q$19,5,0)=13,AF21,AH21),IFERROR(IF(INDEX('Partie 1'!$S$3:$S$19,MATCH(AF21,'Partie 1'!$W$3:$W$19,0))=13,AF21,AH21),\"\")))))","v":30},29,{"$f":"IF(AF21=\"\",\"\",AK19+1)","v":8},56,57,"vs",60,{"$f":"IFERROR(IF(VLOOKUP(AM21,'Partie 2'!$A$3:$E$19,5,0)=13,AM21,AO21),IFERROR(IF(INDEX('Partie 2'!$G$3:$G$19,MATCH(AM21,'Partie 2'!$K$3:$K$19,0))=13,AM21,AO21),IFERROR(IF(VLOOKUP(AM21,'Partie 2'!$M$3:$Q$19,5,0)=13,AM21,AO21),IFERROR(IF(INDEX('Partie 2'!$S$3:$S$19,MATCH(AM21,'Partie 2'!$W$3:$W$19,0))=13,AM21,AO21),\"\"))))","v":57},60,8,56,51,"vs",53,{"$f":"IFERROR(IF(VLOOKUP(AT21,'Partie 3'!$A$3:$E$19,5,0)=13,AT21,AV21),IFERROR(IF(INDEX('Partie 3'!$G$3:$G$19,MATCH(AT21,'Partie 3'!$K$3:$K$19,0))=13,AT21,AV21),IFERROR(IF(VLOOKUP(AT21,'Partie 3'!$M$3:$Q$19,5,0)=13,AT21,AV21),IFERROR(IF(INDEX('Partie 3'!$S$3:$S$19,MATCH(AT21,'Partie 3'!$W$3:$W$19,0))=13,AT21,AV21),\"\"))))","v":51},53,8,56,40,"vs",44,{"$f":"IFERROR(IF(VLOOKUP(BA21,'Partie 4'!$A$3:$E$19,5,0)=13,BA21,BC21),IFERROR(IF(INDEX('Partie 4'!$G$3:$G$19,MATCH(BA21,'Partie 4'!$K$3:$K$19,0))=13,BA21,BC21),IFERROR(IF(VLOOKUP(BA21,'Partie 4'!$M$3:$Q$19,5,0)=13,BA21,BC21),IFERROR(IF(INDEX('Partie 4'!$S$3:$S$19,MATCH(BA21,'Partie 4'!$W$3:$W$19,0))=13,BA21,BC21),\"\"))))","v":40},44]
[null,null,null,null,null,null,null,null,"A16",16,{"$f":"J22&\"/\"&COUNTIF(J$7:J22,J22)","v":"16/1"},{"$f":"COUNTIF($J$7:J22,\">0\")","v":16},null,null,16,"A16","B16","C16",16,"A16","B16","C16",16,"A16","B16","C16",16,"A16","B16","C16",null,31,"vs",32,{"$f":"IF('Partie 1'!$E$3=\"\",\"\",IFERROR(IF(VLOOKUP(AF22,'Partie 1'!$A$3:$E$19,5,0)=13,AF22,AH22),IFERROR(IF(INDEX('Partie 1'!$G$3:$G$19,MATCH(AF22,'Partie 1'!$K$3:$K$19,0))=13,AF22,AH22),IFERROR(IF(VLOOKUP(AF22,'Partie 1'!$M$3:$Q$19,5,0)=13,AF22,AH22),IFERROR(IF(INDEX('Partie 1'!$S$3:$S$19,MATCH(AF22,'Partie 1'!$W$3:$W$19,0))=13,AF22,AH22),\"\")))))","v":31},32,{"$f":"IF(AF22=\"\",\"\",AK21+$D$5/2)","v":40},24,62,"vs",63,{"$f":"IFERROR(IF(VLOOKUP(AM22,'Partie 2'!$A$3:$E$19,5,0)=13,AM22,AO22),IFERROR(IF(INDEX('Partie 2'!$G$3:$G$19,MATCH(AM22,'Partie 2'!$K$3:$K$19,0))=13,AM22,AO22),IFERROR(IF(VLOOKUP(AM22,'Partie 2'!$M$3:$Q$19,5,0)=13,AM22,AO22),IFERROR(IF(INDEX('Partie 2'!$S$3:$S$19,MATCH(AM22,'Partie 2'!$W$3:$W$19,0))=13,AM22,AO22),\"\"))))","v":63},62,40,24,58,"vs",64,{"$f":"IFERROR(IF(VLOOKUP(AT22,'Partie 3'!$A$3:$E$19,5,0)=13,AT22,AV22),IFERROR(IF(INDEX('Partie 3'!$G$3:$G$19,MATCH(AT22,'Partie 3'!$K$3:$K$19,0))=13,AT22,AV22),IFERROR(IF(VLOOKUP(AT22,'Partie 3'!$M$3:$Q$19,5,0)=13,AT22,AV22),IFERROR(IF(INDEX('Partie 3'!$S$3:$S$19,MATCH(AT22,'Partie 3'!$W$3:$W$19,0))=13,AT22,AV22),\"\"))))","v":64},58,40,24,50,"vs",61,{"$f":"IFERROR(IF(VLOOKUP(BA22,'Partie 4'!$A$3:$E$19,5,0)=13,BA22,BC22),IFERROR(IF(INDEX('Partie 4'!$G$3:$G$19,MATCH(BA22,'Partie 4'!$K$3:$K$19,0))=13,BA22,BC22),IFERROR(IF(VLOOKUP(BA22,'Partie 4'!$M$3:$Q$19,5,0)=13,BA22,BC22),IFERROR(IF(INDEX('Partie 4'!$S$3:$S$19,MATCH(BA22,'Partie 4'!$W$3:$W$19,0))=13,BA22,BC22),\"\"))))","v":61},50]
[null,null,null,null,null,null,null,null,"A17",17,{"$f":"J23&\"/\"&COUNTIF(J$7:J23,J23)","v":"17/1"},{"$f":"COUNTIF($J$7:J23,\">0\")","v":17},null,null,17,"A17","B17","C17",17,"A17","B17","C17",17,"A17","B17","C17",17,"A17","B17","C17",null,33,"vs",34,{"$f":"IF('Partie 1'!$E$3=\"\",\"\",IFERROR(IF(VLOOKUP(AF23,'Partie 1'!$A$3:$E$19,5,0)=13,AF23,AH23),IFERROR(IF(INDEX('Partie 1'!$G$3:$G$19,MATCH(AF23,'Partie 1'!$K$3:$K$19,0))=13,AF23,AH23),IFERROR(IF(VLOOKUP(AF23,'Partie 1'!$M$3:$Q$19,5,0)=13,AF23,AH23),IFERROR(IF(INDEX('Partie 1'!$S$3:$S$19,MATCH(AF23,'Partie 1'!$W$3:$W$19,0))=13,AF23,AH23),\"\")))))","v":34},33,{"$f":"IF(AF23=\"\",\"\",AK21+1)","v":9},57,3,"vs",2,{"$f":"IFERROR(IF(VLOOKUP(AM23,'Partie 2'!$A$3:$E$19,5,0)=13,AM23,AO23),IFERROR(IF(INDEX('Partie 2'!$G$3:$G$19,MATCH(AM23,'Partie 2'!$K$3:$K$19,0))=13,AM23,AO23),IFERROR(IF(VLOOKUP(AM23,'Partie 2'!$M$3:$Q$19,5,0)=13,AM23,AO23),IFERROR(IF(INDEX('Partie 2'!$S$3:$S$19,MATCH(AM23,'Partie 2'!$W$3:$W$19,0))=13,AM23,AO23),\"\"))))","v":3},2,9,57,8,"vs",1,{"$f":"IFERROR(IF(VLOOKUP(AT23,'Partie 3'!$A$3:$E$19,5,0)=13,AT23,AV23),IFERROR(IF(INDEX('Partie 3'!$G$3:$G$19,MATCH(AT23,'Partie 3'!$K$3:$K$19,0))=13,AT23,AV23),IFERROR(IF(VLOOKUP(AT23,'Partie 3'!$M$3:$Q$19,5,0)=13,AT23,AV23),IFERROR(IF(INDEX('Partie 3'!$S$3:$S$19,MATCH(AT23,'Partie 3'!$W$3:$W$19,0))=13,AT23,AV23),\"\"))))","v":8},1,9,57,14,"vs",4,{"$f":"IFERROR(IF(VLOOKUP(BA23,'Partie 4'!$A$3:$E$19,5,0)=13,BA23,BC23),IFERROR(IF(INDEX('Partie 4'!$G$3:$G$19,MATCH(BA23,'Partie 4'!$K$3:$K$19,0))=13,BA23,BC23),IFERROR(IF(VLOOKUP(BA23,'Partie 4'!$M$3:$Q$19,5,0)=13,BA23,BC23),IFERROR(IF(INDEX('Partie 4'!$S$3:$S$19,MATCH(BA23,'Partie 4'!$W$3:$W$19,0))=13,BA23,BC23),\"\"))))","v":14},4]
[null,null,null,null,null,null,null,null,"A18",18,{"$f":"J24&\"/\"&COUNTIF(J$7:J24,J24)","v":"18/1"},{"$f":"COUNTIF($J$7:J24,\">0\")","v":18},null,null,18,"A18","B18","C18",18,"A18","B18","C18",18,"A18","B18","C18",18,"A18","B18","C18",null,35,"vs",36,{"$f":"IF('Partie 1'!$E$3=\"\",\"\",IFERROR(IF(VLOOKUP(AF24,'Partie 1'!$A$3:$E$19,5,0)=13,AF24,AH24),IFERROR(IF(INDEX('Partie 1'!$G$3:$G$19,MATCH(AF24,'Partie 1'!$K$3:$K$19,0))=13,AF24,AH24),IFERROR(IF(VLOOKUP(AF24,'Partie 1'!$M$3:$Q$19,5,0)=13,AF24,AH24),IFERROR(IF(INDEX('Partie 1'!$S$3:$S$19,MATCH(AF24,'Partie 1'!$W$3:$W$19,0))=13,AF24,AH24),\"\")))))","v":35},36,{"$f":"IF(AF24=\"\",\"\",AK23+$D$5/2)","v":41},25,7,"vs",5,{"$f":"IFERROR(IF(VLOOKUP(AM24,'Partie 2'!$A$3:$E$19,5,0)=13,AM24,AO24),IFERROR(IF(INDEX('Partie 2'!$G$3:$G$19,MATCH(AM24,'Partie 2'!$K$3:$K$19,0))=13,AM24,AO24),IFERROR(IF(VLOOKUP(AM24,'Partie 2'!$M$3:$Q$19,5,0)=13,AM24,AO24),IFERROR(IF(INDEX('Partie 2'!$S$3:$S$19,MATCH(AM24,'Partie 2'!$W$3:$W$19,0))=13,AM24,AO24),\"\"))))","v":5},7,41,25,15,"vs",12,{"$f":"IFERROR(IF(VLOOKUP(AT24,'Partie 3'!$A$3:$E$19,5,0)=13,AT24,AV24),IFERROR(IF(INDEX('Partie 3'!$G$3:$G$19,MATCH(AT24,'Partie 3'!$K$3:$K$19,0))=13,AT24,AV24),IFERROR(IF(VLOOKUP(AT24,'Partie 3'!$M$3:$Q$19,5,0)=13,AT24,AV24),IFERROR(IF(INDEX('Partie 3'!$S$3:$S$19,MATCH(AT24,'Partie 3'!$W$3:$W$19,0))=13,AT24,AV24),\"\"))))","v":12},15,41,25,31,"vs",22,{"$f":"IFERROR(IF(VLOOKUP(BA24,'Partie 4'!$A$3:$E$19,5,0)=13,BA24,BC24),IFERROR(IF(INDEX('Partie 4'!$G$3:$G$19,MATCH(BA24,'Partie 4'!$K$3:$K$19,0))=13,BA24,BC24),IFERROR(IF(VLOOKUP(BA24,'Partie 4'!$M$3:$Q$19,5,0)=13,BA24,BC24),IFERROR(IF(INDEX('Partie 4'!$S$3:$S$19,MATCH(BA24,'Partie 4'!$W$3:$W$19,0))=13,BA24,BC24),\"\"))))","v":22},31]
[null,null,null,null,null,null,null,null,"A19",19,{"$f":"J25&\"/\"&COUNTIF(J$7:J25,J25)","v":"19/1"},{"$f":"COUNTIF($J$7:J25,\">0\")","v":19},null,null,19,"A19","B19","C19",19,"A19","B19","C19",19,"A19","B19","C19",19,"A19","B19","C19",null,37,"vs",38,{"$f":"IF('Partie 1'!$E$3=\"\",\"\",IFERROR(IF(VLOOKUP(AF25,'Partie 1'!$A$3:$E$19,5,0)=13,AF25,AH25),IFERROR(IF(INDEX('Partie 1'!$G$3:$G$19,MATCH(AF25,'Partie 1'!$K$3:$K$19,0))=13,AF25,AH25),IFERROR(IF(VLOOKUP(AF25,'Partie 1'!$M$3:$Q$19,5,0)=13,AF25,AH25),IFERROR(IF(INDEX('Partie 1'!$S$3:$S$19,MATCH(AF25,'Partie 1'!$W$3:$W$19,0))=13,AF25,AH25),\"\")))))","v":37},38,{"$f":"IF(AF25=\"\",\"\",AK23+1)","v":10},58,11,"vs",10,{"$f":"IFERROR(IF(VLOOKUP(AM25,'Partie 2'!$A$3:$E$19,5,0)=13,AM25,AO25),IFERROR(IF(INDEX('Partie 2'!$G$3:$G$19,MATCH(AM25,'Partie 2'!$K$3:$K$19,0))=13,AM25,AO25),IFERROR(IF(VLOOKUP(AM25,'Partie 2'!$M$3:$Q$19,5,0)=13,AM25,AO25),IFERROR(IF(INDEX('Partie 2'!$S$3:$S$19,MATCH(AM25,'Partie 2'!$W$3:$W$19,0))=13,AM25,AO25),\"\"))))","v":10},11,10,58,24,"vs",17,{"$f":"IFERROR(IF(VLOOKUP(AT25,'Partie 3'!$A$3:$E$19,5,0)=13,AT25,AV25),IFERROR(IF(INDEX('Partie 3'!$G$3:$G$19,MATCH(AT25,'Partie 3'!$K$3:$K$19,0))=13,AT25,AV25),IFERROR(IF(VLOOKUP(AT25,'Partie 3'!$M$3:$Q$19,5,0)=13,AT25,AV25),IFERROR(IF(INDEX('Partie 3'!$S$3:$S$19,MATCH(AT25,'Partie 3'!$W$3:$W$19,0))=13,AT25,AV25),\"\"))))","v":17},24,10,58,45,"vs",35,{"$f":"IFERROR(IF(VLOOKUP(BA25,'Partie 4'!$A$3:$E$19,5,0)=13,BA25,BC25),IFERROR(IF(INDEX('Partie 4'!$G$3:$G$19,MATCH(BA25,'Partie 4'!$K$3:$K$19,0))=13,BA25,BC25),IFERROR(IF(VLOOKUP(BA25,'Partie 4'!$M$3:$Q$19,5,0)=13,BA25,BC25),IFERROR(IF(INDEX('Partie 4'!$S$3:$S$19,MATCH(BA25,'Partie 4'!$W$3:$W$19,0))=13,BA25,BC25),\"\"))))","v":35},45]
[null,null,null,null,null,null,null,null,"A20",20,{"$f":"J26&\"/\"&COUNTIF(J$7:J26,J26)","v":"20/1"},{"$f":"COUNTIF($J$7:J26,\">0\")","v":20},null,null,20,"A20","B20","C20",20,"A20","B20","C20",20,"A20","B20","C20",20,"A20","B20","C20",null,39,"vs",40,{"$f":"IF('Partie 1'!$E$3=\"\",\"\",IFERROR(IF(VLOOKUP(AF26,'Partie 1'!$A$3:$E$19,5,0)=13,AF26,AH26),IFERROR(IF(INDEX('Partie 1'!$G$3:$G$19,MATCH(AF26,'Partie 1'!$K$3:$K$19,0))=13,AF26,AH26),IFERROR(IF(VLOOKUP(AF26,'Partie 1'!$M$3:$Q$19,5,0)=13,AF26,AH26),IFERROR(IF(INDEX('Partie 1'!$S$3:$S$19,MATCH(AF26,'Partie 1'!$W$3:$W$19,0))=13,AF26,AH26),\"\")))))","v":39},40,{"$f":"IF(AF26=\"\",\"\",AK25+$D$5/2)","v":42},26,16,"vs",13,{"$f":"IFERROR(IF(VLOOKUP(AM26,'Partie 2'!$A$3:$E$19,5,0)=13,AM26,AO26),IFERROR(IF(INDEX('Partie 2'!$G$3:$G$19,MATCH(AM26,'Partie 2'!$K$3:$K$19,0))=13,AM26,AO26),IFERROR(IF(VLOOKUP(AM26,'Partie 2'!$M$3:$Q$19,5,0)=13,AM26,AO26),IFERROR(IF(INDEX('Partie 2'!$S$3:$S$19,MATCH(AM26,'Partie 2'!$W$3:$W$19,0))=13,AM26,AO26),\"\"))))","v":13},16,42,26,30,"vs",28,{"$f":"IFERROR(IF(VLOOKUP(AT26,'Partie 3'!$A$3:$E$19,5,0)=13,AT26,AV26),IFERROR(IF(INDEX('Partie 3'!$G$3:$G$19,MATCH(AT26,'Partie 3'!$K$3:$K$19,0))=13,AT26,AV26),IFERROR(IF(VLOOKUP(AT26,'Partie 3'!$M$3:$Q$19,5,0)=13,AT26,AV26),IFERROR(IF(INDEX('Partie 3'!$S$3:$S$19,MATCH(AT26,'Partie 3'!$W$3:$W$19,0))=13,AT26,AV26),\"\"))))","v":28},30,42,26,57,"vs",54,{"$f":"IFERROR(IF(VLOOKUP(BA26,'Partie 4'!$A$3:$E$19,5,0)=13,BA26,BC26),IFERROR(IF(INDEX('Partie 4'!$G$3:$G$19,MATCH(BA26,'Partie 4'!$K$3:$K$19,0))=13,BA26,BC26),IFERROR(IF(VLOOKUP(BA26,'Partie 4'!$M$3:$Q$19,5,0)=13,BA26,BC26),IFERROR(IF(INDEX('Partie 4'!$S$3:$S$19,MATCH(BA26,'Partie 4'!$W$3:$W$19,0))=13,BA26,BC26),\"\"))))","v":54},57]
[null,null,null,null,null,null,null,null,"A21",21,{"$f":"J27&\"/\"&COUNTIF(J$7:J27,J27)","v":"21/1"},{"$f":"COUNTIF($J$7:J27,\">0\")","v":21},null,null,21,"A21","B21","C21",21,"A21","B21","C21",21,"A21","B21","C21",21,"A21","B21","C21",null,41,"vs",42,{"$f":"IF('Partie 1'!$E$3=\"\",\"\",IFERROR(IF(VLOOKUP(AF27,'Partie 1'!$A$3:$E$19,5,0)=13,AF27,AH27),IFERROR(IF(INDEX('Partie 1'!$G$3:$G$19,MATCH(AF27,'Partie 1'!$K$3:$K$19,0))=13,AF27,AH27),IFERROR(IF(VLOOKUP(AF27,'Partie 1'!$M$3:$Q$19,5,0)=13,AF27,AH27),IFERROR(IF(INDEX('Partie 1'!$S$3:$S$19,MATCH(AF27,'Partie 1'!$W$3:$W$19,0))=13,AF27,AH27),\"\")))))","v":42},41,{"$f":"IF(AF27=\"\",\"\",AK25+1)","v":11},59,19,"vs",18,{"$f":"IFERROR(IF(VLOOKUP(AM27,'Partie 2'!$A$3:$E$19,5,0)=13,AM27,AO27),IFERROR(IF(INDEX('Partie 2'!$G$3:$G$19,MATCH(AM27,'Partie 2'!$K$3:$K$19,0))=13,AM27,AO27),IFERROR(IF(VLOOKUP(AM27,'Partie 2'!$M$3:$Q$19,5,0)=13,AM27,AO27),IFERROR(IF(INDEX('Partie 2'!$S$3:$S$19,MATCH(AM27,'Partie 2'!$W$3:$W$19,0))=13,AM27,AO27),\"\"))))","v":19},18,11,59,39,"vs",34,{"$f":"IFERROR(IF(VLOOKUP(AT27,'Partie 3'!$A$3:$E$19,5,0)=13,AT27,AV27),IFERROR(IF(INDEX('Partie 3'!$G$3:$G$19,MATCH(AT27,'Partie 3'!$K$3:$K$19,0))=13,AT27,AV27),IFERROR(IF(VLOOKUP(AT27,'Partie 3'!$M$3:$Q$19,5,0)=13,AT27,AV27),IFERROR(IF(INDEX('Partie 3'!$S$3:$S$19,MATCH(AT27,'Partie 3'!$W$3:$W$19,0))=13,AT27,AV27),\"\"))))","v":39},34,11,59,13,"vs",3,{"$f":"IFERROR(IF(VLOOKUP(BA27,'Partie 4'!$A$3:$E$19,5,0)=13,BA27,BC27),IFERROR(IF(INDEX('Partie 4'!$G$3:$G$19,MATCH(BA27,'Partie 4'!$K$3:$K$19,0))=13,BA27,BC27),IFERROR(IF(VLOOKUP(BA27,'Partie 4'!$M$3:$Q$19,5,0)=13,BA27,BC27),IFERROR(IF(INDEX('Partie 4'!$S$3:$S$19,MATCH(BA27,'Partie 4'!$W$3:$W$19,0))=13,BA27,BC27),\"\"))))","v":13},3]
[null,null,null,null,null,null,null,null,"A22",22,{"$f":"J28&\"/\"&COUNTIF(J$7:J28,J28)","v":"22/1"},{"$f":"COUNTIF($J$7:J28,\">0\")","v":22},null,null,22,"A22","B22","C22",22,"A22","B22","C22",22,"A22","B22","C22",22,"A22","B22","C22",null,43,"vs",44,{"$f":"IF('Partie 1'!$E$3=\"\",\"\",IFERROR(IF(VLOOKUP(AF28,'Partie 1'!$A$3:$E$19,5,0)=13,AF28,AH28),IFERROR(IF(INDEX('Partie 1'!$G$3:$G$19,MATCH(AF28,'Partie 1'!$K$3:$K$19,0))=13,AF28,AH28),IFERROR(IF(VLOOKUP(AF28,'Partie 1'!$M$3:$Q$19,5,0)=13,AF28,AH28),IFERROR(IF(INDEX('Partie 1'!$S$3:$S$19,MATCH(AF28,'Partie 1'!$W$3:$W$19,0))=13,AF28,AH28),\"\")))))","v":43},44,{"$f":"IF(AF28=\"\",\"\",AK27+$D$5/2)","v":43},27,23,"vs",21,{"$f":"IFERROR(IF(VLOOKUP(AM28,'Partie 2'!$A$3:$E$19,5,0)=13,AM28,AO28),IFERROR(IF(INDEX('Partie 2'!$G$3:$G$19,MATCH(AM28,'Partie 2'!$K$3:$K$19,0))=13,AM28,AO28),IFERROR(IF(VLOOKUP(AM28,'Partie 2'!$M$3:$Q$19,5,0)=13,AM28,AO28),IFERROR(IF(INDEX('Partie 2'!$S$3:$S$19,MATCH(AM28,'Partie 2'!$W$3:$W$19,0))=13,AM28,AO28),\"\"))))","v":21},23,43,27,48,"vs",43,{"$f":"IFERROR(IF(VLOOKUP(AT28,'Partie 3'!$A$3:$E$19,5,0)=13,AT28,AV28),IFERROR(IF(INDEX('Partie 3'!$G$3:$G$19,MATCH(AT28,'Partie 3'!$K$3:$K$19,0))=13,AT28,AV28),IFERROR(IF(VLOOKUP(AT28,'Partie 3'!$M$3:$Q$19,5,0)=13,AT28,AV28),IFERROR(IF(INDEX('Partie 3'!$S$3:$S$19,MATCH(AT28,'Partie 3'!$W$3:$W$19,0))=13,AT28,AV28),\"\"))))","v":43},48,43,27,32,"vs",21,{"$f":"IFERROR(IF(VLOOKUP(BA28,'Partie 4'!$A$3:$E$19,5,0)=13,BA28,BC28),IFERROR(IF(INDEX('Partie 4'!$G$3:$G$19,MATCH(BA28,'Partie 4'!$K$3:$K$19,0))=13,BA28,BC28),IFERROR(IF(VLOOKUP(BA28,'Partie 4'!$M$3:$Q$19,5,0)=13,BA28,BC28),IFERROR(IF(INDEX('Partie 4'!$S$3:$S$19,MATCH(BA28,'Partie 4'!$W$3:$W$19,0))=13,BA28,BC28),\"\"))))","v":21},32]
[null,null,null,null,null,null,null,null,"A23",23,{"$f":"J29&\"/\"&COUNTIF(J$7:J29,J29)","v":"23/1"},{"$f":"COUNTIF($J$7:J29,\">0\")","v":23},null,null,23,"A23","B23","C23",23,"A23","B23","C23",23,"A23","B23","C23",23,"A23","B23","C23",null,45,"vs",46,{"$f":"IF('Partie 1'!$E$3=\"\",\"\",IFERROR(IF(VLOOKUP(AF29,'Partie 1'!$A$3:$E$19,5,0)=13,AF29,AH29),IFERROR(IF(INDEX('Partie 1'!$G$3:$G$19,MATCH(AF29,'Partie 1'!$K$3:$K$19,0))=13,AF29,AH29),IFERROR(IF(VLOOKUP(AF29,'Partie 1'!$M$3:$Q$19,5,0)=13,AF29,AH29),IFERROR(IF(INDEX('Partie 1'!$S$3:$S$19,MATCH(AF29,'Partie 1'!$W$3:$W$19,0))=13,AF29,AH29),\"\")))))","v":45},46,{"$f":"IF(AF29=\"\",\"\",AK27+1)","v":12},60,27,"vs",26,{"$f":"IFERROR(IF(VLOOKUP(AM29,'Partie 2'!$A$3:$E$19,5,0)=13,AM29,AO29),IFERROR(IF(INDEX('Partie 2'!$G$3:$G$19,MATCH(AM29,'Partie 2'!$K$3:$K$19,0))=13,AM29,AO29),IFERROR(IF(VLOOKUP(AM29,'Partie 2'!$M$3:$Q$19,5,0)=13,AM29,AO29),IFERROR(IF(INDEX('Partie 2'!$S$3:$S$19,MATCH(AM29,'Partie 2'!$W$3:$W$19,0))=13,AM29,AO29),\"\"))))","v":26},27,12,60,56,"vs",49,{"$f":"IFERROR(IF(VLOOKUP(AT29,'Partie 3'!$A$3:$E$19,5,0)=13,AT29,AV29),IFERROR(IF(INDEX('Partie 3'!$G$3:$G$19,MATCH(AT29,'Partie 3'!$K$3:$K$19,0))=13,AT29,AV29),IFERROR(IF(VLOOKUP(AT29,'Partie 3'!$M$3:$Q$19,5,0)=13,AT29,AV29),IFERROR(IF(INDEX('Partie 3'!$S$3:$S$19,MATCH(AT29,'Partie 3'!$W$3:$W$19,0))=13,AT29,AV29),\"\"))))","v":49},56,12,60,46,"vs",36,{"$f":"IFERROR(IF(VLOOKUP(BA29,'Partie 4'!$A$3:$E$19,5,0)=13,BA29,BC29),IFERROR(IF(INDEX('Partie 4'!$G$3:$G$19,MATCH(BA29,'Partie 4'!$K$3:$K$19,0))=13,BA29,BC29),IFERROR(IF(VLOOKUP(BA29,'Partie 4'!$M$3:$Q$19,5,0)=13,BA29,BC29),IFERROR(IF(INDEX('Partie 4'!$S$3:$S$19,MATCH(BA29,'Partie 4'!$W$3:$W$19,0))=13,BA29,BC29),\"\"))))","v":36},46]
[null,null,null,null,null,null,null,null,"A24",24,{"$f":"J30&\"/\"&COUNTIF(J$7:J30,J30)","v":"24/1"},{"$f":"COUNTIF($J$7:J30,\">0\")","v":24},null,null,24,"A24","B24","C24",24,"A24","B24","C24",24,"A24","B24","C24",24,"A24","B24","C24",null,47,"vs",48,{"$f":"IF('Partie 1'!$E$3=\"\",\"\",IFERROR(IF(VLOOKUP(AF30,'Partie 1'!$A$3:$E$19,5,0)=13,AF30,AH30),IFERROR(IF(INDEX('Partie 1'!$G$3:$G$19,MATCH(AF30,'Partie 1'!$K$3:$K$19,0))=13,AF30,AH30),IFERROR(IF(VLOOKUP(AF30,'Partie 1'!$M$3:$Q$19,5,0)=13,AF30,AH30),IFERROR(IF(INDEX('Partie 1'!$S$3:$S$19,MATCH(AF30,'Partie 1'!$W$3:$W$19,0))=13,AF30,AH30),\"\")))))","v":48},47,{"$f":"IF(AF30=\"\",\"\",AK29+$D$5/2)","v":44},28,32,"vs",29,{"$f":"IFERROR(IF(VLOOKUP(AM30,'Partie 2'!$A$3:$E$19,5,0)=13,AM30,AO30),IFERROR(IF(INDEX('Partie 2'!$G$3:$G$19,MATCH(AM30,'Partie 2'!$K$3:$K$19,0))=13,AM30,AO30),IFERROR(IF(VLOOKUP(AM30,'Partie 2'!$M$3:$Q$19,5,0)=13,AM30,AO30),IFERROR(IF(INDEX('Partie 2'!$S$3:$S$19,MATCH(AM30,'Partie 2'!$W$3:$W$19,0))=13,AM30,AO30),\"\"))))","v":32},29,44,28,62,"vs",60,{"$f":"IFERROR(IF(VLOOKUP(AT30,'Partie 3'!$A$3:$E$19,5,0)=13,AT30,AV30),IFERROR(IF(INDEX('Partie 3'!$G$3:$G$19,MATCH(AT30,'Partie 3'!$K$3:$K$19,0))=13,AT30,AV30),IFERROR(IF(VLOOKUP(AT30,'Partie 3'!$M$3:$Q$19,5,0)=13,AT30,AV30),IFERROR(IF(INDEX('Partie 3'!$S$3:$S$19,MATCH(AT30,'Partie 3'!$W$3:$W$19,0))=13,AT30,AV30),\"\"))))","v":62},60,44,28,58,"vs",53,{"$f":"IFERROR(IF(VLOOKUP(BA30,'Partie 4'!$A$3:$E$19,5,0)=13,BA30,BC30),IFERROR(IF(INDEX('Partie 4'!$G$3:$G$19,MATCH(BA30,'Partie 4'!$K$3:$K$19,0))=13,BA30,BC30),IFERROR(IF(VLOOKUP(BA30,'Partie 4'!$M$3:$Q$19,5,0)=13,BA30,BC30),IFERROR(IF(INDEX('Partie 4'!$S$3:$S$19,MATCH(BA30,'Partie 4'!$W$3:$W$19,0))=13,BA30,BC30),\"\"))))","v":58},53]
[null,null,null,null,null,null,null,null,"A25",25,{"$f":"J31&\"/\"&COUNTIF(J$7:J31,J31)","v":"25/1"},{"$f":"COUNTIF($J$7:J31,\">0\")","v":25},null,null,25,"A25","B25","C25",25,"A25","B25","C25",25,"A25","B25","C25",25,"A25","B25","C25",null,49,"vs",50,{"$f":"IF('Partie 1'!$E$3=\"\",\"\",IFERROR(IF(VLOOKUP(AF31,'Partie 1'!$A$3:$E$19,5,0)=13,AF31,AH31),IFERROR(IF(INDEX('Partie 1'!$G$3:$G$19,MATCH(AF31,'Partie 1'!$K$3:$K$19,0))=13,AF31,AH31),IFERROR(IF(VLOOKUP(AF31,'Partie 1'!$M$3:$Q$19,5,0)=13,AF31,AH31),IFERROR(IF(INDEX('Partie 1'!$S$3:$S$19,MATCH(AF31,'Partie 1'!$W$3:$W$19,0))=13,AF31,AH31),\"\")))))","v":49},50,{"$f":"IF(AF31=\"\",\"\",AK29+1)","v":13},61,36,"vs",33,{"$f":"IFERROR(IF(VLOOKUP(AM31,'Partie 2'!$A$3:$E$19,5,0)=13,AM31,AO31),IFERROR(IF(INDEX('Partie 2'!$G$3:$G$19,MATCH(AM31,'Partie 2'!$K$3:$K$19,0))=13,AM31,AO31),IFERROR(IF(VLOOKUP(AM31,'Partie 2'!$M$3:$Q$19,5,0)=13,AM31,AO31),IFERROR(IF(INDEX('Partie 2'!$S$3:$S$19,MATCH(AM31,'Partie 2'!$W$3:$W$19,0))=13,AM31,AO31),\"\"))))","v":36},33,13,61,7,"vs",2,{"$f":"IFERROR(IF(VLOOKUP(AT31,'Partie 3'!$A$3:$E$19,5,0)=13,AT31,AV31),IFERROR(IF(INDEX('Partie 3'!$G$3:$G$19,MATCH(AT31,'Partie 3'!$K$3:$K$19,0))=13,AT31,AV31),IFERROR(IF(VLOOKUP(AT31,'Partie 3'!$M$3:$Q$19,5,0)=13,AT31,AV31),IFERROR(IF(INDEX('Partie 3'!$S$3:$S$19,MATCH(AT31,'Partie 3'!$W$3:$W$19,0))=13,AT31,AV31),\"\"))))","v":7},2,13,61,15,"vs",1,{"$f":"IFERROR(IF(VLOOKUP(BA31,'Partie 4'!$A$3:$E$19,5,0)=13,BA31,BC31),IFERROR(IF(INDEX('Partie 4'!$G$3:$G$19,MATCH(BA31,'Partie 4'!$K$3:$K$19,0))=13,BA31,BC31),IFERROR(IF(VLOOKUP(BA31,'Partie 4'!$M$3:$Q$19,5,0)=13,BA31,BC31),IFERROR(IF(INDEX('Partie 4'!$S$3:$S$19,MATCH(BA31,'Partie 4'!$W$3:$W$19,0))=13,BA31,BC31),\"\"))))","v":15},1]
[null,null,null,null,null,null,null,null,"A26",26,{"$f":"J32&\"/\"&COUNTIF(J$7:J32,J32)","v":"26/1"},{"$f":"COUNTIF($J$7:J32,\">0\")","v":26},null,null,26,"A26","B26","C26",26,"A26","B26","C26",26,"A26","B26","C26",26,"A26","B26","C26",null,51,"vs",52,{"$f":"IF('Partie 1'!$E$3=\"\",\"\",IFERROR(IF(VLOOKUP(AF32,'Partie 1'!$A$3:$E$19,5,0)=13,AF32,AH32),IFERROR(IF(INDEX('Partie 1'!$G$3:$G$19,MATCH(AF32,'Partie 1'!$K$3:$K$19,0))=13,AF32,AH32),IFERROR(IF(VLOOKUP(AF32,'Partie 1'!$M$3:$Q$19,5,0)=13,AF32,AH32),IFERROR(IF(INDEX('Partie 1'!$S$3:$S$19,MATCH(AF32,'Partie 1'!$W$3:$W$19,0))=13,AF32,AH32),\"\")))))","v":52},51,{"$f":"IF(AF32=\"\",\"\",AK31+$D$5/2)","v":45},29,40,"vs",38,{"$f":"IFERROR(IF(VLOOKUP(AM32,'Partie 2'!$A$3:$E$19,5,0)=13,AM32,AO32),IFERROR(IF(INDEX('Partie 2'!$G$3:$G$19,MATCH(AM32,'Partie 2'!$K$3:$K$19,0))=13,AM32,AO32),IFERROR(IF(VLOOKUP(AM32,'Partie 2'!$M$3:$Q$19,5,0)=13,AM32,AO32),IFERROR(IF(INDEX('Partie 2'!$S$3:$S$19,MATCH(AM32,'Partie 2'!$W$3:$W$19,0))=13,AM32,AO32),\"\"))))","v":38},40,45,29,16,"vs",11,{"$f":"IFERROR(IF(VLOOKUP(AT32,'Partie 3'!$A$3:$E$19,5,0)=13,AT32,AV32),IFERROR(IF(INDEX('Partie 3'!$G$3:$G$19,MATCH(AT32,'Partie 3'!$K$3:$K$19,0))=13,AT32,AV32),IFERROR(IF(VLOOKUP(AT32,'Partie 3'!$M$3:$Q$19,5,0)=13,AT32,AV32),IFERROR(IF(INDEX('Partie 3'!$S$3:$S$19,MATCH(AT32,'Partie 3'!$W$3:$W$19,0))=13,AT32,AV32),\"\"))))","v":11},16,45,29,30,"vs",24,{"$f":"IFERROR(IF(VLOOKUP(BA32,'Partie 4'!$A$3:$E$19,5,0)=13,BA32,BC32),IFERROR(IF(INDEX('Partie 4'!$G$3:$G$19,MATCH(BA32,'Partie 4'!$K$3:$K$19,0))=13,BA32,BC32),IFERROR(IF(VLOOKUP(BA32,'Partie 4'!$M$3:$Q$19,5,0)=13,BA32,BC32),IFERROR(IF(INDEX('Partie 4'!$S$3:$S$19,MATCH(BA32,'Partie 4'!$W$3:$W$19,0))=13,BA32,BC32),\"\"))))","v":24},30]
[null,null,null,null,null,null,null,null,"A27",27,{"$f":"J33&\"/\"&COUNTIF(J$7:J33,J33)","v":"27/1"},{"$f":"COUNTIF($J$7:J33,\">0\")","v":27},null,null,27,"A27","B27","C27",27,"A27","B27","C27",27,"A27","B27","C27",27,"A27","B27","C27",null,53,"vs",54,{"$f":"IF('Partie 1'!$E$3=\"\",\"\",IFERROR(IF(VLOOKUP(AF33,'Partie 1'!$A$3:$E$19,5,0)=13,AF33,AH33),IFERROR(IF(INDEX('Partie 1'!$G$3:$G$19,MATCH(AF33,'Partie 1'!$K$3:$K$19,0))=13,AF33,AH33),IFERROR(IF(VLOOKUP(AF33,'Partie 1'!$M$3:$Q$19,5,0)=13,AF33,AH33),IFERROR(IF(INDEX('Partie 1'!$S$3:$S$19,MATCH(AF33,'Partie 1'!$W$3:$W$19,0))=13,AF33,AH33),\"\")))))","v":54},53,{"$f":"IF(AF33=\"\",\"\",AK31+1)","v":14},62,44,"vs",41,{"$f":"IFERROR(IF(VLOOKUP(AM33,'Partie 2'!$A$3:$E$19,5,0)=13,AM33,AO33),IFERROR(IF(INDEX('Partie 2'!$G$3:$G$19,MATCH(AM33,'Partie 2'!$K$3:$K$19,0))=13,AM33,AO33),IFERROR(IF(VLOOKUP(AM33,'Partie 2'!$M$3:$Q$19,5,0)=13,AM33,AO33),IFERROR(IF(INDEX('Partie 2'!$S$3:$S$19,MATCH(AM33,'Partie 2'!$W$3:$W$19,0))=13,AM33,AO33),\"\"))))","v":41},44,14,62,23,"vs",18,{"$f":"IFERROR(IF(VLOOKUP(AT33,'Partie 3'!$A$3:$E$19,5,0)=13,AT33,AV33),IFERROR(IF(INDEX('Partie 3'!$G$3:$G$19,MATCH(AT33,'Partie 3'!$K$3:$K$19,0))=13,AT33,AV33),IFERROR(IF(VLOOKUP(AT33,'Partie 3'!$M$3:$Q$19,5,0)=13,AT33,AV33),IFERROR(IF(INDEX('Partie 3'!$S$3:$S$19,MATCH(AT33,'Partie 3'!$W$3:$W$19,0))=13,AT33,AV33),\"\"))))","v":18},23,14,62,48,"vs",34,{"$f":"IFERROR(IF(VLOOKUP(BA33,'Partie 4'!$A$3:$E$19,5,0)=13,BA33,BC33),IFERROR(IF(INDEX('Partie 4'!$G$3:$G$19,MATCH(BA33,'Partie 4'!$K$3:$K$19,0))=13,BA33,BC33),IFERROR(IF(VLOOKUP(BA33,'Partie 4'!$M$3:$Q$19,5,0)=13,BA33,BC33),IFERROR(IF(INDEX('Partie 4'!$S$3:$S$19,MATCH(BA33,'Partie 4'!$W$3:$W$19,0))=13,BA33,BC33),\"\"))))","v":34},48]
[null,null,null,null,null,null,null,null,"A28",28,{"$f":"J34&\"/\"&COUNTIF(J$7:J34,J34)","v":"28/1"},{"$f":"COUNTIF($J$7:J34,\">0\")","v":28},null,null,28,"A28","B28","C28",28,"A28","B28","C28",28,"A28","B28","C28",28,"A28","B28","C28",null,55,"vs",56,{"$f":"IF('Partie 1'!$E$3=\"\",\"\",IFERROR(IF(VLOOKUP(AF34,'Partie 1'!$A$3:$E$19,5,0)=13,AF34,AH34),IFERROR(IF(INDEX('Partie 1'!$G$3:$G$19,MATCH(AF34,'Partie 1'!$K$3:$K$19,0))=13,AF34,AH34),IFERROR(IF(VLOOKUP(AF34,'Partie 1'!$M$3:$Q$19,5,0)=13,AF34,AH34),IFERROR(IF(INDEX('Partie 1'!$S$3:$S$19,MATCH(AF34,'Partie 1'!$W$3:$W$19,0))=13,AF34,AH34),\"\")))))","v":56},55,{"$f":"IF(AF34=\"\",\"\",AK33+$D$5/2)","v":46},30,47,"vs",46,{"$f":"IFERROR(IF(VLOOKUP(AM34,'Partie 2'!$A$3:$E$19,5,0)=13,AM34,AO34),IFERROR(IF(INDEX('Partie 2'!$G$3:$G$19,MATCH(AM34,'Partie 2'!$K$3:$K$19,0))=13,AM34,AO34),IFERROR(IF(VLOOKUP(AM34,'Partie 2'!$M$3:$Q$19,5,0)=13,AM34,AO34),IFERROR(IF(INDEX('Partie 2'!$S$3:$S$19,MATCH(AM34,'Partie 2'!$W$3:$W$19,0))=13,AM34,AO34),\"\"))))","v":46},47,46,30,29,"vs",27,{"$f":"IFERROR(IF(VLOOKUP(AT34,'Partie 3'!$A$3:$E$19,5,0)=13,AT34,AV34),IFERROR(IF(INDEX('Partie 3'!$G$3:$G$19,MATCH(AT34,'Partie 3'!$K$3:$K$19,0))=13,AT34,AV34),IFERROR(IF(VLOOKUP(AT34,'Partie 3'!$M$3:$Q$19,5,0)=13,AT34,AV34),IFERROR(IF(INDEX('Partie 3'!$S$3:$S$19,MATCH(AT34,'Partie 3'!$W$3:$W$19,0))=13,AT34,AV34),\"\"))))","v":27},29,46,30,60,"vs",56,{"$f":"IFERROR(IF(VLOOKUP(BA34,'Partie 4'!$A$3:$E$19,5,0)=13,BA34,BC34),IFERROR(IF(INDEX('Partie 4'!$G$3:$G$19,MATCH(BA34,'Partie 4'!$K$3:$K$19,0))=13,BA34,BC34),IFERROR(IF(VLOOKUP(BA34,'Partie 4'!$M$3:$Q$19,5,0)=13,BA34,BC34),IFERROR(IF(INDEX('Partie 4'!$S$3:$S$19,MATCH(BA34,'Partie 4'!$W$3:$W$19,0))=13,BA34,BC34),\"\"))))","v":56},60]
[null,null,null,null,null,null,null,null,"A29",29,{"$f":"J35&\"/\"&COUNTIF(J$7:J35,J35)","v":"29/1"},{"$f":"COUNTIF($J$7:J35,\">0\")","v":29},null,null,29,"A29","B29","C29",29,"A29","B29","C29",29,"A29","B29","C29",29,"A29","B29","C29",null,57,"vs",58,{"$f":"IF('Partie 1'!$E$3=\"\",\"\",IFERROR(IF(VLOOKUP(AF35,'Partie 1'!$A$3:$E$19,5,0)=13,AF35,AH35),IFERROR(IF(INDEX('Partie 1'!$G$3:$G$19,MATCH(AF35,'Partie 1'!$K$3:$K$19,0))=13,AF35,AH35),IFERROR(IF(VLOOKUP(AF35,'Partie 1'!$M$3:$Q$19,5,0)=13,AF35,AH35),IFERROR(IF(INDEX('Partie 1'!$S$3:$S$19,MATCH(AF35,'Partie 1'!$W$3:$W$19,0))=13,AF35,AH35),\"\")))))","v":57},58,{"$f":"IF(AF35=\"\",\"\",AK33+1)","v":15},63,51,"vs",50,{"$f":"IFERROR(IF(VLOOKUP(AM35,'Partie 2'!$A$3:$E$19,5,0)=13,AM35,AO35),IFERROR(IF(INDEX('Partie 2'!$G$3:$G$19,MATCH(AM35,'Partie 2'!$K$3:$K$19,0))=13,AM35,AO35),IFERROR(IF(VLOOKUP(AM35,'Partie 2'!$M$3:$Q$19,5,0)=13,AM35,AO35),IFERROR(IF(INDEX('Partie 2'!$S$3:$S$19,MATCH(AM35,'Partie 2'!$W$3:$W$19,0))=13,AM35,AO35),\"\"))))","v":51},50,15,63,40,"vs",33,{"$f":"IFERROR(IF(VLOOKUP(AT35,'Partie 3'!$A$3:$E$19,5,0)=13,AT35,AV35),IFERROR(IF(INDEX('Partie 3'!$G$3:$G$19,MATCH(AT35,'Partie 3'!$K$3:$K$19,0))=13,AT35,AV35),IFERROR(IF(VLOOKUP(AT35,'Partie 3'!$M$3:$Q$19,5,0)=13,AT35,AV35),IFERROR(IF(INDEX('Partie 3'!$S$3:$S$19,MATCH(AT35,'Partie 3'!$W$3:$W$19,0))=13,AT35,AV35),\"\"))))","v":40},33,15,63,16,"vs",2,{"$f":"IFERROR(IF(VLOOKUP(BA35,'Partie 4'!$A$3:$E$19,5,0)=13,BA35,BC35),IFERROR(IF(INDEX('Partie 4'!$G$3:$G$19,MATCH(BA35,'Partie 4'!$K$3:$K$19,0))=13,BA35,BC35),IFERROR(IF(VLOOKUP(BA35,'Partie 4'!$M$3:$Q$19,5,0)=13,BA35,BC35),IFERROR(IF(INDEX('Partie 4'!$S$3:$S$19,MATCH(BA35,'Partie 4'!$W$3:$W$19,0))=13,BA35,BC35),\"\"))))","v":16},2]
[null,null,null,null,null,null,null,null,"A30",30,{"$f":"J36&\"/\"&COUNTIF(J$7:J36,J36)","v":"30/1"},{"$f":"COUNTIF($J$7:J36,\">0\")","v":30},null,null,30,"A30","B30","C30",30,"A30","B30","C30",30,"A30","B30","C30",30,"A30","B30","C30",null,59,"vs",60,{"$f":"IF('Partie 1'!$E$3=\"\",\"\",IFERROR(IF(VLOOKUP(AF36,'Partie 1'!$A$3:$E$19,5,0)=13,AF36,AH36),IFERROR(IF(INDEX('Partie 1'!$G$3:$G$19,MATCH(AF36,'Partie 1'!$K$3:$K$19,0))=13,AF36,AH36),IFERROR(IF(VLOOKUP(AF36,'Partie 1'!$M$3:$Q$19,5,0)=13,AF36,AH36),IFERROR(IF(INDEX('Partie 1'!$S$3:$S$19,MATCH(AF36,'Partie 1'!$W$3:$W$19,0))=13,AF36,AH36),\"\")))))","v":60},59,{"$f":"IF(AF36=\"\",\"\",AK35+$D$5/2)","v":47},31,55,"vs",53,{"$f":"IFERROR(IF(VLOOKUP(AM36,'Partie 2'!$A$3:$E$19,5,0)=13,AM36,AO36),IFERROR(IF(INDEX('Partie 2'!$G$3:$G$19,MATCH(AM36,'Partie 2'!$K$3:$K$19,0))=13,AM36,AO36),IFERROR(IF(VLOOKUP(AM36,'Partie 2'!$M$3:$Q$19,5,0)=13,AM36,AO36),IFERROR(IF(INDEX('Partie 2'!$S$3:$S$19,MATCH(AM36,'Partie 2'!$W$3:$W$19,0))=13,AM36,AO36),\"\"))))","v":53},55,47,31,47,"vs",44,{"$f":"IFERROR(IF(VLOOKUP(AT36,'Partie 3'!$A$3:$E$19,5,0)=13,AT36,AV36),IFERROR(IF(INDEX('Partie 3'!$G$3:$G$19,MATCH(AT36,'Partie 3'!$K$3:$K$19,0))=13,AT36,AV36),IFERROR(IF(VLOOKUP(AT36,'Partie 3'!$M$3:$Q$19,5,0)=13,AT36,AV36),IFERROR(IF(INDEX('Partie 3'!$S$3:$S$19,MATCH(AT36,'Partie 3'!$W$3:$W$19,0))=13,AT36,AV36),\"\"))))","v":44},47,47,31,29,"vs",23,{"$f":"IFERROR(IF(VLOOKUP(BA36,'Partie 4'!$A$3:$E$19,5,0)=13,BA36,BC36),IFERROR(IF(INDEX('Partie 4'!$G$3:$G$19,MATCH(BA36,'Partie 4'!$K$3:$K$19,0))=13,BA36,BC36),IFERROR(IF(VLOOKUP(BA36,'Partie 4'!$M$3:$Q$19,5,0)=13,BA36,BC36),IFERROR(IF(INDEX('Partie 4'!$S$3:$S$19,MATCH(BA36,'Partie 4'!$W$3:$W$19,0))=13,BA36,BC36),\"\"))))","v":23},29]
[null,null,null,null,null,null,null,null,"A31",31,{"$f":"J37&\"/\"&COUNTIF(J$7:J37,J37)","v":"31/1"},{"$f":"COUNTIF($J$7:J37,\">0\")","v":31},null,null,31,"A31","B31","C31",31,"A31","B31","C31",31,"A31","B31","C31",31,"A31","B31","C31",null,61,"vs",62,{"$f":"IF('Partie 1'!$E$3=\"\",\"\",IFERROR(IF(VLOOKUP(AF37,'Partie 1'!$A$3:$E$19,5,0)=13,AF37,AH37),IFERROR(IF(INDEX('Partie 1'!$G$3:$G$19,MATCH(AF37,'Partie 1'!$K$3:$K$19,0))=13,AF37,AH37),IFERROR(IF(VLOOKUP(AF37,'Partie 1'!$M$3:$Q$19,5,0)=13,AF37,AH37),IFERROR(IF(INDEX('Partie 1'!$S$3:$S$19,MATCH(AF37,'Partie 1'!$W$3:$W$19,0))=13,AF37,AH37),\"\")))))","v":62},61,{"$f":"IF(AF37=\"\",\"\",AK35+1)","v":16},64,59,"vs",58,{"$f":"IFERROR(IF(VLOOKUP(AM37,'Partie 2'!$A$3:$E$19,5,0)=13,AM37,AO37),IFERROR(IF(INDEX('Partie 2'!$G$3:$G$19,MATCH(AM37,'Partie 2'!$K$3:$K$19,0))=13,AM37,AO37),IFERROR(IF(VLOOKUP(AM37,'Partie 2'!$M$3:$Q$19,5,0)=13,AM37,AO37),IFERROR(IF(INDEX('Partie 2'!$S$3:$S$19,MATCH(AM37,'Partie 2'!$W$3:$W$19,0))=13,AM37,AO37),\"\"))))","v":58},59,16,64,55,"vs",50,{"$f":"IFERROR(IF(VLOOKUP(AT37,'Partie 3'!$A$3:$E$19,5,0)=13,AT37,AV37),IFERROR(IF(INDEX('Partie 3'!$G$3:$G$19,MATCH(AT37,'Partie 3'!$K$3:$K$19,0))=13,AT37,AV37),IFERROR(IF(VLOOKUP(AT37,'Partie 3'!$M$3:$Q$19,5,0)=13,AT37,AV37),IFERROR(IF(INDEX('Partie 3'!$S$3:$S$19,MATCH(AT37,'Partie 3'!$W$3:$W$19,0))=13,AT37,AV37),\"\"))))","v":50},55,16,64,47,"vs",33,{"$f":"IFERROR(IF(VLOOKUP(BA37,'Partie 4'!$A$3:$E$19,5,0)=13,BA37,BC37),IFERROR(IF(INDEX('Partie 4'!$G$3:$G$19,MATCH(BA37,'Partie 4'!$K$3:$K$19,0))=13,BA37,BC37),IFERROR(IF(VLOOKUP(BA37,'Partie 4'!$M$3:$Q$19,5,0)=13,BA37,BC37),IFERROR(IF(INDEX('Partie 4'!$S$3:$S$19,MATCH(BA37,'Partie 4'!$W$3:$W$19,0))=13,BA37,BC37),\"\"))))","v":33},47]
[null,null,null,null,null,null,null,null,"A32",32,{"$f":"J38&\"/\"&COUNTIF(J$7:J38,J38)","v":"32/1"},{"$f":"COUNTIF($J$7:J38,\">0\")","v":32},null,null,32,"A32","B32","C32",32,"A32","B32","C32",32,"A32","B32","C32",32,"A32","B32","C32",null,63,"vs",64,{"$f":"IF('Partie 1'!$E$3=\"\",\"\",IFERROR(IF(VLOOKUP(AF38,'Partie 1'!$A$3:$E$19,5,0)=13,AF38,AH38),IFERROR(IF(INDEX('Partie 1'!$G$3:$G$19,MATCH(AF38,'Partie 1'!$K$3:$K$19,0))=13,AF38,AH38),IFERROR(IF(VLOOKUP(AF38,'Partie 1'!$M$3:$Q$19,5,0)=13,AF38,AH38),IFERROR(IF(INDEX('Partie 1'!$S$3:$S$19,MATCH(AF38,'Partie 1'!$W$3:$W$19,0))=13,AF38,AH38),\"\")))))","v":63},64,{"$f":"IF(AF38=\"\",\"\",AK37+$D$5/2)","v":48},32,64,"vs",61,{"$f":"IFERROR(IF(VLOOKUP(AM38,'Partie 2'!$A$3:$E$19,5,0)=13,AM38,AO38),IFERROR(IF(INDEX('Partie 2'!$G$3:$G$19,MATCH(AM38,'Partie 2'!$K$3:$K$19,0))=13,AM38,AO38),IFERROR(IF(VLOOKUP(AM38,'Partie 2'!$M$3:$Q$19,5,0)=13,AM38,AO38),IFERROR(IF(INDEX('Partie 2'!$S$3:$S$19,MATCH(AM38,'Partie 2'!$W$3:$W$19,0))=13,AM38,AO38),\"\"))))","v":64},61,48,32,61,"vs",59,{"$f":"IFERROR(IF(VLOOKUP(AT38,'Partie 3'!$A$3:$E$19,5,0)=13,AT38,AV38),IFERROR(IF(INDEX('Partie 3'!$G$3:$G$19,MATCH(AT38,'Partie 3'!$K$3:$K$19,0))=13,AT38,AV38),IFERROR(IF(VLOOKUP(AT38,'Partie 3'!$M$3:$Q$19,5,0)=13,AT38,AV38),IFERROR(IF(INDEX('Partie 3'!$S$3:$S$19,MATCH(AT38,'Partie 3'!$W$3:$W$19,0))=13,AT38,AV38),\"\"))))","v":61},59,48,32,59,"vs",55,{"$f":"IFERROR(IF(VLOOKUP(BA38,'Partie 4'!$A$3:$E$19,5,0)=13,BA38,BC38),IFERROR(IF(INDEX('Partie 4'!$G$3:$G$19,MATCH(BA38,'Partie 4'!$K$3:$K$19,0))=13,BA38,BC38),IFERROR(IF(VLOOKUP(BA38,'Partie 4'!$M$3:$Q$19,5,0)=13,BA38,BC38),IFERROR(IF(INDEX('Partie 4'!$S$3:$S$19,MATCH(BA38,'Partie 4'!$W$3:$W$19,0))=13,BA38,BC38),\"\"))))","v":59},55]
[null,null,null,null,null,null,null,null,"A33",33,{"$f":"J39&\"/\"&COUNTIF(J$7:J39,J39)","v":"33/1"},{"$f":"COUNTIF($J$7:J39,\">0\")","v":33},null,null,33,"A33","B33","C33",33,"A33","B33","C33",33,"A33","B33","C33",33,"A33","B33","C33"]
[null,null,null,null,null,null,null,null,"A34",34,{"$f":"J40&\"/\"&COUNTIF(J$7:J40,J40)","v":"34/1"},{"$f":"COUNTIF($J$7:J40,\">0\")","v":34},null,null,34,"A34","B34","C34",34,"A34","B34","C34",34,"A34","B34","C34",34,"A34","B34","C34"]
[null,null,null,null,null,null,null,null,"A35",35,{"$f":"J41&\"/\"&COUNTIF(J$7:J41,J41)","v":"35/1"},{"$f":"COUNTIF($J$7:J41,\">0\")","v":35},null,null,35,"A35","B35","C35",35,"A35","B35","C35",35,"A35","B35","C35",35,"A35","B35","C35"]
[null,null,null,null,null,null,null,null,"A36",36,{"$f":"J42&\"/\"&COUNTIF(J$7:J42,J42)","v":"36/1"},{"$f":"COUNTIF($J$7:J42,\">0\")","v":36},null,null,36,"A36","B36","C36",36,"A36","B36","C36",36,"A36","B36","C36",36,"A36","B36","C36"]
[null,null,null,null,null,null,null,null,"A37",37,{"$f":"J43&\"/\"&COUNTIF(J$7:J43,J43)","v":"37/1"},{"$f":"COUNTIF($J$7:J43,\">0\")","v":37},null,null,37,"A37","B37","C37",37,"A37","B37","C37",37,"A37","B37","C37",37,"A37","B37","C37"]
[null,null,null,null,null,null,null,null,"A38",38,{"$f":"J44&\"/\"&COUNTIF(J$7:J44,J44)","v":"38/1"},{"$f":"COUNTIF($J$7:J44,\">0\")","v":38},null,null,38,"A38","B38","C38",38,"A38","B38","C38",38,"A38","B38","C38",38,"A38","B38","C38"]
[null,null,null,null,null,null,null,null,"A39",39,{"$f":"J45&\"/\"&COUNTIF(J$7:J45,J45)","v":"39/1"},{"$f":"COUNTIF($J$7:J45,\">0\")","v":39},null,null,39,"A39","B39","C39",39,"A39","B39","C39",39,"A39","B39","C39",39,"A39","B39","C39"]
[null,null,null,null,null,null,null,null,"A40",40,{"$f":"J46&\"/\"&COUNTIF(J$7:J46,J46)","v":"40/1"},{"$f":"COUNTIF($J$7:J46,\">0\")","v":40},null,null,40,"A40","B40","C40",40,"A40","B40","C40",40,"A40","B40","C40",40,"A40","B40","C40"]
[null,null,null,null,null,null,null,null,"A41",41,{"$f":"J47&\"/\"&COUNTIF(J$7:J47,J47)","v":"41/1"},{"$f":"COUNTIF($J$7:J47,\">0\")","v":41},null,null,41,"A41","B41","C41",41,"A41","B41","C41",41,"A41","B41","C41",41,"A41","B41","C41"]
[null,null,null,null,null,null,null,null,"A42",42,{"$f":"J48&\"/\"&COUNTIF(J$7:J48,J48)","v":"42/1"},{"$f":"COUNTIF($J$7:J48,\">0\")","v":42},null,null,42,"A42","B42","C42",42,"A42","B42","C42",42,"A42","B42","C42",42,"A42","B42","C42"]
[null,null,null,null,null,null,null,null,"A43",43,{"$f":"J49&\"/\"&COUNTIF(J$7:J49,J49)","v":"43/1"},{"$f":"COUNTIF($J$7:J49,\">0\")","v":43},null,null,43,"A43","B43","C43",43,"A43","B43","C43",43,"A43","B43","C43",43,"A43","B43","C43"]
[null,null,null,null,null,null,null,null,"A44",44,{"$f":"J50&\"/\"&COUNTIF(J$7:J50,J50)","v":"44/1"},{"$f":"COUNTIF($J$7:J50,\">0\")","v":44},null,null,44,"A44","B44","C44",44,"A44","B44","C44",44,"A44","B44","C44",44,"A44","B44","C44"]
[null,null,null,null,null,null,null,null,"A45",45,{"$f":"J51&\"/\"&COUNTIF(J$7:J51,J51)","v":"45/1"},{"$f":"COUNTIF($J$7:J51,\">0\")","v":45},null,null,45,"A45","B45","C45",45,"A45","B45","C45",45,"A45","B45","C45",45,"A45","B45","C45"]
[null,null,null,null,null,null,null,null,"A46",46,{"$f":"J52&\"/\"&COUNTIF(J$7:J52,J52)","v":"46/1"},{"$f":"COUNTIF($J$7:J52,\">0\")","v":46},null,null,46,"A46","B46","C46",46,"A46","B46","C46",46,"A46","B46","C46",46,"A46","B46","C46"]
[null,null,null,null,null,null,null,null,"A47",47,{"$f":"J53&\"/\"&COUNTIF(J$7:J53,J53)","v":"47/1"},{"$f":"COUNTIF($J$7:J53,\">0\")","v":47},null,null,47,"A47","B47","C47",47,"A47","B47","C47",47,"A47","B47","C47",47,"A47","B47","C47"]
[null,null,null,null,null,null,null,null,"A48",48,{"$f":"J54&\"/\"&COUNTIF(J$7:J54,J54)","v":"48/1"},{"$f":"COUNTIF($J$7:J54,\">0\")","v":48},null,null,48,"A48","B48","C48",48,"A48","B48","C48",48,"A48","B48","C48",48,"A48","B48","C48"]
[null,null,null,null,null,null,null,null,"A49",49,{"$f":"J55&\"/\"&COUNTIF(J$7:J55,J55)","v":"49/1"},{"$f":"COUNTIF($J$7:J55,\">0\")","v":49},null,null,49,"A49","B49","C49",49,"A49","B49","C49",49,"A49","B49","C49",49,"A49","B49","C49"]
[null,null,null,null,null,null,null,null,"A50",50,{"$f":"J56&\"/\"&COUNTIF(J$7:J56,J56)","v":"50/1"},{"$f":"COUNTIF($J$7:J56,\">0\")","v":50},null,null,50,"A50","B50","C50",50,"A50","B50","C50",50,"A50","B50","C50",50,"A50","B50","C50"]
[null,null,null,null,null,null,null,null,"A51",51,{"$f":"J57&\"/\"&COUNTIF(J$7:J57,J57)","v":"51/1"},{"$f":"COUNTIF($J$7:J57,\">0\")","v":51},null,null,51,"A51","B51","C51",51,"A51","B51","C51",51,"A51","B51","C51",51,"A51","B51","C51"]
[null,null,null,null,null,null,null,null,"A52",52,{"$f":"J58&\"/\"&COUNTIF(J$7:J58,J58)","v":"52/1"},{"$f":"COUNTIF($J$7:J58,\">0\")","v":52},null,null,52,"A52","B52","C52",52,"A52","B52","C52",52,"A52","B52","C52",52,"A52","B52","C52"]
[null,null,null,null,null,null,null,null,"A53",53,{"$f":"J59&\"/\"&COUNTIF(J$7:J59,J59)","v":"53/1"},{"$f":"COUNTIF($J$7:J59,\">0\")","v":53},null,null,53,"A53","B53","C53",53,"A53","B53","C53",53,"A53","B53","C53",53,"A53","B53","C53"]
[null,null,null,null,null,null,null,null,"A54",54,{"$f":"J60&\"/\"&COUNTIF(J$7:J60,J60)","v":"54/1"},{"$f":"COUNTIF($J$7:J60,\">0\")","v":54},null,null,54,"A54","B54","C54",54,"A54","B54","C54",54,"A54","B54","C54",54,"A54","B54","C54"]
[null,null,null,null,null,null,null,null,"A55",55,{"$f":"J61&\"/\"&COUNTIF(J$7:J61,J61)","v":"55/1"},{"$f":"COUNTIF($J$7:J61,\">0\")","v":55},null,null,55,"A55","B55","C55",55,"A55","B55","C55",55,"A55","B55","C55",55,"A55","B55","C55"]
[null,null,null,null,null,null,null,null,"A56",56,{"$f":"J62&\"/\"&COUNTIF(J$7:J62,J62)","v":"56/1"},{"$f":"COUNTIF($J$7:J62,\">0\")","v":56},null,null,56,"A56","B56","C56",56,"A56","B56","C56",56,"A56","B56","C56",56,"A56","B56","C56"]
[null,null,null,null,null,null,null,null,"A57",57,{"$f":"J63&\"/\"&COUNTIF(J$7:J63,J63)","v":"57/1"},{"$f":"COUNTIF($J$7:J63,\">0\")","v":57},null,null,57,"A57","B57","C57",57,"A57","B57","C57",57,"A57","B57","C57",57,"A57","B57","C57"]
[null,null,null,null,null,null,null,null,"A58",58,{"$f":"J64&\"/\"&COUNTIF(J$7:J64,J64)","v":"58/1"},{"$f":"COUNTIF($J$7:J64,\">0\")","v":58},null,null,58,"A58","B58","C58",58,"A58","B58","C58",58,"A58","B58","C58",58,"A58","B58","C58"]
[null,null,null,null,null,null,null,null,"A59",59,{"$f":"J65&\"/\"&COUNTIF(J$7:J65,J65)","v":"59/1"},{"$f":"COUNTIF($J$7:J65,\">0\")","v":59},null,null,59,"A59","B59","C59",59,"A59","B59","C59",59,"A59","B59","C59",59,"A59","B59","C59"]
[null,null,null,null,null,null,null,null,"A60",60,{"$f":"J66&\"/\"&COUNTIF(J$7:J66,J66)","v":"60/1"},{"$f":"COUNTIF($J$7:J66,\">0\")","v":60},null,null,60,"A60","B60","C60",60,"A60","B60","C60",60,"A60","B60","C60",60,"A60","B60","C60"]
[null,null,null,null,null,null,null,null,"A61",61,{"$f":"J67&\"/\"&COUNTIF(J$7:J67,J67)","v":"61/1"},{"$f":"COUNTIF($J$7:J67,\">0\")","v":61},null,null,61,"A61","B61","C61",61,"A61","B61","C61",61,"A61","B61","C61",61,"A61","B61","C61"]
[null,null,null,null,null,null,null,null,"A62",62,{"$f":"J68&\"/\"&COUNTIF(J$7:J68,J68)","v":"62/1"},{"$f":"COUNTIF($J$7:J68,\">0\")","v":62},null,null,62,"A62","B62","C62",62,"A62","B62","C62",62,"A62","B62","C62",62,"A62","B62","C62"]
[null,null,null,null,null,null,null,null,"A63",63,{"$f":"J69&\"/\"&COUNTIF(J$7:J69,J69)","v":"63/1"},{"$f":"COUNTIF($J$7:J69,\">0\")","v":63},null,null,63,"A63","B63","C63",63,"A63","B63","C63",63,"A63","B63","C63",63,"A63","B63","C63"]
[null,null,null,null,null,null,null,null,"A64",64,{"$f":"J70&\"/\"&COUNTIF(J$7:J70,J70)","v":"64/1"},{"$f":"COUNTIF($J$7:J70,\">0\")","v":64},null,null,64,"A64","B64","C64",64,"A64","B64","C64",64,"A64","B64","C64",64,"A64","B64","C64"]
[null,null,null,null,null,null,null,null,"B1",1,{"$f":"J71&\"/\"&COUNTIF(J$7:J71,J71)","v":"1/2"},{"$f":"COUNTIF($J$7:J71,\">0\")","v":65}]
[null,null,null,null,null,null,null,null,"B2",2,{"$f":"J72&\"/\"&COUNTIF(J$7:J72,J72)","v":"2/2"},{"$f":"COUNTIF($J$7:J72,\">0\")","v":66}]
[null,null,null,null,null,null,null,null,"B3",3,{"$f":"J73&\"/\"&COUNTIF(J$7:J73,J73)","v":"3/2"},{"$f":"COUNTIF($J$7:J73,\">0\")","v":67}]
[null,null,null,null,null,null,null,null,"B4",4,{"$f":"J74&\"/\"&COUNTIF(J$7:J74,J74)","v":"4/2"},{"$f":"COUNTIF($J$7:J74,\">0\")","v":68}]
[null,null,null,null,null,null,null,null,"B5",5,{"$f":"J75&\"/\"&COUNTIF(J$7:J75,J75)","v":"5/2"},{"$f":"COUNTIF($J$7:J75,\">0\")","v":69}]
[null,null,null,null,null,null,null,null,"B6",6,{"$f":"J76&\"/\"&COUNTIF(J$7:J76,J76)","v":"6/2"},{"$f":"COUNTIF($J$7:J76,\">0\")","v":70}]
[null,null,null,null,null,null,null,null,"B7",7,{"$f":"J77&\"/\"&COUNTIF(J$7:J77,J77)","v":"7/2"},{"$f":"COUNTIF($J$7:J77,\">0\")","v":71}]
[null,null,null,null,null,null,null,null,"B8",8,{"$f":"J78&\"/\"&COUNTIF(J$7:J78,J78)","v":"8/2"},{"$f":"COUNTIF($J$7:J78,\">0\")","v":72}]
[null,null,null,null,null,null,null,null,"B9",9,{"$f":"J79&\"/\"&COUNTIF(J$7:J79,J79)","v":"9/2"},{"$f":"COUNTIF($J$7:J79,\">0\")","v":73}]
[null,null,null,null,null,null,null,null,"B10",10,{"$f":"J80&\"/\"&COUNTIF(J$7:J80,J80)","v":"10/2"},{"$f":"COUNTIF($J$7:J80,\">0\")","v":74}]
[null,null,null,null,null,null,null,null,"B11",11,{"$f":"J81&\"/\"&COUNTIF(J$7:J81,J81)","v":"11/2"},{"$f":"COUNTIF($J$7:J81,\">0\")","v":75}]
[null,null,null,null,null,null,null,null,"B12",12,{"$f":"J82&\"/\"&COUNTIF(J$7:J82,J82)","v":"12/2"},{"$f":"COUNTIF($J$7:J82,\">0\")","v":76}]
[null,null,null,null,null,null,null,null,"B13",13,{"$f":"J83&\"/\"&COUNTIF(J$7:J83,J83)","v":"13/2"},{"$f":"COUNTIF($J$7:J83,\">0\")","v":77}]
[null,null,null,null,null,null,null,null,"B14",14,{"$f":"J84&\"/\"&COUNTIF(J$7:J84,J84)","v":"14/2"},{"$f":"COUNTIF($J$7:J84,\">0\")","v":78}]
[null,null,null,null,null,null,null,null,"B15",15,{"$f":"J85&\"/\"&COUNTIF(J$7:J85,J85)","v":"15/2"},{"$f":"COUNTIF($J$7:J85,\">0\")","v":79}]
[null,null,null,null,null,null,null,null,"B16",16,{"$f":"J86&\"/\"&COUNTIF(J$7:J86,J86)","v":"16/2"},{"$f":"COUNTIF($J$7:J86,\">0\")","v":80}]
[null,null,null,null,null,null,null,null,"B17",17,{"$f":"J87&\"/\"&COUNTIF(J$7:J87,J87)","v":"17/2"},{"$f":"COUNTIF($J$7:J87,\">0\")","v":81}]
[null,null,null,null,null,null,null,null,"B18",18,{"$f":"J88&\"/\"&COUNTIF(J$7:J88,J88)","v":"18/2"},{"$f":"COUNTIF($J$7:J88,\">0\")","v":82}]
[null,null,null,null,null,null,null,null,"B19",19,{"$f":"J89&\"/\"&COUNTIF(J$7:J89,J89)","v":"19/2"},{"$f":"COUNTIF($J$7:J89,\">0\")","v":83}]
[null,null,null,null,null,null,null,null,"B20",20,{"$f":"J90&\"/\"&COUNTIF(J$7:J90,J90)","v":"20/2"},{"$f":"COUNTIF($J$7:J90,\">0\")","v":84}]
[null,null,null,null,null,null,null,null,"B21",21,{"$f":"J91&\"/\"&COUNTIF(J$7:J91,J91)","v":"21/2"},{"$f":"COUNTIF($J$7:J91,\">0\")","v":85}]
[null,null,null,null,null,null,null,null,"B22",22,{"$f":"J92&\"/\"&COUNTIF(J$7:J92,J92)","v":"22/2"},{"$f":"COUNTIF($J$7:J92,\">0\")","v":86}]
[null,null,null,null,null,null,null,null,"B23",23,{"$f":"J93&\"/\"&COUNTIF(J$7:J93,J93)","v":"23/2"},{"$f":"COUNTIF($J$7:J93,\">0\")","v":87}]
[null,null,null,null,null,null,null,null,"B24",24,{"$f":"J94&\"/\"&COUNTIF(J$7:J94,J94)","v":"24/2"},{"$f":"COUNTIF($J$7:J94,\">0\")","v":88}]
[null,null,null,null,null,null,null,null,"B25",25,{"$f":"J95&\"/\"&COUNTIF(J$7:J95,J95)","v":"25/2"},{"$f":"COUNTIF($J$7:J95,\">0\")","v":89}]
[null,null,null,null,null,null,null,null,"B26",26,{"$f":"J96&\"/\"&COUNTIF(J$7:J96,J96)","v":"26/2"},{"$f":"COUNTIF($J$7:J96,\">0\")","v":90}]
[null,null,null,null,null,null,null,null,"B27",27,{"$f":"J97&\"/\"&COUNTIF(J$7:J97,J97)","v":"27/2"},{"$f":"COUNTIF($J$7:J97,\">0\")","v":91}]
[null,null,null,null,null,null,null,null,"B28",28,{"$f":"J98&\"/\"&COUNTIF(J$7:J98,J98)","v":"28/2"},{"$f":"COUNTIF($J$7:J98,\">0\")","v":92}]
[null,null,null,null,null,null,null,null,"B29",29,{"$f":"J99&\"/\"&COUNTIF(J$7:J99,J99)","v":"29/2"},{"$f":"COUNTIF($J$7:J99,\">0\")","v":93}]
[null,null,null,null,null,null,null,null,"B30",30,{"$f":"J100&\"/\"&COUNTIF(J$7:J100,J100)","v":"30/2"},{"$f":"COUNTIF($J$7:J100,\">0\")","v":94}]
[null,null,null,null,null,null,null,null,"B31",31,{"$f":"J101&\"/\"&COUNTIF(J$7:J101,J101)","v":"31/2"},{"$f":"COUNTIF($J$7:J101,\">0\")","v":95}]
[null,null,null,null,null,null,null,null,"B32",32,{"$f":"J102&\"/\"&COUNTIF(J$7:J102,J102)","v":"32/2"},{"$f":"COUNTIF($J$7:J102,\">0\")","v":96}]
[null,null,null,null,null,null,null,null,"B33",33,{"$f":"J103&\"/\"&COUNTIF(J$7:J103,J103)","v":"33/2"},{"$f":"COUNTIF($J$7:J103,\">0\")","v":97}]
[null,null,null,null,null,null,null,null,"B34",34,{"$f":"J104&\"/\"&COUNTIF(J$7:J104,J104)","v":"34/2"},{"$f":"COUNTIF($J$7:J104,\">0\")","v":98}]
[null,null,null,null,null,null,null,null,"B35",35,{"$f":"J105&\"/\"&COUNTIF(J$7:J105,J105)","v":"35/2"},{"$f":"COUNTIF($J$7:J105,\">0\")","v":99}]
[null,null,null,null,null,null,null,null,"B36",36,{"$f":"J106&\"/\"&COUNTIF(J$7:J106,J106)","v":"36/2"},{"$f":"COUNTIF($J$7:J106,\">0\")","v":100}]
[null,null,null,null,null,null,null,null,"B37",37,{"$f":"J107&\"/\"&COUNTIF(J$7:J107,J107)","v":"37/2"},{"$f":"COUNTIF($J$7:J107,\">0\")","v":101}]
[null,null,null,null,null,null,null,null,"B38",38,{"$f":"J108&\"/\"&COUNTIF(J$7:J108,J108)","v":"38/2"},{"$f":"COUNTIF($J$7:J108,\">0\")","v":102}]
[null,null,null,null,null,null,null,null,"B39",39,{"$f":"J109&\"/\"&COUNTIF(J$7:J109,J109)","v":"39/2"},{"$f":"COUNTIF($J$7:J109,\">0\")","v":103}]
[null,null,null,null,null,null,null,null,"B40",40,{"$f":"J110&\"/\"&COUNTIF(J$7:J110,J110)","v":"40/2"},{"$f":"COUNTIF($J$7:J110,\">0\")","v":104}]
[null,null,null,null,null,null,null,null,"B41",41,{"$f":"J111&\"/\"&COUNTIF(J$7:J111,J111)","v":"41/2"},{"$f":"COUNTIF($J$7:J111,\">0\")","v":105}]
[null,null,null,null,null,null,null,null,"B42",42,{"$f":"J112&\"/\"&COUNTIF(J$7:J112,J112)","v":"42/2"},{"$f":"COUNTIF($J$7:J112,\">0\")","v":106}]
[null,null,null,null,null,null,null,null,"B43",43,{"$f":"J113&\"/\"&COUNTIF(J$7:J113,J113)","v":"43/2"},{"$f":"COUNTIF($J$7:J113,\">0\")","v":107}]
[null,null,null,null,null,null,null,null,"B44",44,{"$f":"J114&\"/\"&COUNTIF(J$7:J114,J114)","v":"44/2"},{"$f":"COUNTIF($J$7:J114,\">0\")","v":108}]
[null,null,null,null,null,null,null,null,"B45",45,{"$f":"J115&\"/\"&COUNTIF(J$7:J115,J115)","v":"45/2"},{"$f":"COUNTIF($J$7:J115,\">0\")","v":109}]
[null,null,null,null,null,null,null,null,"B46",46,{"$f":"J116&\"/\"&COUNTIF(J$7:J116,J116)","v":"46/2"},{"$f":"COUNTIF($J$7:J116,\">0\")","v":110}]
[null,null,null,null,null,null,null,null,"B47",47,{"$f":"J117&\"/\"&COUNTIF(J$7:J117,J117)","v":"47/2"},{"$f":"COUNTIF($J$7:J117,\">0\")","v":111}]
[null,null,null,null,null,null,null,null,"B48",48,{"$f":"J118&\"/\"&COUNTIF(J$7:J118,J118)","v":"48/2"},{"$f":"COUNTIF($J$7:J118,\">0\")","v":112}]
[null,null,null,null,null,null,null,null,"B49",49,{"$f":"J119&\"/\"&COUNTIF(J$7:J119,J119)","v":"49/2"},{"$f":"COUNTIF($J$7:J119,\">0\")","v":113}]
[null,null,null,null,null,null,null,null,"B50",50,{"$f":"J120&\"/\"&COUNTIF(J$7:J120,J120)","v":"50/2"},{"$f":"COUNTIF($J$7:J120,\">0\")","v":114}]
[null,null,null,null,null,null,null,null,"B51",51,{"$f":"J121&\"/\"&COUNTIF(J$7:J121,J121)","v":"51/2"},{"$f":"COUNTIF($J$7:J121,\">0\")","v":115}]
[null,null,null,null,null,null,null,null,"B52",52,{"$f":"J122&\"/\"&COUNTIF(J$7:J122,J122)","v":"52/2"},{"$f":"COUNTIF($J$7:J122,\">0\")","v":116}]
[null,null,null,null,null,null,null,null,"B53",53,{"$f":"J123&\"/\"&COUNTIF(J$7:J123,J123)","v":"53/2"},{"$f":"COUNTIF($J$7:J123,\">0\")","v":117}]
[null,null,null,null,null,null,null,null,"B54",54,{"$f":"J124&\"/\"&COUNTIF(J$7:J124,J124)","v":"54/2"},{"$f":"COUNTIF($J$7:J124,\">0\")","v":118}]
[null,null,null,null,null,null,null,null,"B55",55,{"$f":"J125&\"/\"&COUNTIF(J$7:J125,J125)","v":"55/2"},{"$f":"COUNTIF($J$7:J125,\">0\")","v":119}]
[null,null,null,null,null,null,null,null,"B56",56,{"$f":"J126&\"/\"&COUNTIF(J$7:J126,J126)","v":"56/2"},{"$f":"COUNTIF($J$7:J126,\">0\")","v":120}]
[null,null,null,null,null,null,null,null,"B57",57,{"$f":"J127&\"/\"&COUNTIF(J$7:J127,J127)","v":"57/2"},{"$f":"COUNTIF($J$7:J127,\">0\")","v":121}]
[null,null,null,null,null,null,null,null,"B58",58,{"$f":"J128&\"/\"&COUNTIF(J$7:J128,J128)","v":"58/2"},{"$f":"COUNTIF($J$7:J128,\">0\")","v":122}]
[null,null,null,null,null,null,null,null,"B59",59,{"$f":"J129&\"/\"&COUNTIF(J$7:J129,J129)","v":"59/2"},{"$f":"COUNTIF($J$7:J129,\">0\")","v":123}]
[null,null,null,null,null,null,null,null,"B60",60,{"$f":"J130&\"/\"&COUNTIF(J$7:J130,J130)","v":"60/2"},{"$f":"COUNTIF($J$7:J130,\">0\")","v":124}]
[null,null,null,null,null,null,null,null,"B61",61,{"$f":"J131&\"/\"&COUNTIF(J$7:J131,J131)","v":"61/2"},{"$f":"COUNTIF($J$7:J131,\">0\")","v":125}]
[null,null,null,null,null,null,null,null,"B62",62,{"$f":"J132&\"/\"&COUNTIF(J$7:J132,J132)","v":"62/2"},{"$f":"COUNTIF($J$7:J132,\">0\")","v":126}]
[null,null,null,null,null,null,null,null,"B63",63,{"$f":"J133&\"/\"&COUNTIF(J$7:J133,J133)","v":"63/2"},{"$f":"COUNTIF($J$7:J133,\">0\")","v":127}]
[null,null,null,null,null,null,null,null,"B64",64,{"$f":"J134&\"/\"&COUNTIF(J$7:J134,J134)","v":"64/2"},{"$f":"COUNTIF($J$7:J134,\">0\")","v":128}]
[null,null,null,null,null,null,null,null,"C1",1,{"$f":"J135&\"/\"&COUNTIF(J$7:J135,J135)","v":"1/3"},{"$f":"COUNTIF($J$7:J135,\">0\")","v":129}]
[null,null,null,null,null,null,null,null,"C2",2,{"$f":"J136&\"/\"&COUNTIF(J$7:J136,J136)","v":"2/3"},{"$f":"COUNTIF($J$7:J136,\">0\")","v":130}]
[null,null,null,null,null,null,null,null,"C3",3,{"$f":"J137&\"/\"&COUNTIF(J$7:J137,J137)","v":"3/3"},{"$f":"COUNTIF($J$7:J137,\">0\")","v":131}]
[null,null,null,null,null,null,null,null,"C4",4,{"$f":"J138&\"/\"&COUNTIF(J$7:J138,J138)","v":"4/3"},{"$f":"COUNTIF($J$7:J138,\">0\")","v":132}]
[null,null,null,null,null,null,null,null,"C5",5,{"$f":"J139&\"/\"&COUNTIF(J$7:J139,J139)","v":"5/3"},{"$f":"COUNTIF($J$7:J139,\">0\")","v":133}]
[null,null,null,null,null,null,null,null,"C6",6,{"$f":"J140&\"/\"&COUNTIF(J$7:J140,J140)","v":"6/3"},{"$f":"COUNTIF($J$7:J140,\">0\")","v":134}]
[null,null,null,null,null,null,null,null,"C7",7,{"$f":"J141&\"/\"&COUNTIF(J$7:J141,J141)","v":"7/3"},{"$f":"COUNTIF($J$7:J141,\">0\")","v":135}]
[null,null,null,null,null,null,null,null,"C8",8,{"$f":"J142&\"/\"&COUNTIF(J$7:J142,J142)","v":"8/3"},{"$f":"COUNTIF($J$7:J142,\">0\")","v":136}]
[null,null,null,null,null,null,null,null,"C9",9,{"$f":"J143&\"/\"&COUNTIF(J$7:J143,J143)","v":"9/3"},{"$f":"COUNTIF($J$7:J143,\">0\")","v":137}]
[null,null,null,null,null,null,null,null,"C10",10,{"$f":"J144&\"/\"&COUNTIF(J$7:J144,J144)","v":"10/3"},{"$f":"COUNTIF($J$7:J144,\">0\")","v":138}]
[null,null,null,null,null,null,null,null,"C11",11,{"$f":"J145&\"/\"&COUNTIF(J$7:J145,J145)","v":"11/3"},{"$f":"COUNTIF($J$7:J145,\">0\")","v":139}]
[null,null,null,null,null,null,null,null,"C12",12,{"$f":"J146&\"/\"&COUNTIF(J$7:J146,J146)","v":"12/3"},{"$f":"COUNTIF($J$7:J146,\">0\")","v":140}]
[null,null,null,null,null,null,null,null,"C13",13,{"$f":"J147&\"/\"&COUNTIF(J$7:J147,J147)","v":"13/3"},{"$f":"COUNTIF($J$7:J147,\">0\")","v":141}]
[null,null,null,null,null,null,null,null,"C14",14,{"$f":"J148&\"/\"&COUNTIF(J$7:J148,J148)","v":"14/3"},{"$f":"COUNTIF($J$7:J148,\">0\")","v":142}]
[null,null,null,null,null,null,null,null,"C15",15,{"$f":"J149&\"/\"&COUNTIF(J$7:J149,J149)","v":"15/3"},{"$f":"COUNTIF($J$7:J149,\">0\")","v":143}]
[null,null,null,null,null,null,null,null,"C16",16,{"$f":"J150&\"/\"&COUNTIF(J$7:J150,J150)","v":"16/3"},{"$f":"COUNTIF($J$7:J150,\">0\")","v":144}]
[null,null,null,null,null,null,null,null,"C17",17,{"$f":"J151&\"/\"&COUNTIF(J$7:J151,J151)","v":"17/3"},{"$f":"COUNTIF($J$7:J151,\">0\")","v":145}]
[null,null,null,null,null,null,null,null,"C18",18,{"$f":"J152&\"/\"&COUNTIF(J$7:J152,J152)","v":"18/3"},{"$f":"COUNTIF($J$7:J152,\">0\")","v":146}]
[null,null,null,null,null,null,null,null,"C19",19,{"$f":"J153&\"/\"&COUNTIF(J$7:J153,J153)","v":"19/3"},{"$f":"COUNTIF($J$7:J153,\">0\")","v":147}]
[null,null,null,null,null,null,null,null,"C20",20,{"$f":"J154&\"/\"&COUNTIF(J$7:J154,J154)","v":"20/3"},{"$f":"COUNTIF($J$7:J154,\">0\")","v":148}]
[null,null,null,null,null,null,null,null,"C21",21,{"$f":"J155&\"/\"&COUNTIF(J$7:J155,J155)","v":"21/3"},{"$f":"COUNTIF($J$7:J155,\">0\")","v":149}]
[null,null,null,null,null,null,null,null,"C22",22,{"$f":"J156&\"/\"&COUNTIF(J$7:J156,J156)","v":"22/3"},{"$f":"COUNTIF($J$7:J156,\">0\")","v":150}]
[null,null,null,null,null,null,null,null,"C23",23,{"$f":"J157&\"/\"&COUNTIF(J$7:J157,J157)","v":"23/3"},{"$f":"COUNTIF($J$7:J157,\">0\")","v":151}]
[null,null,null,null,null,null,null,null,"C24",24,{"$f":"J158&\"/\"&COUNTIF(J$7:J158,J158)","v":"24/3"},{"$f":"COUNTIF($J$7:J158,\">0\")","v":152}]
[null,null,null,null,null,null,null,null,"C25",25,{"$f":"J159&\"/\"&COUNTIF(J$7:J159,J159)","v":"25/3"},{"$f":"COUNTIF($J$7:J159,\">0\")","v":153}]
[null,null,null,null,null,null,null,null,"C26",26,{"$f":"J160&\"/\"&COUNTIF(J$7:J160,J160)","v":"26/3"},{"$f":"COUNTIF($J$7:J160,\">0\")","v":154}]
[null,null,null,null,null,null,null,null,"C27",27,{"$f":"J161&\"/\"&COUNTIF(J$7:J161,J161)","v":"27/3"},{"$f":"COUNTIF($J$7:J161,\">0\")","v":155}]
[null,null,null,null,null,null,null,null,"C28",28,{"$f":"J162&\"/\"&COUNTIF(J$7:J162,J162)","v":"28/3"},{"$f":"COUNTIF($J$7:J162,\">0\")","v":156}]
[null,null,null,null,null,null,null,null,"C29",29,{"$f":"J163&\"/\"&COUNTIF(J$7:J163,J163)","v":"29/3"},{"$f":"COUNTIF($J$7:J163,\">0\")","v":157}]
[null,null,null,null,null,null,null,null,"C30",30,{"$f":"J164&\"/\"&COUNTIF(J$7:J164,J164)","v":"30/3"},{"$f":"COUNTIF($J$7:J164,\">0\")","v":158}]
[null,null,null,null,null,null,null,null,"C31",31,{"$f":"J165&\"/\"&COUNTIF(J$7:J165,J165)","v":"31/3"},{"$f":"COUNTIF($J$7:J165,\">0\")","v":159}]
[null,null,null,null,null,null,null,null,"C32",32,{"$f":"J166&\"/\"&COUNTIF(J$7:J166,J166)","v":"32/3"},{"$f":"COUNTIF($J$7:J166,\">0\")","v":160}]
[null,null,null,null,null,null,null,null,"C33",33,{"$f":"J167&\"/\"&COUNTIF(J$7:J167,J167)","v":"33/3"},{"$f":"COUNTIF($J$7:J167,\">0\")","v":161}]
[null,null,null,null,null,null,null,null,"C34",34,{"$f":"J168&\"/\"&COUNTIF(J$7:J168,J168)","v":"34/3"},{"$f":"COUNTIF($J$7:J168,\">0\")","v":162}]
[null,null,null,null,null,null,null,null,"C35",35,{"$f":"J169&\"/\"&COUNTIF(J$7:J169,J169)","v":"35/3"},{"$f":"COUNTIF($J$7:J169,\">0\")","v":163}]
[null,null,null,null,null,null,null,null,"C36",36,{"$f":"J170&\"/\"&COUNTIF(J$7:J170,J170)","v":"36/3"},{"$f":"COUNTIF($J$7:J170,\">0\")","v":164}]
[null,null,null,null,null,null,null,null,"C37",37,{"$f":"J171&\"/\"&COUNTIF(J$7:J171,J171)","v":"37/3"},{"$f":"COUNTIF($J$7:J171,\">0\")","v":165}]
[null,null,null,null,null,null,null,null,"C38",38,{"$f":"J172&\"/\"&COUNTIF(J$7:J172,J172)","v":"38/3"},{"$f":"COUNTIF($J$7:J172,\">0\")","v":166}]
[null,null,null,null,null,null,null,null,"C39",39,{"$f":"J173&\"/\"&COUNTIF(J$7:J173,J173)","v":"39/3"},{"$f":"COUNTIF($J$7:J173,\">0\")","v":167}]
[null,null,null,null,null,null,null,null,"C40",40,{"$f":"J174&\"/\"&COUNTIF(J$7:J174,J174)","v":"40/3"},{"$f":"COUNTIF($J$7:J174,\">0\")","v":168}]
[null,null,null,null,null,null,null,null,"C41",41,{"$f":"J175&\"/\"&COUNTIF(J$7:J175,J175)","v":"41/3"},{"$f":"COUNTIF($J$7:J175,\">0\")","v":169}]
[null,null,null,null,null,null,null,null,"C42",42,{"$f":"J176&\"/\"&COUNTIF(J$7:J176,J176)","v":"42/3"},{"$f":"COUNTIF($J$7:J176,\">0\")","v":170}]
[null,null,null,null,null,null,null,null,"C43",43,{"$f":"J177&\"/\"&COUNTIF(J$7:J177,J177)","v":"43/3"},{"$f":"COUNTIF($J$7:J177,\">0\")","v":171}]
[null,null,null,null,null,null,null,null,"C44",44,{"$f":"J178&\"/\"&COUNTIF(J$7:J178,J178)","v":"44/3"},{"$f":"COUNTIF($J$7:J178,\">0\")","v":172}]
[null,null,null,null,null,null,null,null,"C45",45,{"$f":"J179&\"/\"&COUNTIF(J$7:J179,J179)","v":"45/3"},{"$f":"COUNTIF($J$7:J179,\">0\")","v":173}]
[null,null,null,null,null,null,null,null,"C46",46,{"$f":"J180&\"/\"&COUNTIF(J$7:J180,J180)","v":"46/3"},{"$f":"COUNTIF($J$7:J180,\">0\")","v":174}]
[null,null,null,null,null,null,null,null,"C47",47,{"$f":"J181&\"/\"&COUNTIF(J$7:J181,J181)","v":"47/3"},{"$f":"COUNTIF($J$7:J181,\">0\")","v":175}]
[null,null,null,null,null,null,null,null,"C48",48,{"$f":"J182&\"/\"&COUNTIF(J$7:J182,J182)","v":"48/3"},{"$f":"COUNTIF($J$7:J182,\">0\")","v":176}]
[null,null,null,null,null,null,null,null,"C49",49,{"$f":"J183&\"/\"&COUNTIF(J$7:J183,J183)","v":"49/3"},{"$f":"COUNTIF($J$7:J183,\">0\")","v":177}]
[null,null,null,null,null,null,null,null,"C50",50,{"$f":"J184&\"/\"&COUNTIF(J$7:J184,J184)","v":"50/3"},{"$f":"COUNTIF($J$7:J184,\">0\")","v":178}]
[null,null,null,null,null,null,null,null,"C51",51,{"$f":"J185&\"/\"&COUNTIF(J$7:J185,J185)","v":"51/3"},{"$f":"COUNTIF($J$7:J185,\">0\")","v":179}]
[null,null,null,null,null,null,null,null,"C52",52,{"$f":"J186&\"/\"&COUNTIF(J$7:J186,J186)","v":"52/3"},{"$f":"COUNTIF($J$7:J186,\">0\")","v":180}]
[null,null,null,null,null,null,null,null,"C53",53,{"$f":"J187&\"/\"&COUNTIF(J$7:J187,J187)","v":"53/3"},{"$f":"COUNTIF($J$7:J187,\">0\")","v":181}]
[null,null,null,null,null,null,null,null,"C54",54,{"$f":"J188&\"/\"&COUNTIF(J$7:J188,J188)","v":"54/3"},{"$f":"COUNTIF($J$7:J188,\">0\")","v":182}]
[null,null,null,null,null,null,null,null,"C55",55,{"$f":"J189&\"/\"&COUNTIF(J$7:J189,J189)","v":"55/3"},{"$f":"COUNTIF($J$7:J189,\">0\")","v":183}]
[null,null,null,null,null,null,null,null,"C56",56,{"$f":"J190&\"/\"&COUNTIF(J$7:J190,J190)","v":"56/3"},{"$f":"COUNTIF($J$7:J190,\">0\")","v":184}]
[null,null,null,null,null,null,null,null,"C57",57,{"$f":"J191&\"/\"&COUNTIF(J$7:J191,J191)","v":"57/3"},{"$f":"COUNTIF($J$7:J191,\">0\")","v":185}]
[null,null,null,null,null,null,null,null,"C58",58,{"$f":"J192&\"/\"&COUNTIF(J$7:J192,J192)","v":"58/3"},{"$f":"COUNTIF($J$7:J192,\">0\")","v":186}]
[null,null,null,null,null,null,null,null,"C59",59,{"$f":"J193&\"/\"&COUNTIF(J$7:J193,J193)","v":"59/3"},{"$f":"COUNTIF($J$7:J193,\">0\")","v":187}]
[null,null,null,null,null,null,null,null,"C60",60,{"$f":"J194&\"/\"&COUNTIF(J$7:J194,J194)","v":"60/3"},{"$f":"COUNTIF($J$7:J194,\">0\")","v":188}]
[null,null,null,null,null,null,null,null,"C61",61,{"$f":"J195&\"/\"&COUNTIF(J$7:J195,J195)","v":"61/3"},{"$f":"COUNTIF($J$7:J195,\">0\")","v":189}]
[null,null,null,null,null,null,null,null,"C62",62,{"$f":"J196&\"/\"&COUNTIF(J$7:J196,J196)","v":"62/3"},{"$f":"COUNTIF($J$7:J196,\">0\")","v":190}]
[null,null,null,null,null,null,null,null,"C63",63,{"$f":"J197&\"/\"&COUNTIF(J$7:J197,J197)","v":"63/3"},{"$f":"COUNTIF($J$7:J197,\">0\")","v":191}]
[null,null,null,null,null,null,null,null,"C64",64,{"$f":"J198&\"/\"&COUNTIF(J$7:J198,J198)","v":"64/3"},{"$f":"COUNTIF($J$7:J198,\">0\")","v":192}]
[]
[null,null,null,null,null,null,null,{"$f":"COUNTIF(H7:H198,1)","v":0}]

{"sheet":"Partie 1","index":1,"n_rows":218,"n_cols":27,"rows_kept":218,"cut":false,"hidden":false,"merged":[[1,19,1,22],[10,12,10,15],[10,19,10,22],[0,0,0,22],[1,0,1,3],[10,0,10,3],[1,7,1,10],[10,7,10,10],[1,12,1,15]]}
["TRIPLETTES ",null,null,null,null,null,null,null,null,null,null,null,null,null,null,null,null,null,null,null,null,null,null,null,null,null,30072022]
["Equipes ",null,null,null,"PTS     EQ 1",null,"PTS     EQ 2","Equipes ",null,null,null,null,"Equipes ",null,null,null,"PTS     EQ 1",null,"PTS     EQ 2","Equipes "]
[1,{"$f":"VLOOKUP($A3,Liste!$O$7:$R$70,COLUMN(),0)","v":"A1"},{"$f":"VLOOKUP($A3,Liste!$O$7:$R$70,COLUMN(),0)","v":"B1"},{"$f":"VLOOKUP($A3,Liste!$O$7:$R$70,COLUMN(),0)","v":"C1"},13,null,2,{"$f":"VLOOKUP($K3,Liste!$O$7:$R$70,COLUMN()-6,0)","v":"A2"},{"$f":"VLOOKUP($K3,Liste!$O$7:$R$70,COLUMN()-6,0)","v":"B2"},{"$f":"VLOOKUP($K3,Liste!$O$7:$R$70,COLUMN()-6,0)","v":"C2"},2,null,33,{"$f":"VLOOKUP($M3,Liste!$O$7:$R$70,COLUMN()-12,0)","v":"A33"},{"$f":"VLOOKUP($M3,Liste!$O$7:$R$70,COLUMN()-12,0)","v":"B33"},{"$f":"VLOOKUP($M3,Liste!$O$7:$R$70,COLUMN()-12,0)","v":"C33"},2,null,13,{"$f":"VLOOKUP($W3,Liste!$O$7:$R$70,COLUMN()-18,0)","v":"A34"},{"$f":"VLOOKUP($W3,Liste!$O$7:$R$70,COLUMN()-18,0)","v":"B34"},{"$f":"VLOOKUP($W3,Liste!$O$7:$R$70,COLUMN()-18,0)","v":"C34"},34]
[3,{"$f":"VLOOKUP($A4,Liste!$O$7:$R$70,COLUMN(),0)","v":"A3"},{"$f":"VLOOKUP($A4,Liste!$O$7:$R$70,COLUMN(),0)","v":"B3"},{"$f":"VLOOKUP($A4,Liste!$O$7:$R$70,COLUMN(),0)","v":"C3"},10,null,13,{"$f":"VLOOKUP($K4,Liste!$O$7:$R$70,COLUMN()-6,0)","v":"A4"},{"$f":"VLOOKUP($K4,Liste!$O$7:$R$70,COLUMN()-6,0)","v":"B4"},{"$f":"VLOOKUP($K4,Liste!$O$7:$R$70,COLUMN()-6,0)","v":"C4"},4,null,35,{"$f":"VLOOKUP($M4,Liste!$O$7:$R$70,COLUMN()-12,0)","v":"A35"},{"$f":"VLOOKUP($M4,Liste!$O$7:$R$70,COLUMN()-12,0)","v":"B35"},{"$f":"VLOOKUP($M4,Liste!$O$7:$R$70,COLUMN()-12,0)","v":"C35"},13,null,10,{"$f":"VLOOKUP($W4,Liste!$O$7:$R$70,COLUMN()-18,0)","v":"A36"},{"$f":"VLOOKUP($W4,Liste!$O$7:$R$70,COLUMN()-18,0)","v":"B36"},{"$f":"VLOOKUP($W4,Liste!$O$7:$R$70,COLUMN()-18,0)","v":"C36"},36]
[5,{"$f":"VLOOKUP($A5,Liste!$O$7:$R$70,COLUMN(),0)","v":"A5"},{"$f":"VLOOKUP($A5,Liste!$O$7:$R$70,COLUMN(),0)","v":"B5"},{"$f":"VLOOKUP($A5,Liste!$O$7:$R$70,COLUMN(),0)","v":"C5"},11,null,13,{"$f":"VLOOKUP($K5,Liste!$O$7:$R$70,COLUMN()-6,0)","v":"A6"},{"$f":"VLOOKUP($K5,Liste!$O$7:$R$70,COLUMN()-6,0)","v":"B6"},{"$f":"VLOOKUP($K5,Liste!$O$7:$R$70,COLUMN()-6,0)","v":"C6"},6,null,37,{"$f":"VLOOKUP($M5,Liste!$O$7:$R$70,COLUMN()-12,0)","v":"A37"},{"$f":"VLOOKUP($M5,Liste!$O$7:$R$70,COLUMN()-12,0)","v":"B37"},{"$f":"VLOOKUP($M5,Liste!$O$7:$R$70,COLUMN()-12,0)","v":"C37"},13,null,11,{"$f":"VLOOKUP($W5,Liste!$O$7:$R$70,COLUMN()-18,0)","v":"A38"},{"$f":"VLOOKUP($W5,Liste!$O$7:$R$70,COLUMN()-18,0)","v":"B38"},{"$f":"VLOOKUP($W5,Liste!$O$7:$R$70,COLUMN()-18,0)","v":"C38"},38]
[7,{"$f":"VLOOKUP($A6,Liste!$O$7:$R$70,COLUMN(),0)","v":"A7"},{"$f":"VLOOKUP($A6,Liste!$O$7:$R$70,COLUMN(),0)","v":"B7"},{"$f":"VLOOKUP($A6,Liste!$O$7:$R$70,COLUMN(),0)","v":"C7"},2,null,13,{"$f":"VLOOKUP($K6,Liste!$O$7:$R$70,COLUMN()-6,0)","v":"A8"},{"$f":"VLOOKUP($K6,Liste!$O$7:$R$70,COLUMN()-6,0)","v":"B8"},{"$f":"VLOOKUP($K6,Liste!$O$7:$R$70,COLUMN()-6,0)","v":"C8"},8,null,39,{"$f":"VLOOKUP($M6,Liste!$O$7:$R$70,COLUMN()-12,0)","v":"A39"},{"$f":"VLOOKUP($M6,Liste!$O$7:$R$70,COLUMN()-12,0)","v":"B39"},{"$f":"VLOOKUP($M6,Liste!$O$7:$R$70,COLUMN()-12,0)","v":"C39"},13,null,2,{"$f":"VLOOKUP($W6,Liste!$O$7:$R$70,COLUMN()-18,0)","v":"A40"},{"$f":"VLOOKUP($W6,Liste!$O$7:$R$70,COLUMN()-18,0)","v":"B40"},{"$f":"VLOOKUP($W6,Liste!$O$7:$R$70,COLUMN()-18,0)","v":"C40"},40]
[9,{"$f":"VLOOKUP($A7,Liste!$O$7:$R$70,COLUMN(),0)","v":"A9"},{"$f":"VLOOKUP($A7,Liste!$O$7:$R$70,COLUMN(),0)","v":"B9"},{"$f":"VLOOKUP($A7,Liste!$O$7:$R$70,COLUMN(),0)","v":"C9"},13,null,1,{"$f":"VLOOKUP($K7,Liste!$O$7:$R$70,COLUMN()-6,0)","v":"A10"},{"$f":"VLOOKUP($K7,Liste!$O$7:$R$70,COLUMN()-6,0)","v":"B10"},{"$f":"VLOOKUP($K7,Liste!$O$7:$R$70,COLUMN()-6,0)","v":"C10"},10,null,41,{"$f":"VLOOKUP($M7,Liste!$O$7:$R$70,COLUMN()-12,0)","v":"A41"},{"$f":"VLOOKUP($M7,Liste!$O$7:$R$70,COLUMN()-12,0)","v":"B41"},{"$f":"VLOOKUP($M7,Liste!$O$7:$R$70,COLUMN()-12,0)","v":"C41"},5,null,13,{"$f":"VLOOKUP($W7,Liste!$O$7:$R$70,COLUMN()-18,0)","v":"A42"},{"$f":"VLOOKUP($W7,Liste!$O$7:$R$70,COLUMN()-18,0)","v":"B42"},{"$f":"VLOOKUP($W7,Liste!$O$7:$R$70,COLUMN()-18,0)","v":"C42"},42]
[11,{"$f":"VLOOKUP($A8,Liste!$O$7:$R$70,COLUMN(),0)","v":"A11"},{"$f":"VLOOKUP($A8,Liste!$O$7:$R$70,COLUMN(),0)","v":"B11"},{"$f":"VLOOKUP($A8,Liste!$O$7:$R$70,COLUMN(),0)","v":"C11"},8,null,13,{"$f":"VLOOKUP($K8,Liste!$O$7:$R$70,COLUMN()-6,0)","v":"A12"},{"$f":"VLOOKUP($K8,Liste!$O$7:$R$70,COLUMN()-6,0)","v":"B12"},{"$f":"VLOOKUP($K8,Liste!$O$7:$R$70,COLUMN()-6,0)","v":"C12"},12,null,43,{"$f":"VLOOKUP($M8,Liste!$O$7:$R$70,COLUMN()-12,0)","v":"A43"},{"$f":"VLOOKUP($M8,Liste!$O$7:$R$70,COLUMN()-12,0)","v":"B43"},{"$f":"VLOOKUP($M8,Liste!$O$7:$R$70,COLUMN()-12,0)","v":"C43"},13,null,8,{"$f":"VLOOKUP($W8,Liste!$O$7:$R$70,COLUMN()-18,0)","v":"A44"},{"$f":"VLOOKUP($W8,Liste!$O$7:$R$70,COLUMN()-18,0)","v":"B44"},{"$f":"VLOOKUP($W8,Liste!$O$7:$R$70,COLUMN()-18,0)","v":"C44"},44]
[13,{"$f":"VLOOKUP($A9,Liste!$O$7:$R$70,COLUMN(),0)","v":"A13"},{"$f":"VLOOKUP($A9,Liste!$O$7:$R$70,COLUMN(),0)","v":"B13"},{"$f":"VLOOKUP($A9,Liste!$O$7:$R$70,COLUMN(),0)","v":"C13"},7,null,13,{"$f":"VLOOKUP($K9,Liste!$O$7:$R$70,COLUMN()-6,0)","v":"A14"},{"$f":"VLOOKUP($K9,Liste!$O$7:$R$70,COLUMN()-6,0)","v":"B14"},{"$f":"VLOOKUP($K9,Liste!$O$7:$R$70,COLUMN()-6,0)","v":"C14"},14,null,45,{"$f":"VLOOKUP($M9,Liste!$O$7:$R$70,COLUMN()-12,0)","v":"A45"},{"$f":"VLOOKUP($M9,Liste!$O$7:$R$70,COLUMN()-12,0)","v":"B45"},{"$f":"VLOOKUP($M9,Liste!$O$7:$R$70,COLUMN()-12,0)","v":"C45"},13,null,7,{"$f":"VLOOKUP($W9,Liste!$O$7:$R$70,COLUMN()-18,0)","v":"A46"},{"$f":"VLOOKUP($W9,Liste!$O$7:$R$70,COLUMN()-18,0)","v":"B46"},{"$f":"VLOOKUP($W9,Liste!$O$7:$R$70,COLUMN()-18,0)","v":"C46"},46]
[15,{"$f":"VLOOKUP($A10,Liste!$O$7:$R$70,COLUMN(),0)","v":"A15"},{"$f":"VLOOKUP($A10,Liste!$O$7:$R$70,COLUMN(),0)","v":"B15"},{"$f":"VLOOKUP($A10,Liste!$O$7:$R$70,COLUMN(),0)","v":"C15"},13,null,4,{"$f":"VLOOKUP($K10,Liste!$O$7:$R$70,COLUMN()-6,0)","v":"A16"},{"$f":"VLOOKUP($K10,Liste!$O$7:$R$70,COLUMN()-6,0)","v":"B16"},{"$f":"VLOOKUP($K10,Liste!$O$7:$R$70,COLUMN()-6,0)","v":"C16"},16,null,47,{"$f":"VLOOKUP($M10,Liste!$O$7:$R$70,COLUMN()-12,0)","v":"A47"},{"$f":"VLOOKUP($M10,Liste!$O$7:$R$70,COLUMN()-12,0)","v":"B47"},{"$f":"VLOOKUP($M10,Liste!$O$7:$R$70,COLUMN()-12,0)","v":"C47"},4,null,13,{"$f":"VLOOKUP($W10,Liste!$O$7:$R$70,COLUMN()-18,0)","v":"A48"},{"$f":"VLOOKUP($W10,Liste!$O$7:$R$70,COLUMN()-18,0)","v":"B48"},{"$f":"VLOOKUP($W10,Liste!$O$7:$R$70,COLUMN()-18,0)","v":"C48"},48]
["Equipes ",null,null,null,"PTS     EQ 1",null,"PTS     EQ 2","Equipes ",null,null,null,null,"Equipes ",null,null,null,"PTS     EQ 1",null,"PTS     EQ 2","Equipes "]
[17,{"$f":"VLOOKUP($A12,Liste!$O$7:$R$70,COLUMN(),0)","v":"A17"},{"$f":"VLOOKUP($A12,Liste!$O$7:$R$70,COLUMN(),0)","v":"B17"},{"$f":"VLOOKUP($A12,Liste!$O$7:$R$70,COLUMN(),0)","v":"C17"},13,null,2,{"$f":"VLOOKUP($K12,Liste!$O$7:$R$70,COLUMN()-6,0)","v":"A18"},{"$f":"VLOOKUP($K12,Liste!$O$7:$R$70,COLUMN()-6,0)","v":"B18"},{"$f":"VLOOKUP($K12,Liste!$O$7:$R$70,COLUMN()-6,0)","v":"C18"},18,null,49,{"$f":"VLOOKUP($M12,Liste!$O$7:$R$70,COLUMN()-12,0)","v":"A49"},{"$f":"VLOOKUP($M12,Liste!$O$7:$R$70,COLUMN()-12,0)","v":"B49"},{"$f":"VLOOKUP($M12,Liste!$O$7:$R$70,COLUMN()-12,0)","v":"C49"},13,null,2,{"$f":"VLOOKUP($W12,Liste!$O$7:$R$70,COLUMN()-18,0)","v":"A50"},{"$f":"VLOOKUP($W12,Liste!$O$7:$R$70,COLUMN()-18,0)","v":"B50"},{"$f":"VLOOKUP($W12,Liste!$O$7:$R$70,COLUMN()-18,0)","v":"C50"},50]
[19,{"$f":"VLOOKUP($A13,Liste!$O$7:$R$70,COLUMN(),0)","v":"A19"},{"$f":"VLOOKUP($A13,Liste!$O$7:$R$70,COLUMN(),0)","v":"B19"},{"$f":"VLOOKUP($A13,Liste!$O$7:$R$70,COLUMN(),0)","v":"C19"},10,null,13,{"$f":"VLOOKUP($K13,Liste!$O$7:$R$70,COLUMN()-6,0)","v":"A20"},{"$f":"VLOOKUP($K13,Liste!$O$7:$R$70,COLUMN()-6,0)","v":"B20"},{"$f":"VLOOKUP($K13,Liste!$O$7:$R$70,COLUMN()-6,0)","v":"C20"},20,null,51,{"$f":"VLOOKUP($M13,Liste!$O$7:$R$70,COLUMN()-12,0)","v":"A51"},{"$f":"VLOOKUP($M13,Liste!$O$7:$R$70,COLUMN()-12,0)","v":"B51"},{"$f":"VLOOKUP($M13,Liste!$O$7:$R$70,COLUMN()-12,0)","v":"C51"},10,null,13,{"$f":"VLOOKUP($W13,Liste!$O$7:$R$70,COLUMN()-18,0)","v":"A52"},{"$f":"VLOOKUP($W13,Liste!$O$7:$R$70,COLUMN()-18,0)","v":"B52"},{"$f":"VLOOKUP($W13,Liste!$O$7:$R$70,COLUMN()-18,0)","v":"C52"},52]
[21,{"$f":"VLOOKUP($A14,Liste!$O$7:$R$70,COLUMN(),0)","v":"A21"},{"$f":"VLOOKUP($A14,Liste!$O$7:$R$70,COLUMN(),0)","v":"B21"},{"$f":"VLOOKUP($A14,Liste!$O$7:$R$70,COLUMN(),0)","v":"C21"},11,null,13,{"$f":"VLOOKUP($K14,Liste!$O$7:$R$70,COLUMN()-6,0)","v":"A22"},{"$f":"VLOOKUP($K14,Liste!$O$7:$R$70,COLUMN()-6,0)","v":"B22"},{"$f":"VLOOKUP($K14,Liste!$O$7:$R$70,COLUMN()-6,0)","v":"C22"},22,null,53,{"$f":"VLOOKUP($M14,Liste!$O$7:$R$70,COLUMN()-12,0)","v":"A53"},{"$f":"VLOOKUP($M14,Liste!$O$7:$R$70,COLUMN()-12,0)","v":"B53"},{"$f":"VLOOKUP($M14,Liste!$O$7:$R$70,COLUMN()-12,0)","v":"C53"},11,null,13,{"$f":"VLOOKUP($W14,Liste!$O$7:$R$70,COLUMN()-18,0)","v":"A54"},{"$f":"VLOOKUP($W14,Liste!$O$7:$R$70,COLUMN()-18,0)","v":"B54"},{"$f":"VLOOKUP($W14,Liste!$O$7:$R$70,COLUMN()-18,0)","v":"C54"},54]
[23,{"$f":"VLOOKUP($A15,Liste!$O$7:$R$70,COLUMN(),0)","v":"A23"},{"$f":"VLOOKUP($A15,Liste!$O$7:$R$70,COLUMN(),0)","v":"B23"},{"$f":"VLOOKUP($A15,Liste!$O$7:$R$70,COLUMN(),0)","v":"C23"},2,null,13,{"$f":"VLOOKUP($K15,Liste!$O$7:$R$70,COLUMN()-6,0)","v":"A24"},{"$f":"VLOOKUP($K15,Liste!$O$7:$R$70,COLUMN()-6,0)","v":"B24"},{"$f":"VLOOKUP($K15,Liste!$O$7:$R$70,COLUMN()-6,0)","v":"C24"},24,null,55,{"$f":"VLOOKUP($M15,Liste!$O$7:$R$70,COLUMN()-12,0)","v":"A55"},{"$f":"VLOOKUP($M15,Liste!$O$7:$R$70,COLUMN()-12,0)","v":"B55"},{"$f":"VLOOKUP($M15,Liste!$O$7:$R$70,COLUMN()-12,0)","v":"C55"},2,null,13,{"$f":"VLOOKUP($W15,Liste!$O$7:$R$70,COLUMN()-18,0)","v":"A56"},{"$f":"VLOOKUP($W15,Liste!$O$7:$R$70,COLUMN()-18,0)","v":"B56"},{"$f":"VLOOKUP($W15,Liste!$O$7:$R$70,COLUMN()-18,0)","v":"C56"},56]
[25,{"$f":"VLOOKUP($A16,Liste!$O$7:$R$70,COLUMN(),0)","v":"A25"},{"$f":"VLOOKUP($A16,Liste!$O$7:$R$70,COLUMN(),0)","v":"B25"},{"$f":"VLOOKUP($A16,Liste!$O$7:$R$70,COLUMN(),0)","v":"C25"},13,null,5,{"$f":"VLOOKUP($K16,Liste!$O$7:$R$70,COLUMN()-6,0)","v":"A26"},{"$f":"VLOOKUP($K16,Liste!$O$7:$R$70,COLUMN()-6,0)","v":"B26"},{"$f":"VLOOKUP($K16,Liste!$O$7:$R$70,COLUMN()-6,0)","v":"C26"},26,null,57,{"$f":"VLOOKUP($M16,Liste!$O$7:$R$70,COLUMN()-12,0)","v":"A57"},{"$f":"VLOOKUP($M16,Liste!$O$7:$R$70,COLUMN()-12,0)","v":"B57"},{"$f":"VLOOKUP($M16,Liste!$O$7:$R$70,COLUMN()-12,0)","v":"C57"},13,null,5,{"$f":"VLOOKUP($W16,Liste!$O$7:$R$70,COLUMN()-18,0)","v":"A58"},{"$f":"VLOOKUP($W16,Liste!$O$7:$R$70,COLUMN()-18,0)","v":"B58"},{"$f":"VLOOKUP($W16,Liste!$O$7:$R$70,COLUMN()-18,0)","v":"C58"},58]
[27,{"$f":"VLOOKUP($A17,Liste!$O$7:$R$70,COLUMN(),0)","v":"A27"},{"$f":"VLOOKUP($A17,Liste!$O$7:$R$70,COLUMN(),0)","v":"B27"},{"$f":"VLOOKUP($A17,Liste!$O$7:$R$70,COLUMN(),0)","v":"C27"},8,null,13,{"$f":"VLOOKUP($K17,Liste!$O$7:$R$70,COLUMN()-6,0)","v":"A28"},{"$f":"VLOOKUP($K17,Liste!$O$7:$R$70,COLUMN()-6,0)","v":"B28"},{"$f":"VLOOKUP($K17,Liste!$O$7:$R$70,COLUMN()-6,0)","v":"C28"},28,null,59,{"$f":"VLOOKUP($M17,Liste!$O$7:$R$70,COLUMN()-12,0)","v":"A59"},{"$f":"VLOOKUP($M17,Liste!$O$7:$R$70,COLUMN()-12,0)","v":"B59"},{"$f":"VLOOKUP($M17,Liste!$O$7:$R$70,COLUMN()-12,0)","v":"C59"},8,null,13,{"$f":"VLOOKUP($W17,Liste!$O$7:$R$70,COLUMN()-18,0)","v":"A60"},{"$f":"VLOOKUP($W17,Liste!$O$7:$R$70,COLUMN()-18,0)","v":"B60"},{"$f":"VLOOKUP($W17,Liste!$O$7:$R$70,COLUMN()-18,0)","v":"C60"},60]
[29,{"$f":"VLOOKUP($A18,Liste!$O$7:$R$70,COLUMN(),0)","v":"A29"},{"$f":"VLOOKUP($A18,Liste!$O$7:$R$70,COLUMN(),0)","v":"B29"},{"$f":"VLOOKUP($A18,Liste!$O$7:$R$70,COLUMN(),0)","v":"C29"},7,null,13,{"$f":"VLOOKUP($K18,Liste!$O$7:$R$70,COLUMN()-6,0)","v":"A30"},{"$f":"VLOOKUP($K18,Liste!$O$7:$R$70,COLUMN()-6,0)","v":"B30"},{"$f":"VLOOKUP($K18,Liste!$O$7:$R$70,COLUMN()-6,0)","v":"C30"},30,null,61,{"$f":"VLOOKUP($M18,Liste!$O$7:$R$70,COLUMN()-12,0)","v":"A61"},{"$f":"VLOOKUP($M18,Liste!$O$7:$R$70,COLUMN()-12,0)","v":"B61"},{"$f":"VLOOKUP($M18,Liste!$O$7:$R$70,COLUMN()-12,0)","v":"C61"},7,null,13,{"$f":"VLOOKUP($W18,Liste!$O$7:$R$70,COLUMN()-18,0)","v":"A62"},{"$f":"VLOOKUP($W18,Liste!$O$7:$R$70,COLUMN()-18,0)","v":"B62"},{"$f":"VLOOKUP($W18,Liste!$O$7:$R$70,COLUMN()-18,0)","v":"C62"},62]
[31,{"$f":"VLOOKUP($A19,Liste!$O$7:$R$70,COLUMN(),0)","v":"A31"},{"$f":"VLOOKUP($A19,Liste!$O$7:$R$70,COLUMN(),0)","v":"B31"},{"$f":"VLOOKUP($A19,Liste!$O$7:$R$70,COLUMN(),0)","v":"C31"},13,null,4,{"$f":"VLOOKUP($K19,Liste!$O$7:$R$70,COLUMN()-6,0)","v":"A32"},{"$f":"VLOOKUP($K19,Liste!$O$7:$R$70,COLUMN()-6,0)","v":"B32"},{"$f":"VLOOKUP($K19,Liste!$O$7:$R$70,COLUMN()-6,0)","v":"C32"},32,null,63,{"$f":"VLOOKUP($M19,Liste!$O$7:$R$70,COLUMN()-12,0)","v":"A63"},{"$f":"VLOOKUP($M19,Liste!$O$7:$R$70,COLUMN()-12,0)","v":"B63"},{"$f":"VLOOKUP($M19,Liste!$O$7:$R$70,COLUMN()-12,0)","v":"C63"},13,null,4,{"$f":"VLOOKUP($W19,Liste!$O$7:$R$70,COLUMN()-18,0)","v":"A64"},{"$f":"VLOOKUP($W19,Liste!$O$7:$R$70,COLUMN()-18,0)","v":"B64"},{"$f":"VLOOKUP($W19,Liste!$O$7:$R$70,COLUMN()-18,0)","v":"C64"},64]
[]
[null,null,null," "]
[null,null,null,null,null,null,null,null,null," "]
[]
[]
[]
[]
[null,{"$f":"B3","v":"A1"},{"$f":"E3","v":13},{"$f":"G3","v":2}]
[null,{"$f":"B4","v":"A3"},{"$f":"E4","v":10},{"$f":"G4","v":13}]
[null,"A5",11,13]
[null,"A7",2,13]
[null,"A9",13,1]
[null,"A11",8,13]
[null,"A13",7,13]
[null,"A15",13,4]
[null,{"$f":"B12","v":"A17"},{"$f":"E12","v":13},{"$f":"G12","v":2}]
[null,"A19",10,13]
[null,"A21",11,13]
[null,"A23",2,13]
[null,"A25",13,5]
[null,"A27",8,13]
[null,"A29",7,13]
[null,"A31",13,4]
[null,{"$f":"H3","v":"A2"},{"$f":"G3","v":2},{"$f":"E3","v":13}]
[null,{"$f":"H4","v":"A4"},{"$f":"G4","v":13},{"$f":"E4","v":10}]
[null,"A6",13,11]
[null,"A8",13,2]
[null,"A10",1,13]
[null,"A12",13,8]
[null,"A14",13,7]
[null,"A16",4,13]
[null,{"$f":"H12","v":"A18"},{"$f":"G12","v":2},{"$f":"E12","v":13}]
[null,"A20",13,10]
[null,"A22",13,11]
[null,"A24",13,2]
[null,"A26",5,13]
[null,"A28",13,8]
[null,"A30",13,7]
[null,"A32",4,13]
[null,{"$f":"N3","v":"A33"},{"$f":"Q3","v":2},{"$f":"S3","v":13}]
[null,{"$f":"N4","v":"A35"},{"$f":"Q4","v":13},{"$f":"S4","v":10}]
[null,"A37",13,11]
[null,"A39",13,2]
[null,"A41",5,13]
[null,"A43",13,8]
[null,"A45",13,7]
[null,"A47",4,13]
[null,{"$f":"N12","v":"A49"},{"$f":"Q12","v":13},{"$f":"S12","v":2}]
[null,"A51",10,13]
[null,"A53",11,13]
[null,"A55",2,13]
[null,"A57",13,5]
[null,"A59",8,13]
[null,"A61",7,13]
[null,"A63",13,4]
[null,{"$f":"T3","v":"A34"},{"$f":"S3","v":13},{"$f":"Q3","v":2}]
[null,{"$f":"T4","v":"A36"},{"$f":"S4","v":10},{"$f":"Q4","v":13}]
[null,"A38",11,13]
[null,"A40",2,13]
[null,"A42",13,5]
[null,"A44",8,13]
[null,"A46",7,13]
[null,"A48",13,4]
[null,{"$f":"T12","v":"A50"},{"$f":"S12","v":2},{"$f":"Q12","v":13}]
[null,"A52",13,10]
[null,"A54",13,11]
[null,"A56",13,2]
[null,"A58",5,13]
[null,"A60",13,8]
[null,"A62",13,7]
[null,"A64",4,13]
[null,{"$f":"C3","v":"B1"},{"$f":"E3","v":13},{"$f":"G3","v":2}]
[null,{"$f":"C4","v":"B3"},{"$f":"E4","v":10},{"$f":"G4","v":13}]
[null,"B5",11,13]
[null,"B7",2,13]
[null,"B9",13,1]
[null,"B11",8,13]
[null,"B13",7,13]
[null,"B15",13,4]
[null,{"$f":"C12","v":"B17"},{"$f":"E12","v":13},{"$f":"G12","v":2}]
[null,"B19",10,13]
[null,"B21",11,13]
[null,"B23",2,13]
[null,"B25",13,5]
[null,"B27",8,13]
[null,"B29",7,13]
[null,"B31",13,4]
[null,{"$f":"D3","v":"C1"},{"$f":"E3","v":13},{"$f":"G3","v":2}]
[null,{"$f":"D4","v":"C3"},{"$f":"E4","v":10},{"$f":"G4","v":13}]
[null,"C5",11,13]
[null,"C7",2,13]
[null,"C9",13,1]
[null,"C11",8,13]
[null,"C13",7,13]
[null,"C15",13,4]
[null,{"$f":"D12","v":"C17"},13,{"$f":"G12","v":2}]
[null,"C19",10,13]
[null,"C21",11,13]
[null,"C23",2,13]
[null,"C25",13,5]
[null,"C27",8,13]
[null,"C29",7,13]
[null,"C31",13,4]
[null,{"$f":"I3","v":"B2"},{"$f":"G3","v":2},{"$f":"E3","v":13}]
[null,{"$f":"I4","v":"B4"},{"$f":"G4","v":13},{"$f":"E4","v":10}]
[null,"B6",13,11]
[null,"B8",13,2]
[null,"B10",1,13]
[null,"B12",13,8]
[null,"B14",13,7]
[null,"B16",4,13]
[null,{"$f":"I12","v":"B18"},{"$f":"G12","v":2},{"$f":"E12","v":13}]
[null,"B20",13,10]
[null,"B22",13,11]
[null,"B24",13,2]
[null,"B26",5,13]
[null,"B28",13,8]
[null,"B30",13,7]
[null,"B32",4,13]
[null,{"$f":"J3","v":"C2"},{"$f":"G3","v":2},{"$f":"E3","v":13}]
[null,{"$f":"J4","v":"C4"},{"$f":"G4","v":13},{"$f":"E4","v":10}]
[null,"C6",13,11]
[null,"C8",13,2]
[null,"C10",1,13]
[null,"C12",13,8]
[null,"C14",13,7]
[null,"C16",4,13]
[null,{"$f":"J12","v":"C18"},{"$f":"G12","v":2},{"$f":"E12","v":13}]
[null,"C20",13,10]
[null,"C22",13,11]
[null,"C24",13,2]
[null,"C26",5,13]
[null,"C28",13,8]
[null,"C30",13,7]
[null,"C32",4,13]
[null,{"$f":"O3","v":"B33"},{"$f":"Q3","v":2},{"$f":"S3","v":13}]
[null,{"$f":"O4","v":"B35"},{"$f":"Q4","v":13},{"$f":"S4","v":10}]
[null,"B37",13,11]
[null,"B39",13,2]
[null,"B41",5,13]
[null,"B43",13,8]
[null,"B45",13,7]
[null,"B47",4,13]
[null,{"$f":"O12","v":"B49"},{"$f":"Q12","v":13},{"$f":"S12","v":2}]
[null,"B51",10,13]
[null,"B53",11,13]
[null,"B55",2,13]
[null,"B57",13,5]
[null,"B59",8,13]
[null,"B61",7,13]
[null,"B63",13,4]
[null,{"$f":"P3","v":"C33"},{"$f":"Q3","v":2},{"$f":"S3","v":13}]
[null,{"$f":"P4","v":"C35"},{"$f":"Q4","v":13},{"$f":"S4","v":10}]
[null,"C37",13,11]
[null,"C39",13,2]
[null,"C41",5,13]
[null,"C43",13,8]
[null,"C45",13,7]
[null,"C47",4,13]
[null,{"$f":"P12","v":"C49"},13,{"$f":"S12","v":2}]
[null,"C51",10,13]
[null,"C53",11,13]
[null,"C55",2,13]
[null,"C57",13,5]
[null,"C59",8,13]
[null,"C61",7,13]
[null,"C63",13,4]
[null,{"$f":"U3","v":"B34"},{"$f":"S3","v":13},{"$f":"Q3","v":2}]
[null,{"$f":"U4","v":"B36"},{"$f":"S4","v":10},{"$f":"Q4","v":13}]
[null,"B38",11,13]
[null,"B40",2,13]
[null,"B42",13,5]
[null,"B44",8,13]
[null,"B46",7,13]
[null,"B48",13,4]
[null,{"$f":"U12","v":"B50"},{"$f":"S12","v":2},{"$f":"Q12","v":13}]
[null,"B52",13,10]
[null,"B54",13,11]
[null,"B56",13,2]
[null,"B58",5,13]
[null,"B60",13,8]
[null,"B62",13,7]
[null,"B64",4,13]
[null,{"$f":"V3","v":"C34"},{"$f":"S3","v":13},{"$f":"Q3","v":2}]
[null,{"$f":"V4","v":"C36"},{"$f":"S4","v":10},{"$f":"Q4","v":13}]
[null,"C38",11,13]
[null,"C40",2,13]
[null,"C42",13,5]
[null,"C44",8,13]
[null,"C46",7,13]
[null,"C48",13,4]
[null,{"$f":"V12","v":"C50"},{"$f":"S12","v":2},{"$f":"Q12","v":13}]
[null,"C52",13,10]
[null,"C54",13,11]
[null,"C56",13,2]
[null,"C58",5,13]
[null,"C60",13,8]
[null,"C62",13,7]
[null,"C64",4,13]

{"sheet":"Partie 2","index":2,"n_rows":218,"n_cols":27,"rows_kept":218,"cut":false,"hidden":false,"merged":[[0,0,0,22],[10,0,10,3],[10,7,10,10],[10,12,10,15],[10,19,10,22],[1,0,1,3],[1,7,1,10],[1,12,1,15],[1,19,1,22]]}
["TRIPLETTES ",null,null,null,null,null,null,null,null,null,null,null,null,null,null,null,null,null,null,null,null,null,null,null,null,null,3072022]
["Equipes ",null,null,null,"PTS     EQ 1",null,"PTS     EQ 2","Equipes ",null,null,null,null,"Equipes ",null,null,null,"PTS     EQ 1",null,"PTS     EQ 2","Equipes "]
[{"$f":"Liste!AM7","v":1},{"$f":"IFERROR(VLOOKUP($A3,Liste!$S$7:$V$70,COLUMN(),0),\"\")","v":"A1"},{"$f":"IFERROR(VLOOKUP($A3,Liste!$S$7:$V$70,COLUMN(),0),\"\")","v":"B1"},{"$f":"IFERROR(VLOOKUP($A3,Liste!$S$7:$V$70,COLUMN(),0),\"\")","v":"C1"},2,null,13,{"$f":"IFERROR(VLOOKUP($K3,Liste!$S$7:$V$70,COLUMN()-6,0),\"\")","v":"A4"},{"$f":"IFERROR(VLOOKUP($K3,Liste!$S$7:$V$70,COLUMN()-6,0),\"\")","v":"B4"},{"$f":"IFERROR(VLOOKUP($K3,Liste!$S$7:$V$70,COLUMN()-6,0),\"\")","v":"C4"},{"$f":"Liste!AO7","v":4},null,{"$f":"Liste!AM23","v":3},{"$f":"IFERROR(VLOOKUP($M3,Liste!$S$7:$V$70,COLUMN()-12,0),\"\")","v":"A3"},{"$f":"IFERROR(VLOOKUP($M3,Liste!$S$7:$V$70,COLUMN()-12,0),\"\")","v":"B3"},{"$f":"IFERROR(VLOOKUP($M3,Liste!$S$7:$V$70,COLUMN()-12,0),\"\")","v":"C3"},13,null,2,{"$f":"IFERROR(VLOOKUP($W3,Liste!$S$7:$V$70,COLUMN()-18,0),\"\")","v":"A2"},{"$f":"IFERROR(VLOOKUP($W3,Liste!$S$7:$V$70,COLUMN()-18,0),\"\")","v":"B2"},{"$f":"IFERROR(VLOOKUP($W3,Liste!$S$7:$V$70,COLUMN()-18,0),\"\")","v":"C2"},{"$f":"Liste!AO23","v":2}]
[{"$f":"Liste!AM8","v":6},{"$f":"IFERROR(VLOOKUP($A4,Liste!$S$7:$V$70,COLUMN(),0),\"\")","v":"A6"},{"$f":"IFERROR(VLOOKUP($A4,Liste!$S$7:$V$70,COLUMN(),0),\"\")","v":"B6"},{"$f":"IFERROR(VLOOKUP($A4,Liste!$S$7:$V$70,COLUMN(),0),\"\")","v":"C6"},13,null,10,{"$f":"IFERROR(VLOOKUP($K4,Liste!$S$7:$V$70,COLUMN()-6,0),\"\")","v":"A8"},{"$f":"IFERROR(VLOOKUP($K4,Liste!$S$7:$V$70,COLUMN()-6,0),\"\")","v":"B8"},{"$f":"IFERROR(VLOOKUP($K4,Liste!$S$7:$V$70,COLUMN()-6,0),\"\")","v":"C8"},{"$f":"Liste!AO8","v":8},null,{"$f":"Liste!AM24","v":7},{"$f":"IFERROR(VLOOKUP($M4,Liste!$S$7:$V$70,COLUMN()-12,0),\"\")","v":"A7"},{"$f":"IFERROR(VLOOKUP($M4,Liste!$S$7:$V$70,COLUMN()-12,0),\"\")","v":"B7"},{"$f":"IFERROR(VLOOKUP($M4,Liste!$S$7:$V$70,COLUMN()-12,0),\"\")","v":"C7"},10,null,13,{"$f":"IFERROR(VLOOKUP($W4,Liste!$S$7:$V$70,COLUMN()-18,0),\"\")","v":"A5"},{"$f":"IFERROR(VLOOKUP($W4,Liste!$S$7:$V$70,COLUMN()-18,0),\"\")","v":"B5"},{"$f":"IFERROR(VLOOKUP($W4,Liste!$S$7:$V$70,COLUMN()-18,0),\"\")","v":"C5"},{"$f":"Liste!AO24","v":5}]
[{"$f":"Liste!AM9","v":9},{"$f":"IFERROR(VLOOKUP($A5,Liste!$S$7:$V$70,COLUMN(),0),\"\")","v":"A9"},{"$f":"IFERROR(VLOOKUP($A5,Liste!$S$7:$V$70,COLUMN(),0),\"\")","v":"B9"},{"$f":"IFERROR(VLOOKUP($A5,Liste!$S$7:$V$70,COLUMN(),0),\"\")","v":"C9"},13,null,11,{"$f":"IFERROR(VLOOKUP($K5,Liste!$S$7:$V$70,COLUMN()-6,0),\"\")","v":"A12"},{"$f":"IFERROR(VLOOKUP($K5,Liste!$S$7:$V$70,COLUMN()-6,0),\"\")","v":"B12"},{"$f":"IFERROR(VLOOKUP($K5,Liste!$S$7:$V$70,COLUMN()-6,0),\"\")","v":"C12"},{"$f":"Liste!AO9","v":12},null,{"$f":"Liste!AM25","v":11},{"$f":"IFERROR(VLOOKUP($M5,Liste!$S$7:$V$70,COLUMN()-12,0),\"\")","v":"A11"},{"$f":"IFERROR(VLOOKUP($M5,Liste!$S$7:$V$70,COLUMN()-12,0),\"\")","v":"B11"},{"$f":"IFERROR(VLOOKUP($M5,Liste!$S$7:$V$70,COLUMN()-12,0),\"\")","v":"C11"},11,null,13,{"$f":"IFERROR(VLOOKUP($W5,Liste!$S$7:$V$70,COLUMN()-18,0),\"\")","v":"A10"},{"$f":"IFERROR(VLOOKUP($W5,Liste!$S$7:$V$70,COLUMN()-18,0),\"\")","v":"B10"},{"$f":"IFERROR(VLOOKUP($W5,Liste!$S$7:$V$70,COLUMN()-18,0),\"\")","v":"C10"},{"$f":"Liste!AO25","v":10}]
[{"$f":"Liste!AM10","v":14},{"$f":"IFERROR(VLOOKUP($A6,Liste!$S$7:$V$70,COLUMN(),0),\"\")","v":"A14"},{"$f":"IFERROR(VLOOKUP($A6,Liste!$S$7:$V$70,COLUMN(),0),\"\")","v":"B14"},{"$f":"IFERROR(VLOOKUP($A6,Liste!$S$7:$V$70,COLUMN(),0),\"\")","v":"C14"},13,null,2,{"$f":"IFERROR(VLOOKUP($K6,Liste!$S$7:$V$70,COLUMN()-6,0),\"\")","v":"A15"},{"$f":"IFERROR(VLOOKUP($K6,Liste!$S$7:$V$70,COLUMN()-6,0),\"\")","v":"B15"},{"$f":"IFERROR(VLOOKUP($K6,Liste!$S$7:$V$70,COLUMN()-6,0),\"\")","v":"C15"},{"$f":"Liste!AO10","v":15},null,{"$f":"Liste!AM26","v":16},{"$f":"IFERROR(VLOOKUP($M6,Liste!$S$7:$V$70,COLUMN()-12,0),\"\")","v":"A16"},{"$f":"IFERROR(VLOOKUP($M6,Liste!$S$7:$V$70,COLUMN()-12,0),\"\")","v":"B16"},{"$f":"IFERROR(VLOOKUP($M6,Liste!$S$7:$V$70,COLUMN()-12,0),\"\")","v":"C16"},2,null,13,{"$f":"IFERROR(VLOOKUP($W6,Liste!$S$7:$V$70,COLUMN()-18,0),\"\")","v":"A13"},{"$f":"IFERROR(VLOOKUP($W6,Liste!$S$7:$V$70,COLUMN()-18,0),\"\")","v":"B13"},{"$f":"IFERROR(VLOOKUP($W6,Liste!$S$7:$V$70,COLUMN()-18,0),\"\")","v":"C13"},{"$f":"Liste!AO26","v":13}]
[{"$f":"Liste!AM11","v":17},{"$f":"IFERROR(VLOOKUP($A7,Liste!$S$7:$V$70,COLUMN(),0),\"\")","v":"A17"},{"$f":"IFERROR(VLOOKUP($A7,Liste!$S$7:$V$70,COLUMN(),0),\"\")","v":"B17"},{"$f":"IFERROR(VLOOKUP($A7,Liste!$S$7:$V$70,COLUMN(),0),\"\")","v":"C17"},5,null,13,{"$f":"IFERROR(VLOOKUP($K7,Liste!$S$7:$V$70,COLUMN()-6,0),\"\")","v":"A20"},{"$f":"IFERROR(VLOOKUP($K7,Liste!$S$7:$V$70,COLUMN()-6,0),\"\")","v":"B20"},{"$f":"IFERROR(VLOOKUP($K7,Liste!$S$7:$V$70,COLUMN()-6,0),\"\")","v":"C20"},{"$f":"Liste!AO11","v":20},null,{"$f":"Liste!AM27","v":19},{"$f":"IFERROR(VLOOKUP($M7,Liste!$S$7:$V$70,COLUMN()-12,0),\"\")","v":"A19"},{"$f":"IFERROR(VLOOKUP($M7,Liste!$S$7:$V$70,COLUMN()-12,0),\"\")","v":"B19"},{"$f":"IFERROR(VLOOKUP($M7,Liste!$S$7:$V$70,COLUMN()-12,0),\"\")","v":"C19"},13,null,5,{"$f":"IFERROR(VLOOKUP($W7,Liste!$S$7:$V$70,COLUMN()-18,0),\"\")","v":"A18"},{"$f":"IFERROR(VLOOKUP($W7,Liste!$S$7:$V$70,COLUMN()-18,0),\"\")","v":"B18"},{"$f":"IFERROR(VLOOKUP($W7,Liste!$S$7:$V$70,COLUMN()-18,0),\"\")","v":"C18"},{"$f":"Liste!AO27","v":18}]
[{"$f":"Liste!AM12","v":22},{"$f":"IFERROR(VLOOKUP($A8,Liste!$S$7:$V$70,COLUMN(),0),\"\")","v":"A22"},{"$f":"IFERROR(VLOOKUP($A8,Liste!$S$7:$V$70,COLUMN(),0),\"\")","v":"B22"},{"$f":"IFERROR(VLOOKUP($A8,Liste!$S$7:$V$70,COLUMN(),0),\"\")","v":"C22"},13,null,8,{"$f":"IFERROR(VLOOKUP($K8,Liste!$S$7:$V$70,COLUMN()-6,0),\"\")","v":"A24"},{"$f":"IFERROR(VLOOKUP($K8,Liste!$S$7:$V$70,COLUMN()-6,0),\"\")","v":"B24"},{"$f":"IFERROR(VLOOKUP($K8,Liste!$S$7:$V$70,COLUMN()-6,0),\"\")","v":"C24"},{"$f":"Liste!AO12","v":24},null,{"$f":"Liste!AM28","v":23},{"$f":"IFERROR(VLOOKUP($M8,Liste!$S$7:$V$70,COLUMN()-12,0),\"\")","v":"A23"},{"$f":"IFERROR(VLOOKUP($M8,Liste!$S$7:$V$70,COLUMN()-12,0),\"\")","v":"B23"},{"$f":"IFERROR(VLOOKUP($M8,Liste!$S$7:$V$70,COLUMN()-12,0),\"\")","v":"C23"},8,null,13,{"$f":"IFERROR(VLOOKUP($W8,Liste!$S$7:$V$70,COLUMN()-18,0),\"\")","v":"A21"},{"$f":"IFERROR(VLOOKUP($W8,Liste!$S$7:$V$70,COLUMN()-18,0),\"\")","v":"B21"},{"$f":"IFERROR(VLOOKUP($W8,Liste!$S$7:$V$70,COLUMN()-18,0),\"\")","v":"C21"},{"$f":"Liste!AO28","v":21}]
[{"$f":"Liste!AM13","v":25},{"$f":"IFERROR(VLOOKUP($A9,Liste!$S$7:$V$70,COLUMN(),0),\"\")","v":"A25"},{"$f":"IFERROR(VLOOKUP($A9,Liste!$S$7:$V$70,COLUMN(),0),\"\")","v":"B25"},{"$f":"IFERROR(VLOOKUP($A9,Liste!$S$7:$V$70,COLUMN(),0),\"\")","v":"C25"},13,null,7,{"$f":"IFERROR(VLOOKUP($K9,Liste!$S$7:$V$70,COLUMN()-6,0),\"\")","v":"A28"},{"$f":"IFERROR(VLOOKUP($K9,Liste!$S$7:$V$70,COLUMN()-6,0),\"\")","v":"B28"},{"$f":"IFERROR(VLOOKUP($K9,Liste!$S$7:$V$70,COLUMN()-6,0),\"\")","v":"C28"},{"$f":"Liste!AO13","v":28},null,{"$f":"Liste!AM29","v":27},{"$f":"IFERROR(VLOOKUP($M9,Liste!$S$7:$V$70,COLUMN()-12,0),\"\")","v":"A27"},{"$f":"IFERROR(VLOOKUP($M9,Liste!$S$7:$V$70,COLUMN()-12,0),\"\")","v":"B27"},{"$f":"IFERROR(VLOOKUP($M9,Liste!$S$7:$V$70,COLUMN()-12,0),\"\")","v":"C27"},7,null,13,{"$f":"IFERROR(VLOOKUP($W9,Liste!$S$7:$V$70,COLUMN()-18,0),\"\")","v":"A26"},{"$f":"IFERROR(VLOOKUP($W9,Liste!$S$7:$V$70,COLUMN()-18,0),\"\")","v":"B26"},{"$f":"IFERROR(VLOOKUP($W9,Liste!$S$7:$V$70,COLUMN()-18,0),\"\")","v":"C26"},{"$f":"Liste!AO29","v":26}]
[{"$f":"Liste!AM14","v":30},{"$f":"IFERROR(VLOOKUP($A10,Liste!$S$7:$V$70,COLUMN(),0),\"\")","v":"A30"},{"$f":"IFERROR(VLOOKUP($A10,Liste!$S$7:$V$70,COLUMN(),0),\"\")","v":"B30"},{"$f":"IFERROR(VLOOKUP($A10,Liste!$S$7:$V$70,COLUMN(),0),\"\")","v":"C30"},4,null,13,{"$f":"IFERROR(VLOOKUP($K10,Liste!$S$7:$V$70,COLUMN()-6,0),\"\")","v":"A31"},{"$f":"IFERROR(VLOOKUP($K10,Liste!$S$7:$V$70,COLUMN()-6,0),\"\")","v":"B31"},{"$f":"IFERROR(VLOOKUP($K10,Liste!$S$7:$V$70,COLUMN()-6,0),\"\")","v":"C31"},{"$f":"Liste!AO14","v":31},null,{"$f":"Liste!AM30","v":32},{"$f":"IFERROR(VLOOKUP($M10,Liste!$S$7:$V$70,COLUMN()-12,0),\"\")","v":"A32"},{"$f":"IFERROR(VLOOKUP($M10,Liste!$S$7:$V$70,COLUMN()-12,0),\"\")","v":"B32"},{"$f":"IFERROR(VLOOKUP($M10,Liste!$S$7:$V$70,COLUMN()-12,0),\"\")","v":"C32"},13,null,4,{"$f":"IFERROR(VLOOKUP($W10,Liste!$S$7:$V$70,COLUMN()-18,0),\"\")","v":"A29"},{"$f":"IFERROR(VLOOKUP($W10,Liste!$S$7:$V$70,COLUMN()-18,0),\"\")","v":"B29"},{"$f":"IFERROR(VLOOKUP($W10,Liste!$S$7:$V$70,COLUMN()-18,0),\"\")","v":"C29"},{"$f":"Liste!AO30","v":29}]
["Equipes ",null,null,null,"PTS     EQ 1",null,"PTS     EQ 2","Equipes ",null,null,null,null,"Equipes ",null,null,null,"PTS     EQ 1",null,"PTS     EQ 2","Equipes "]
[{"$f":"Liste!AM15","v":34},{"$f":"IFERROR(VLOOKUP($A12,Liste!$S$7:$V$70,COLUMN(),0),\"\")","v":"A34"},{"$f":"IFERROR(VLOOKUP($A12,Liste!$S$7:$V$70,COLUMN(),0),\"\")","v":"B34"},{"$f":"IFERROR(VLOOKUP($A12,Liste!$S$7:$V$70,COLUMN(),0),\"\")","v":"C34"},2,null,13,{"$f":"IFERROR(VLOOKUP($K12,Liste!$S$7:$V$70,COLUMN()-6,0),\"\")","v":"A35"},{"$f":"IFERROR(VLOOKUP($K12,Liste!$S$7:$V$70,COLUMN()-6,0),\"\")","v":"B35"},{"$f":"IFERROR(VLOOKUP($K12,Liste!$S$7:$V$70,COLUMN()-6,0),\"\")","v":"C35"},{"$f":"Liste!AO15","v":35},null,{"$f":"Liste!AM31","v":36},{"$f":"IFERROR(VLOOKUP($M12,Liste!$S$7:$V$70,COLUMN()-12,0),\"\")","v":"A36"},{"$f":"IFERROR(VLOOKUP($M12,Liste!$S$7:$V$70,COLUMN()-12,0),\"\")","v":"B36"},{"$f":"IFERROR(VLOOKUP($M12,Liste!$S$7:$V$70,COLUMN()-12,0),\"\")","v":"C36"},13,null,2,{"$f":"IFERROR(VLOOKUP($W12,Liste!$S$7:$V$70,COLUMN()-18,0),\"\")","v":"A33"},{"$f":"IFERROR(VLOOKUP($W12,Liste!$S$7:$V$70,COLUMN()-18,0),\"\")","v":"B33"},{"$f":"IFERROR(VLOOKUP($W12,Liste!$S$7:$V$70,COLUMN()-18,0),\"\")","v":"C33"},{"$f":"Liste!AO31","v":33}]
[{"$f":"Liste!AM16","v":37},{"$f":"IFERROR(VLOOKUP($A13,Liste!$S$7:$V$70,COLUMN(),0),\"\")","v":"A37"},{"$f":"IFERROR(VLOOKUP($A13,Liste!$S$7:$V$70,COLUMN(),0),\"\")","v":"B37"},{"$f":"IFERROR(VLOOKUP($A13,Liste!$S$7:$V$70,COLUMN(),0),\"\")","v":"C37"},13,null,10,{"$f":"IFERROR(VLOOKUP($K13,Liste!$S$7:$V$70,COLUMN()-6,0),\"\")","v":"A39"},{"$f":"IFERROR(VLOOKUP($K13,Liste!$S$7:$V$70,COLUMN()-6,0),\"\")","v":"B39"},{"$f":"IFERROR(VLOOKUP($K13,Liste!$S$7:$V$70,COLUMN()-6,0),\"\")","v":"C39"},{"$f":"Liste!AO16","v":39},null,{"$f":"Liste!AM32","v":40},{"$f":"IFERROR(VLOOKUP($M13,Liste!$S$7:$V$70,COLUMN()-12,0),\"\")","v":"A40"},{"$f":"IFERROR(VLOOKUP($M13,Liste!$S$7:$V$70,COLUMN()-12,0),\"\")","v":"B40"},{"$f":"IFERROR(VLOOKUP($M13,Liste!$S$7:$V$70,COLUMN()-12,0),\"\")","v":"C40"},10,null,13,{"$f":"IFERROR(VLOOKUP($W13,Liste!$S$7:$V$70,COLUMN()-18,0),\"\")","v":"A38"},{"$f":"IFERROR(VLOOKUP($W13,Liste!$S$7:$V$70,COLUMN()-18,0),\"\")","v":"B38"},{"$f":"IFERROR(VLOOKUP($W13,Liste!$S$7:$V$70,COLUMN()-18,0),\"\")","v":"C38"},{"$f":"Liste!AO32","v":38}]
[{"$f":"Liste!AM17","v":42},{"$f":"IFERROR(VLOOKUP($A14,Liste!$S$7:$V$70,COLUMN(),0),\"\")","v":"A42"},{"$f":"IFERROR(VLOOKUP($A14,Liste!$S$7:$V$70,COLUMN(),0),\"\")","v":"B42"},{"$f":"IFERROR(VLOOKUP($A14,Liste!$S$7:$V$70,COLUMN(),0),\"\")","v":"C42"},13,null,11,{"$f":"IFERROR(VLOOKUP($K14,Liste!$S$7:$V$70,COLUMN()-6,0),\"\")","v":"A43"},{"$f":"IFERROR(VLOOKUP($K14,Liste!$S$7:$V$70,COLUMN()-6,0),\"\")","v":"B43"},{"$f":"IFERROR(VLOOKUP($K14,Liste!$S$7:$V$70,COLUMN()-6,0),\"\")","v":"C43"},{"$f":"Liste!AO17","v":43},null,{"$f":"Liste!AM33","v":44},{"$f":"IFERROR(VLOOKUP($M14,Liste!$S$7:$V$70,COLUMN()-12,0),\"\")","v":"A44"},{"$f":"IFERROR(VLOOKUP($M14,Liste!$S$7:$V$70,COLUMN()-12,0),\"\")","v":"B44"},{"$f":"IFERROR(VLOOKUP($M14,Liste!$S$7:$V$70,COLUMN()-12,0),\"\")","v":"C44"},11,null,13,{"$f":"IFERROR(VLOOKUP($W14,Liste!$S$7:$V$70,COLUMN()-18,0),\"\")","v":"A41"},{"$f":"IFERROR(VLOOKUP($W14,Liste!$S$7:$V$70,COLUMN()-18,0),\"\")","v":"B41"},{"$f":"IFERROR(VLOOKUP($W14,Liste!$S$7:$V$70,COLUMN()-18,0),\"\")","v":"C41"},{"$f":"Liste!AO33","v":41}]
[{"$f":"Liste!AM18","v":45},{"$f":"IFERROR(VLOOKUP($A15,Liste!$S$7:$V$70,COLUMN(),0),\"\")","v":"A45"},{"$f":"IFERROR(VLOOKUP($A15,Liste!$S$7:$V$70,COLUMN(),0),\"\")","v":"B45"},{"$f":"IFERROR(VLOOKUP($A15,Liste!$S$7:$V$70,COLUMN(),0),\"\")","v":"C45"},13,null,2,{"$f":"IFERROR(VLOOKUP($K15,Liste!$S$7:$V$70,COLUMN()-6,0),\"\")","v":"A48"},{"$f":"IFERROR(VLOOKUP($K15,Liste!$S$7:$V$70,COLUMN()-6,0),\"\")","v":"B48"},{"$f":"IFERROR(VLOOKUP($K15,Liste!$S$7:$V$70,COLUMN()-6,0),\"\")","v":"C48"},{"$f":"Liste!AO18","v":48},null,{"$f":"Liste!AM34","v":47},{"$f":"IFERROR(VLOOKUP($M15,Liste!$S$7:$V$70,COLUMN()-12,0),\"\")","v":"A47"},{"$f":"IFERROR(VLOOKUP($M15,Liste!$S$7:$V$70,COLUMN()-12,0),\"\")","v":"B47"},{"$f":"IFERROR(VLOOKUP($M15,Liste!$S$7:$V$70,COLUMN()-12,0),\"\")","v":"C47"},2,null,13,{"$f":"IFERROR(VLOOKUP($W15,Liste!$S$7:$V$70,COLUMN()-18,0),\"\")","v":"A46"},{"$f":"IFERROR(VLOOKUP($W15,Liste!$S$7:$V$70,COLUMN()-18,0),\"\")","v":"B46"},{"$f":"IFERROR(VLOOKUP($W15,Liste!$S$7:$V$70,COLUMN()-18,0),\"\")","v":"C46"},{"$f":"Liste!AO34","v":46}]
[{"$f":"Liste!AM19","v":49},{"$f":"IFERROR(VLOOKUP($A16,Liste!$S$7:$V$70,COLUMN(),0),\"\")","v":"A49"},{"$f":"IFERROR(VLOOKUP($A16,Liste!$S$7:$V$70,COLUMN(),0),\"\")","v":"B49"},{"$f":"IFERROR(VLOOKUP($A16,Liste!$S$7:$V$70,COLUMN(),0),\"\")","v":"C49"},5,null,13,{"$f":"IFERROR(VLOOKUP($K16,Liste!$S$7:$V$70,COLUMN()-6,0),\"\")","v":"A52"},{"$f":"IFERROR(VLOOKUP($K16,Liste!$S$7:$V$70,COLUMN()-6,0),\"\")","v":"B52"},{"$f":"IFERROR(VLOOKUP($K16,Liste!$S$7:$V$70,COLUMN()-6,0),\"\")","v":"C52"},{"$f":"Liste!AO19","v":52},null,{"$f":"Liste!AM35","v":51},{"$f":"IFERROR(VLOOKUP($M16,Liste!$S$7:$V$70,COLUMN()-12,0),\"\")","v":"A51"},{"$f":"IFERROR(VLOOKUP($M16,Liste!$S$7:$V$70,COLUMN()-12,0),\"\")","v":"B51"},{"$f":"IFERROR(VLOOKUP($M16,Liste!$S$7:$V$70,COLUMN()-12,0),\"\")","v":"C51"},13,null,5,{"$f":"IFERROR(VLOOKUP($W16,Liste!$S$7:$V$70,COLUMN()-18,0),\"\")","v":"A50"},{"$f":"IFERROR(VLOOKUP($W16,Liste!$S$7:$V$70,COLUMN()-18,0),\"\")","v":"B50"},{"$f":"IFERROR(VLOOKUP($W16,Liste!$S$7:$V$70,COLUMN()-18,0),\"\")","v":"C50"},{"$f":"Liste!AO35","v":50}]
[{"$f":"Liste!AM20","v":54},{"$f":"IFERROR(VLOOKUP($A17,Liste!$S$7:$V$70,COLUMN(),0),\"\")","v":"A54"},{"$f":"IFERROR(VLOOKUP($A17,Liste!$S$7:$V$70,COLUMN(),0),\"\")","v":"B54"},{"$f":"IFERROR(VLOOKUP($A17,Liste!$S$7:$V$70,COLUMN(),0),\"\")","v":"C54"},13,null,8,{"$f":"IFERROR(VLOOKUP($K17,Liste!$S$7:$V$70,COLUMN()-6,0),\"\")","v":"A56"},{"$f":"IFERROR(VLOOKUP($K17,Liste!$S$7:$V$70,COLUMN()-6,0),\"\")","v":"B56"},{"$f":"IFERROR(VLOOKUP($K17,Liste!$S$7:$V$70,COLUMN()-6,0),\"\")","v":"C56"},{"$f":"Liste!AO20","v":56},null,{"$f":"Liste!AM36","v":55},{"$f":"IFERROR(VLOOKUP($M17,Liste!$S$7:$V$70,COLUMN()-12,0),\"\")","v":"A55"},{"$f":"IFERROR(VLOOKUP($M17,Liste!$S$7:$V$70,COLUMN()-12,0),\"\")","v":"B55"},{"$f":"IFERROR(VLOOKUP($M17,Liste!$S$7:$V$70,COLUMN()-12,0),\"\")","v":"C55"},8,null,13,{"$f":"IFERROR(VLOOKUP($W17,Liste!$S$7:$V$70,COLUMN()-18,0),\"\")","v":"A53"},{"$f":"IFERROR(VLOOKUP($W17,Liste!$S$7:$V$70,COLUMN()-18,0),\"\")","v":"B53"},{"$f":"IFERROR(VLOOKUP($W17,Liste!$S$7:$V$70,COLUMN()-18,0),\"\")","v":"C53"},{"$f":"Liste!AO36","v":53}]
[{"$f":"Liste!AM21","v":57},{"$f":"IFERROR(VLOOKUP($A18,Liste!$S$7:$V$70,COLUMN(),0),\"\")","v":"A57"},{"$f":"IFERROR(VLOOKUP($A18,Liste!$S$7:$V$70,COLUMN(),0),\"\")","v":"B57"},{"$f":"IFERROR(VLOOKUP($A18,Liste!$S$7:$V$70,COLUMN(),0),\"\")","v":"C57"},13,null,7,{"$f":"IFERROR(VLOOKUP($K18,Liste!$S$7:$V$70,COLUMN()-6,0),\"\")","v":"A60"},{"$f":"IFERROR(VLOOKUP($K18,Liste!$S$7:$V$70,COLUMN()-6,0),\"\")","v":"B60"},{"$f":"IFERROR(VLOOKUP($K18,Liste!$S$7:$V$70,COLUMN()-6,0),\"\")","v":"C60"},{"$f":"Liste!AO21","v":60},null,{"$f":"Liste!AM37","v":59},{"$f":"IFERROR(VLOOKUP($M18,Liste!$S$7:$V$70,COLUMN()-12,0),\"\")","v":"A59"},{"$f":"IFERROR(VLOOKUP($M18,Liste!$S$7:$V$70,COLUMN()-12,0),\"\")","v":"B59"},{"$f":"IFERROR(VLOOKUP($M18,Liste!$S$7:$V$70,COLUMN()-12,0),\"\")","v":"C59"},7,null,13,{"$f":"IFERROR(VLOOKUP($W18,Liste!$S$7:$V$70,COLUMN()-18,0),\"\")","v":"A58"},{"$f":"IFERROR(VLOOKUP($W18,Liste!$S$7:$V$70,COLUMN()-18,0),\"\")","v":"B58"},{"$f":"IFERROR(VLOOKUP($W18,Liste!$S$7:$V$70,COLUMN()-18,0),\"\")","v":"C58"},{"$f":"Liste!AO37","v":58}]
[{"$f":"Liste!AM22","v":62},{"$f":"IFERROR(VLOOKUP($A19,Liste!$S$7:$V$70,COLUMN(),0),\"\")","v":"A62"},{"$f":"IFERROR(VLOOKUP($A19,Liste!$S$7:$V$70,COLUMN(),0),\"\")","v":"B62"},{"$f":"IFERROR(VLOOKUP($A19,Liste!$S$7:$V$70,COLUMN(),0),\"\")","v":"C62"},4,null,13,{"$f":"IFERROR(VLOOKUP($K19,Liste!$S$7:$V$70,COLUMN()-6,0),\"\")","v":"A63"},{"$f":"IFERROR(VLOOKUP($K19,Liste!$S$7:$V$70,COLUMN()-6,0),\"\")","v":"B63"},{"$f":"IFERROR(VLOOKUP($K19,Liste!$S$7:$V$70,COLUMN()-6,0),\"\")","v":"C63"},{"$f":"Liste!AO22","v":63},null,{"$f":"Liste!AM38","v":64},{"$f":"IFERROR(VLOOKUP($M19,Liste!$S$7:$V$70,COLUMN()-12,0),\"\")","v":"A64"},{"$f":"IFERROR(VLOOKUP($M19,Liste!$S$7:$V$70,COLUMN()-12,0),\"\")","v":"B64"},{"$f":"IFERROR(VLOOKUP($M19,Liste!$S$7:$V$70,COLUMN()-12,0),\"\")","v":"C64"},13,null,4,{"$f":"IFERROR(VLOOKUP($W19,Liste!$S$7:$V$70,COLUMN()-18,0),\"\")","v":"A61"},{"$f":"IFERROR(VLOOKUP($W19,Liste!$S$7:$V$70,COLUMN()-18,0),\"\")","v":"B61"},{"$f":"IFERROR(VLOOKUP($W19,Liste!$S$7:$V$70,COLUMN()-18,0),\"\")","v":"C61"},{"$f":"Liste!AO38","v":61}]
[]
[null,null,null," "]
[null,null,null,null,null,null,null,null,null," "]
[]
[]
[]
[]
[null,{"$f":"B3","v":"A1"},{"$f":"E3","v":2},{"$f":"G3","v":13}]
[null,{"$f":"B4","v":"A6"},{"$f":"E4","v":13},{"$f":"G4","v":10}]
[null,"A9",13,11]
[null,"A14",13,2]
[null,"A17",5,13]
[null,"A22",13,8]
[null,"A25",13,7]
[null,"A30",4,13]
[null,{"$f":"B12","v":"A34"},{"$f":"E12","v":2},{"$f":"G12","v":13}]
[null,"A37",13,10]
[null,"A42",13,11]
[null,"A45",13,2]
[null,"A49",5,13]
[null,"A54",13,8]
[null,"A57",13,7]
[null,"A62",4,13]
[null,{"$f":"H3","v":"A4"},{"$f":"G3","v":13},{"$f":"E3","v":2}]
[null,{"$f":"H4","v":"A8"},{"$f":"G4","v":10},{"$f":"E4","v":13}]
[null,"A12",11,13]
[null,"A15",2,13]
[null,"A20",13,5]
[null,"A24",8,13]
[null,"A28",7,13]
[null,"A31",13,4]
[null,{"$f":"H12","v":"A35"},{"$f":"G12","v":13},{"$f":"E12","v":2}]
[null,"A39",10,13]
[null,"A43",11,13]
[null,"A48",2,13]
[null,"A52",13,5]
[null,"A56",8,13]
[null,"A60",7,13]
[null,"A63",13,4]
[null,{"$f":"N3","v":"A3"},{"$f":"Q3","v":13},{"$f":"S3","v":2}]
[null,{"$f":"N4","v":"A7"},{"$f":"Q4","v":10},{"$f":"S4","v":13}]
[null,"A11",11,13]
[null,"A16",2,13]
[null,"A19",13,5]
[null,"A23",8,13]
[null,"A27",7,13]
[null,"A32",13,4]
[null,{"$f":"N12","v":"A36"},{"$f":"Q12","v":13},{"$f":"S12","v":2}]
[null,"A40",10,13]
[null,"A44",11,13]
[null,"A47",2,13]
[null,"A51",13,5]
[null,"A55",8,13]
[null,"A59",7,13]
[null,"A64",13,4]
[null,{"$f":"T3","v":"A2"},{"$f":"S3","v":2},{"$f":"Q3","v":13}]
[null,{"$f":"T4","v":"A5"},{"$f":"S4","v":13},{"$f":"Q4","v":10}]
[null,"A10",13,11]
[null,"A13",13,2]
[null,"A18",5,13]
[null,"A21",13,8]
[null,"A26",13,7]
[null,"A29",4,13]
[null,{"$f":"T12","v":"A33"},{"$f":"S12","v":2},{"$f":"Q12","v":13}]
[null,"A38",13,10]
[null,"A41",13,11]
[null,"A46",13,2]
[null,"A50",5,13]
[null,"A53",13,8]
[null,"A58",13,7]
[null,"A61",4,13]
[null,{"$f":"C3","v":"B1"},{"$f":"E3","v":2},{"$f":"G3","v":13}]
[null,{"$f":"C4","v":"B6"},{"$f":"E4","v":13},{"$f":"G4","v":10}]
[null,"B9",13,11]
[null,"B14",13,2]
[null,"B17",5,13]
[null,"B22",13,8]
[null,"B25",13,7]
[null,"B30",4,13]
[null,{"$f":"C12","v":"B34"},{"$f":"E12","v":2},{"$f":"G12","v":13}]
[null,"B37",13,10]
[null,"B42",13,11]
[null,"B45",13,2]
[null,"B49",5,13]
[null,"B54",13,8]
[null,"B57",13,7]
[null,"B62",4,13]
[null,{"$f":"D3","v":"C1"},{"$f":"E3","v":2},{"$f":"G3","v":13}]
[null,{"$f":"D4","v":"C6"},{"$f":"E4","v":13},{"$f":"G4","v":10}]
[null,"C9",13,11]
[null,"C14",13,2]
[null,"C17",5,13]
[null,"C22",13,8]
[null,"C25",13,7]
[null,"C30",4,13]
[null,{"$f":"D12","v":"C34"},2,{"$f":"G12","v":13}]
[null,"C37",13,10]
[null,"C42",13,11]
[null,"C45",13,2]
[null,"C49",5,13]
[null,"C54",13,8]
[null,"C57",13,7]
[null,"C62",4,13]
[null,{"$f":"I3","v":"B4"},{"$f":"G3","v":13},{"$f":"E3","v":2}]
[null,{"$f":"I4","v":"B8"},{"$f":"G4","v":10},{"$f":"E4","v":13}]
[null,"B12",11,13]
[null,"B15",2,13]
[null,"B20",13,5]
[null,"B24",8,13]
[null,"B28",7,13]
[null,"B31",13,4]
[null,{"$f":"I12","v":"B35"},{"$f":"G12","v":13},{"$f":"E12","v":2}]
[null,"B39",10,13]
[null,"B43",11,13]
[null,"B48",2,13]
[null,"B52",13,5]
[null,"B56",8,13]
[null,"B60",7,13]
[null,"B63",13,4]
[null,{"$f":"J3","v":"C4"},{"$f":"G3","v":13},{"$f":"E3","v":2}]
[null,{"$f":"J4","v":"C8"},{"$f":"G4","v":10},{"$f":"E4","v":13}]
[null,"C12",11,13]
[null,"C15",2,13]
[null,"C20",13,5]
[null,"C24",8,13]
[null,"C28",7,13]
[null,"C31",13,4]
[null,{"$f":"J12","v":"C35"},{"$f":"G12","v":13},{"$f":"E12","v":2}]
[null,"C39",10,13]
[null,"C43",11,13]
[null,"C48",2,13]
[null,"C52",13,5]
[null,"C56",8,13]
[null,"C60",7,13]
[null,"C63",13,4]
[null,{"$f":"O3","v":"B3"},{"$f":"Q3","v":13},{"$f":"S3","v":2}]
[null,{"$f":"O4","v":"B7"},{"$f":"Q4","v":10},{"$f":"S4","v":13}]
[null,"B11",11,13]
[null,"B16",2,13]
[null,"B19",13,5]
[null,"B23",8,13]
[null,"B27",7,13]
[null,"B32",13,4]
[null,{"$f":"O12","v":"B36"},{"$f":"Q12","v":13},{"$f":"S12","v":2}]
[null,"B40",10,13]
[null,"B44",11,13]
[null,"B47",2,13]
[null,"B51",13,5]
[null,"B55",8,13]
[null,"B59",7,13]
[null,"B64",13,4]
[null,{"$f":"P3","v":"C3"},{"$f":"Q3","v":13},{"$f":"S3","v":2}]
[null,{"$f":"P4","v":"C7"},10,{"$f":"S4","v":13}]
[null,"C11",11,13]
[null,"C16",2,13]
[null,"C19",13,5]
[null,"C23",8,13]
[null,"C27",7,13]
[null,"C32",13,4]
[null,{"$f":"P12","v":"C36"},13,{"$f":"S12","v":2}]
[null,"C40",10,13]
[null,"C44",11,13]
[null,"C47",2,13]
[null,"C51",13,5]
[null,"C55",8,13]
[null,"C59",7,13]
[null,"C64",13,4]
[null,{"$f":"U3","v":"B2"},{"$f":"S3","v":2},{"$f":"Q3","v":13}]
[null,{"$f":"U4","v":"B5"},{"$f":"S4","v":13},{"$f":"Q4","v":10}]
[null,"B10",13,11]
[null,"B13",13,2]
[null,"B18",5,13]
[null,"B21",13,8]
[null,"B26",13,7]
[null,"B29",4,13]
[null,{"$f":"U12","v":"B33"},{"$f":"S12","v":2},{"$f":"Q12","v":13}]
[null,"B38",13,10]
[null,"B41",13,11]
[null,"B46",13,2]
[null,"B50",5,13]
[null,"B53",13,8]
[null,"B58",13,7]
[null,"B61",4,13]
[null,{"$f":"V3","v":"C2"},{"$f":"S3","v":2},{"$f":"Q3","v":13}]
[null,{"$f":"V4","v":"C5"},{"$f":"S4","v":13},{"$f":"Q4","v":10}]
[null,"C10",13,11]
[null,"C13",13,2]
[null,"C18",5,13]
[null,"C21",13,8]
[null,"C26",13,7]
[null,"C29",4,13]
[null,{"$f":"V12","v":"C33"},{"$f":"S12","v":2},{"$f":"Q12","v":13}]
[null,"C38",13,10]
[null,"C41",13,11]
[null,"C46",13,2]
[null,"C50",5,13]
[null,"C53",13,8]
[null,"C58",13,7]
[null,"C61",4,13]

{"sheet":"Partie 3","index":3,"n_rows":218,"n_cols":27,"rows_kept":218,"cut":false,"hidden":false,"merged":[[10,0,10,3],[10,7,10,10],[10,12,10,15],[10,19,10,22],[0,0,0,22],[1,0,1,3],[1,7,1,10],[1,12,1,15],[1,19,1,22]]}
["TRIPLETTES ",null,null,null,null,null,null,null,null,null,null,null,null,null,null,null,null,null,null,null,null,null,null,null,null,null,30072022]
["Equipes ",null,null,null,"PTS     EQ 1",null,"PTS     EQ 2","Equipes ",null,null,null,null,"Equipes ",null,null,null,"PTS     EQ 1",null,"PTS     EQ 2","Equipes "]
[{"$f":"Liste!AT7","v":4},{"$f":"IFERROR(VLOOKUP($A3,Liste!$W$7:$Z$70,COLUMN(),0),\"\")","v":"A4"},{"$f":"IFERROR(VLOOKUP($A3,Liste!$W$7:$Z$70,COLUMN(),0),\"\")","v":"B4"},{"$f":"IFERROR(VLOOKUP($A3,Liste!$W$7:$Z$70,COLUMN(),0),\"\")","v":"C4"},2,null,13,{"$f":"IFERROR(VLOOKUP($K3,Liste!$W$7:$Z$70,COLUMN()-6,0),\"\")","v":"A6"},{"$f":"IFERROR(VLOOKUP($K3,Liste!$W$7:$Z$70,COLUMN()-6,0),\"\")","v":"B6"},{"$f":"IFERROR(VLOOKUP($K3,Liste!$W$7:$Z$70,COLUMN()-6,0),\"\")","v":"C6"},{"$f":"Liste!AV7","v":6},null,{"$f":"Liste!AT23","v":8},{"$f":"IFERROR(VLOOKUP($M3,Liste!$W$7:$Z$70,COLUMN()-12,0),\"\")","v":"A8"},{"$f":"IFERROR(VLOOKUP($M3,Liste!$W$7:$Z$70,COLUMN()-12,0),\"\")","v":"B8"},{"$f":"IFERROR(VLOOKUP($M3,Liste!$W$7:$Z$70,COLUMN()-12,0),\"\")","v":"C8"},13,null,2,{"$f":"IFERROR(VLOOKUP($W3,Liste!$W$7:$Z$70,COLUMN()-18,0),\"\")","v":"A1"},{"$f":"IFERROR(VLOOKUP($W3,Liste!$W$7:$Z$70,COLUMN()-18,0),\"\")","v":"B1"},{"$f":"IFERROR(VLOOKUP($W3,Liste!$W$7:$Z$70,COLUMN()-18,0),\"\")","v":"C1"},{"$f":"Liste!AV23","v":1}]
[{"$f":"Liste!AT8","v":9},{"$f":"IFERROR(VLOOKUP($A4,Liste!$W$7:$Z$70,COLUMN(),0),\"\")","v":"A9"},{"$f":"IFERROR(VLOOKUP($A4,Liste!$W$7:$Z$70,COLUMN(),0),\"\")","v":"B9"},{"$f":"IFERROR(VLOOKUP($A4,Liste!$W$7:$Z$70,COLUMN(),0),\"\")","v":"C9"},13,null,10,{"$f":"IFERROR(VLOOKUP($K4,Liste!$W$7:$Z$70,COLUMN()-6,0),\"\")","v":"A14"},{"$f":"IFERROR(VLOOKUP($K4,Liste!$W$7:$Z$70,COLUMN()-6,0),\"\")","v":"B14"},{"$f":"IFERROR(VLOOKUP($K4,Liste!$W$7:$Z$70,COLUMN()-6,0),\"\")","v":"C14"},{"$f":"Liste!AV8","v":14},null,{"$f":"Liste!AT24","v":15},{"$f":"IFERROR(VLOOKUP($M4,Liste!$W$7:$Z$70,COLUMN()-12,0),\"\")","v":"A15"},{"$f":"IFERROR(VLOOKUP($M4,Liste!$W$7:$Z$70,COLUMN()-12,0),\"\")","v":"B15"},{"$f":"IFERROR(VLOOKUP($M4,Liste!$W$7:$Z$70,COLUMN()-12,0),\"\")","v":"C15"},10,null,13,{"$f":"IFERROR(VLOOKUP($W4,Liste!$W$7:$Z$70,COLUMN()-18,0),\"\")","v":"A12"},{"$f":"IFERROR(VLOOKUP($W4,Liste!$W$7:$Z$70,COLUMN()-18,0),\"\")","v":"B12"},{"$f":"IFERROR(VLOOKUP($W4,Liste!$W$7:$Z$70,COLUMN()-18,0),\"\")","v":"C12"},{"$f":"Liste!AV24","v":12}]
[{"$f":"Liste!AT9","v":20},{"$f":"IFERROR(VLOOKUP($A5,Liste!$W$7:$Z$70,COLUMN(),0),\"\")","v":"A20"},{"$f":"IFERROR(VLOOKUP($A5,Liste!$W$7:$Z$70,COLUMN(),0),\"\")","v":"B20"},{"$f":"IFERROR(VLOOKUP($A5,Liste!$W$7:$Z$70,COLUMN(),0),\"\")","v":"C20"},13,null,11,{"$f":"IFERROR(VLOOKUP($K5,Liste!$W$7:$Z$70,COLUMN()-6,0),\"\")","v":"A22"},{"$f":"IFERROR(VLOOKUP($K5,Liste!$W$7:$Z$70,COLUMN()-6,0),\"\")","v":"B22"},{"$f":"IFERROR(VLOOKUP($K5,Liste!$W$7:$Z$70,COLUMN()-6,0),\"\")","v":"C22"},{"$f":"Liste!AV9","v":22},null,{"$f":"Liste!AT25","v":24},{"$f":"IFERROR(VLOOKUP($M5,Liste!$W$7:$Z$70,COLUMN()-12,0),\"\")","v":"A24"},{"$f":"IFERROR(VLOOKUP($M5,Liste!$W$7:$Z$70,COLUMN()-12,0),\"\")","v":"B24"},{"$f":"IFERROR(VLOOKUP($M5,Liste!$W$7:$Z$70,COLUMN()-12,0),\"\")","v":"C24"},11,null,13,{"$f":"IFERROR(VLOOKUP($W5,Liste!$W$7:$Z$70,COLUMN()-18,0),\"\")","v":"A17"},{"$f":"IFERROR(VLOOKUP($W5,Liste!$W$7:$Z$70,COLUMN()-18,0),\"\")","v":"B17"},{"$f":"IFERROR(VLOOKUP($W5,Liste!$W$7:$Z$70,COLUMN()-18,0),\"\")","v":"C17"},{"$f":"Liste!AV25","v":17}]
[{"$f":"Liste!AT10","v":25},{"$f":"IFERROR(VLOOKUP($A6,Liste!$W$7:$Z$70,COLUMN(),0),\"\")","v":"A25"},{"$f":"IFERROR(VLOOKUP($A6,Liste!$W$7:$Z$70,COLUMN(),0),\"\")","v":"B25"},{"$f":"IFERROR(VLOOKUP($A6,Liste!$W$7:$Z$70,COLUMN(),0),\"\")","v":"C25"},13,null,2,{"$f":"IFERROR(VLOOKUP($K6,Liste!$W$7:$Z$70,COLUMN()-6,0),\"\")","v":"A31"},{"$f":"IFERROR(VLOOKUP($K6,Liste!$W$7:$Z$70,COLUMN()-6,0),\"\")","v":"B31"},{"$f":"IFERROR(VLOOKUP($K6,Liste!$W$7:$Z$70,COLUMN()-6,0),\"\")","v":"C31"},{"$f":"Liste!AV10","v":31},null,{"$f":"Liste!AT26","v":30},{"$f":"IFERROR(VLOOKUP($M6,Liste!$W$7:$Z$70,COLUMN()-12,0),\"\")","v":"A30"},{"$f":"IFERROR(VLOOKUP($M6,Liste!$W$7:$Z$70,COLUMN()-12,0),\"\")","v":"B30"},{"$f":"IFERROR(VLOOKUP($M6,Liste!$W$7:$Z$70,COLUMN()-12,0),\"\")","v":"C30"},2,null,13,{"$f":"IFERROR(VLOOKUP($W6,Liste!$W$7:$Z$70,COLUMN()-18,0),\"\")","v":"A28"},{"$f":"IFERROR(VLOOKUP($W6,Liste!$W$7:$Z$70,COLUMN()-18,0),\"\")","v":"B28"},{"$f":"IFERROR(VLOOKUP($W6,Liste!$W$7:$Z$70,COLUMN()-18,0),\"\")","v":"C28"},{"$f":"Liste!AV26","v":28}]
[{"$f":"Liste!AT11","v":35},{"$f":"IFERROR(VLOOKUP($A7,Liste!$W$7:$Z$70,COLUMN(),0),\"\")","v":"A35"},{"$f":"IFERROR(VLOOKUP($A7,Liste!$W$7:$Z$70,COLUMN(),0),\"\")","v":"B35"},{"$f":"IFERROR(VLOOKUP($A7,Liste!$W$7:$Z$70,COLUMN(),0),\"\")","v":"C35"},5,null,13,{"$f":"IFERROR(VLOOKUP($K7,Liste!$W$7:$Z$70,COLUMN()-6,0),\"\")","v":"A37"},{"$f":"IFERROR(VLOOKUP($K7,Liste!$W$7:$Z$70,COLUMN()-6,0),\"\")","v":"B37"},{"$f":"IFERROR(VLOOKUP($K7,Liste!$W$7:$Z$70,COLUMN()-6,0),\"\")","v":"C37"},{"$f":"Liste!AV11","v":37},null,{"$f":"Liste!AT27","v":39},{"$f":"IFERROR(VLOOKUP($M7,Liste!$W$7:$Z$70,COLUMN()-12,0),\"\")","v":"A39"},{"$f":"IFERROR(VLOOKUP($M7,Liste!$W$7:$Z$70,COLUMN()-12,0),\"\")","v":"B39"},{"$f":"IFERROR(VLOOKUP($M7,Liste!$W$7:$Z$70,COLUMN()-12,0),\"\")","v":"C39"},13,null,5,{"$f":"IFERROR(VLOOKUP($W7,Liste!$W$7:$Z$70,COLUMN()-18,0),\"\")","v":"A34"},{"$f":"IFERROR(VLOOKUP($W7,Liste!$W$7:$Z$70,COLUMN()-18,0),\"\")","v":"B34"},{"$f":"IFERROR(VLOOKUP($W7,Liste!$W$7:$Z$70,COLUMN()-18,0),\"\")","v":"C34"},{"$f":"Liste!AV27","v":34}]
[{"$f":"Liste!AT12","v":42},{"$f":"IFERROR(VLOOKUP($A8,Liste!$W$7:$Z$70,COLUMN(),0),\"\")","v":"A42"},{"$f":"IFERROR(VLOOKUP($A8,Liste!$W$7:$Z$70,COLUMN(),0),\"\")","v":"B42"},{"$f":"IFERROR(VLOOKUP($A8,Liste!$W$7:$Z$70,COLUMN(),0),\"\")","v":"C42"},13,null,8,{"$f":"IFERROR(VLOOKUP($K8,Liste!$W$7:$Z$70,COLUMN()-6,0),\"\")","v":"A45"},{"$f":"IFERROR(VLOOKUP($K8,Liste!$W$7:$Z$70,COLUMN()-6,0),\"\")","v":"B45"},{"$f":"IFERROR(VLOOKUP($K8,Liste!$W$7:$Z$70,COLUMN()-6,0),\"\")","v":"C45"},{"$f":"Liste!AV12","v":45},null,{"$f":"Liste!AT28","v":48},{"$f":"IFERROR(VLOOKUP($M8,Liste!$W$7:$Z$70,COLUMN()-12,0),\"\")","v":"A48"},{"$f":"IFERROR(VLOOKUP($M8,Liste!$W$7:$Z$70,COLUMN()-12,0),\"\")","v":"B48"},{"$f":"IFERROR(VLOOKUP($M8,Liste!$W$7:$Z$70,COLUMN()-12,0),\"\")","v":"C48"},8,null,13,{"$f":"IFERROR(VLOOKUP($W8,Liste!$W$7:$Z$70,COLUMN()-18,0),\"\")","v":"A43"},{"$f":"IFERROR(VLOOKUP($W8,Liste!$W$7:$Z$70,COLUMN()-18,0),\"\")","v":"B43"},{"$f":"IFERROR(VLOOKUP($W8,Liste!$W$7:$Z$70,COLUMN()-18,0),\"\")","v":"C43"},{"$f":"Liste!AV28","v":43}]
[{"$f":"Liste!AT13","v":52},{"$f":"IFERROR(VLOOKUP($A9,Liste!$W$7:$Z$70,COLUMN(),0),\"\")","v":"A52"},{"$f":"IFERROR(VLOOKUP($A9,Liste!$W$7:$Z$70,COLUMN(),0),\"\")","v":"B52"},{"$f":"IFERROR(VLOOKUP($A9,Liste!$W$7:$Z$70,COLUMN(),0),\"\")","v":"C52"},13,null,7,{"$f":"IFERROR(VLOOKUP($K9,Liste!$W$7:$Z$70,COLUMN()-6,0),\"\")","v":"A54"},{"$f":"IFERROR(VLOOKUP($K9,Liste!$W$7:$Z$70,COLUMN()-6,0),\"\")","v":"B54"},{"$f":"IFERROR(VLOOKUP($K9,Liste!$W$7:$Z$70,COLUMN()-6,0),\"\")","v":"C54"},{"$f":"Liste!AV13","v":54},null,{"$f":"Liste!AT29","v":56},{"$f":"IFERROR(VLOOKUP($M9,Liste!$W$7:$Z$70,COLUMN()-12,0),\"\")","v":"A56"},{"$f":"IFERROR(VLOOKUP($M9,Liste!$W$7:$Z$70,COLUMN()-12,0),\"\")","v":"B56"},{"$f":"IFERROR(VLOOKUP($M9,Liste!$W$7:$Z$70,COLUMN()-12,0),\"\")","v":"C56"},7,null,13,{"$f":"IFERROR(VLOOKUP($W9,Liste!$W$7:$Z$70,COLUMN()-18,0),\"\")","v":"A49"},{"$f":"IFERROR(VLOOKUP($W9,Liste!$W$7:$Z$70,COLUMN()-18,0),\"\")","v":"B49"},{"$f":"IFERROR(VLOOKUP($W9,Liste!$W$7:$Z$70,COLUMN()-18,0),\"\")","v":"C49"},{"$f":"Liste!AV29","v":49}]
[{"$f":"Liste!AT14","v":57},{"$f":"IFERROR(VLOOKUP($A10,Liste!$W$7:$Z$70,COLUMN(),0),\"\")","v":"A57"},{"$f":"IFERROR(VLOOKUP($A10,Liste!$W$7:$Z$70,COLUMN(),0),\"\")","v":"B57"},{"$f":"IFERROR(VLOOKUP($A10,Liste!$W$7:$Z$70,COLUMN(),0),\"\")","v":"C57"},4,null,13,{"$f":"IFERROR(VLOOKUP($K10,Liste!$W$7:$Z$70,COLUMN()-6,0),\"\")","v":"A63"},{"$f":"IFERROR(VLOOKUP($K10,Liste!$W$7:$Z$70,COLUMN()-6,0),\"\")","v":"B63"},{"$f":"IFERROR(VLOOKUP($K10,Liste!$W$7:$Z$70,COLUMN()-6,0),\"\")","v":"C63"},{"$f":"Liste!AV14","v":63},null,{"$f":"Liste!AT30","v":62},{"$f":"IFERROR(VLOOKUP($M10,Liste!$W$7:$Z$70,COLUMN()-12,0),\"\")","v":"A62"},{"$f":"IFERROR(VLOOKUP($M10,Liste!$W$7:$Z$70,COLUMN()-12,0),\"\")","v":"B62"},{"$f":"IFERROR(VLOOKUP($M10,Liste!$W$7:$Z$70,COLUMN()-12,0),\"\")","v":"C62"},13,null,4,{"$f":"IFERROR(VLOOKUP($W10,Liste!$W$7:$Z$70,COLUMN()-18,0),\"\")","v":"A60"},{"$f":"IFERROR(VLOOKUP($W10,Liste!$W$7:$Z$70,COLUMN()-18,0),\"\")","v":"B60"},{"$f":"IFERROR(VLOOKUP($W10,Liste!$W$7:$Z$70,COLUMN()-18,0),\"\")","v":"C60"},{"$f":"Liste!AV30","v":60}]
["Equipes ",null,null,null,"PTS     EQ 1",null,"PTS     EQ 2","Equipes ",null,null,null,null,"Equipes ",null,null,null,"PTS     EQ 1",null,"PTS     EQ 2","Equipes "]
[{"$f":"Liste!AT15","v":3},{"$f":"IFERROR(VLOOKUP($A12,Liste!$W$7:$Z$70,COLUMN(),0),\"\")","v":"A3"},{"$f":"IFERROR(VLOOKUP($A12,Liste!$W$7:$Z$70,COLUMN(),0),\"\")","v":"B3"},{"$f":"IFERROR(VLOOKUP($A12,Liste!$W$7:$Z$70,COLUMN(),0),\"\")","v":"C3"},2,null,13,{"$f":"IFERROR(VLOOKUP($K12,Liste!$W$7:$Z$70,COLUMN()-6,0),\"\")","v":"A5"},{"$f":"IFERROR(VLOOKUP($K12,Liste!$W$7:$Z$70,COLUMN()-6,0),\"\")","v":"B5"},{"$f":"IFERROR(VLOOKUP($K12,Liste!$W$7:$Z$70,COLUMN()-6,0),\"\")","v":"C5"},{"$f":"Liste!AV15","v":5},null,{"$f":"Liste!AT31","v":7},{"$f":"IFERROR(VLOOKUP($M12,Liste!$W$7:$Z$70,COLUMN()-12,0),\"\")","v":"A7"},{"$f":"IFERROR(VLOOKUP($M12,Liste!$W$7:$Z$70,COLUMN()-12,0),\"\")","v":"B7"},{"$f":"IFERROR(VLOOKUP($M12,Liste!$W$7:$Z$70,COLUMN()-12,0),\"\")","v":"C7"},13,null,2,{"$f":"IFERROR(VLOOKUP($W12,Liste!$W$7:$Z$70,COLUMN()-18,0),\"\")","v":"A2"},{"$f":"IFERROR(VLOOKUP($W12,Liste!$W$7:$Z$70,COLUMN()-18,0),\"\")","v":"B2"},{"$f":"IFERROR(VLOOKUP($W12,Liste!$W$7:$Z$70,COLUMN()-18,0),\"\")","v":"C2"},{"$f":"Liste!AV31","v":2}]
[{"$f":"Liste!AT16","v":10},{"$f":"IFERROR(VLOOKUP($A13,Liste!$W$7:$Z$70,COLUMN(),0),\"\")","v":"A10"},{"$f":"IFERROR(VLOOKUP($A13,Liste!$W$7:$Z$70,COLUMN(),0),\"\")","v":"B10"},{"$f":"IFERROR(VLOOKUP($A13,Liste!$W$7:$Z$70,COLUMN(),0),\"\")","v":"C10"},13,null,10,{"$f":"IFERROR(VLOOKUP($K13,Liste!$W$7:$Z$70,COLUMN()-6,0),\"\")","v":"A13"},{"$f":"IFERROR(VLOOKUP($K13,Liste!$W$7:$Z$70,COLUMN()-6,0),\"\")","v":"B13"},{"$f":"IFERROR(VLOOKUP($K13,Liste!$W$7:$Z$70,COLUMN()-6,0),\"\")","v":"C13"},{"$f":"Liste!AV16","v":13},null,{"$f":"Liste!AT32","v":16},{"$f":"IFERROR(VLOOKUP($M13,Liste!$W$7:$Z$70,COLUMN()-12,0),\"\")","v":"A16"},{"$f":"IFERROR(VLOOKUP($M13,Liste!$W$7:$Z$70,COLUMN()-12,0),\"\")","v":"B16"},{"$f":"IFERROR(VLOOKUP($M13,Liste!$W$7:$Z$70,COLUMN()-12,0),\"\")","v":"C16"},10,null,13,{"$f":"IFERROR(VLOOKUP($W13,Liste!$W$7:$Z$70,COLUMN()-18,0),\"\")","v":"A11"},{"$f":"IFERROR(VLOOKUP($W13,Liste!$W$7:$Z$70,COLUMN()-18,0),\"\")","v":"B11"},{"$f":"IFERROR(VLOOKUP($W13,Liste!$W$7:$Z$70,COLUMN()-18,0),\"\")","v":"C11"},{"$f":"Liste!AV32","v":11}]
[{"$f":"Liste!AT17","v":19},{"$f":"IFERROR(VLOOKUP($A14,Liste!$W$7:$Z$70,COLUMN(),0),\"\")","v":"A19"},{"$f":"IFERROR(VLOOKUP($A14,Liste!$W$7:$Z$70,COLUMN(),0),\"\")","v":"B19"},{"$f":"IFERROR(VLOOKUP($A14,Liste!$W$7:$Z$70,COLUMN(),0),\"\")","v":"C19"},13,null,11,{"$f":"IFERROR(VLOOKUP($K14,Liste!$W$7:$Z$70,COLUMN()-6,0),\"\")","v":"A21"},{"$f":"IFERROR(VLOOKUP($K14,Liste!$W$7:$Z$70,COLUMN()-6,0),\"\")","v":"B21"},{"$f":"IFERROR(VLOOKUP($K14,Liste!$W$7:$Z$70,COLUMN()-6,0),\"\")","v":"C21"},{"$f":"Liste!AV17","v":21},null,{"$f":"Liste!AT33","v":23},{"$f":"IFERROR(VLOOKUP($M14,Liste!$W$7:$Z$70,COLUMN()-12,0),\"\")","v":"A23"},{"$f":"IFERROR(VLOOKUP($M14,Liste!$W$7:$Z$70,COLUMN()-12,0),\"\")","v":"B23"},{"$f":"IFERROR(VLOOKUP($M14,Liste!$W$7:$Z$70,COLUMN()-12,0),\"\")","v":"C23"},11,null,13,{"$f":"IFERROR(VLOOKUP($W14,Liste!$W$7:$Z$70,COLUMN()-18,0),\"\")","v":"A18"},{"$f":"IFERROR(VLOOKUP($W14,Liste!$W$7:$Z$70,COLUMN()-18,0),\"\")","v":"B18"},{"$f":"IFERROR(VLOOKUP($W14,Liste!$W$7:$Z$70,COLUMN()-18,0),\"\")","v":"C18"},{"$f":"Liste!AV33","v":18}]
[{"$f":"Liste!AT18","v":26},{"$f":"IFERROR(VLOOKUP($A15,Liste!$W$7:$Z$70,COLUMN(),0),\"\")","v":"A26"},{"$f":"IFERROR(VLOOKUP($A15,Liste!$W$7:$Z$70,COLUMN(),0),\"\")","v":"B26"},{"$f":"IFERROR(VLOOKUP($A15,Liste!$W$7:$Z$70,COLUMN(),0),\"\")","v":"C26"},13,null,2,{"$f":"IFERROR(VLOOKUP($K15,Liste!$W$7:$Z$70,COLUMN()-6,0),\"\")","v":"A32"},{"$f":"IFERROR(VLOOKUP($K15,Liste!$W$7:$Z$70,COLUMN()-6,0),\"\")","v":"B32"},{"$f":"IFERROR(VLOOKUP($K15,Liste!$W$7:$Z$70,COLUMN()-6,0),\"\")","v":"C32"},{"$f":"Liste!AV18","v":32},null,{"$f":"Liste!AT34","v":29},{"$f":"IFERROR(VLOOKUP($M15,Liste!$W$7:$Z$70,COLUMN()-12,0),\"\")","v":"A29"},{"$f":"IFERROR(VLOOKUP($M15,Liste!$W$7:$Z$70,COLUMN()-12,0),\"\")","v":"B29"},{"$f":"IFERROR(VLOOKUP($M15,Liste!$W$7:$Z$70,COLUMN()-12,0),\"\")","v":"C29"},2,null,13,{"$f":"IFERROR(VLOOKUP($W15,Liste!$W$7:$Z$70,COLUMN()-18,0),\"\")","v":"A27"},{"$f":"IFERROR(VLOOKUP($W15,Liste!$W$7:$Z$70,COLUMN()-18,0),\"\")","v":"B27"},{"$f":"IFERROR(VLOOKUP($W15,Liste!$W$7:$Z$70,COLUMN()-18,0),\"\")","v":"C27"},{"$f":"Liste!AV34","v":27}]
[{"$f":"Liste!AT19","v":36},{"$f":"IFERROR(VLOOKUP($A16,Liste!$W$7:$Z$70,COLUMN(),0),\"\")","v":"A36"},{"$f":"IFERROR(VLOOKUP($A16,Liste!$W$7:$Z$70,COLUMN(),0),\"\")","v":"B36"},{"$f":"IFERROR(VLOOKUP($A16,Liste!$W$7:$Z$70,COLUMN(),0),\"\")","v":"C36"},5,null,13,{"$f":"IFERROR(VLOOKUP($K16,Liste!$W$7:$Z$70,COLUMN()-6,0),\"\")","v":"A38"},{"$f":"IFERROR(VLOOKUP($K16,Liste!$W$7:$Z$70,COLUMN()-6,0),\"\")","v":"B38"},{"$f":"IFERROR(VLOOKUP($K16,Liste!$W$7:$Z$70,COLUMN()-6,0),\"\")","v":"C38"},{"$f":"Liste!AV19","v":38},null,{"$f":"Liste!AT35","v":40},{"$f":"IFERROR(VLOOKUP($M16,Liste!$W$7:$Z$70,COLUMN()-12,0),\"\")","v":"A40"},{"$f":"IFERROR(VLOOKUP($M16,Liste!$W$7:$Z$70,COLUMN()-12,0),\"\")","v":"B40"},{"$f":"IFERROR(VLOOKUP($M16,Liste!$W$7:$Z$70,COLUMN()-12,0),\"\")","v":"C40"},13,null,5,{"$f":"IFERROR(VLOOKUP($W16,Liste!$W$7:$Z$70,COLUMN()-18,0),\"\")","v":"A33"},{"$f":"IFERROR(VLOOKUP($W16,Liste!$W$7:$Z$70,COLUMN()-18,0),\"\")","v":"B33"},{"$f":"IFERROR(VLOOKUP($W16,Liste!$W$7:$Z$70,COLUMN()-18,0),\"\")","v":"C33"},{"$f":"Liste!AV35","v":33}]
[{"$f":"Liste!AT20","v":41},{"$f":"IFERROR(VLOOKUP($A17,Liste!$W$7:$Z$70,COLUMN(),0),\"\")","v":"A41"},{"$f":"IFERROR(VLOOKUP($A17,Liste!$W$7:$Z$70,COLUMN(),0),\"\")","v":"B41"},{"$f":"IFERROR(VLOOKUP($A17,Liste!$W$7:$Z$70,COLUMN(),0),\"\")","v":"C41"},13,null,8,{"$f":"IFERROR(VLOOKUP($K17,Liste!$W$7:$Z$70,COLUMN()-6,0),\"\")","v":"A46"},{"$f":"IFERROR(VLOOKUP($K17,Liste!$W$7:$Z$70,COLUMN()-6,0),\"\")","v":"B46"},{"$f":"IFERROR(VLOOKUP($K17,Liste!$W$7:$Z$70,COLUMN()-6,0),\"\")","v":"C46"},{"$f":"Liste!AV20","v":46},null,{"$f":"Liste!AT36","v":47},{"$f":"IFERROR(VLOOKUP($M17,Liste!$W$7:$Z$70,COLUMN()-12,0),\"\")","v":"A47"},{"$f":"IFERROR(VLOOKUP($M17,Liste!$W$7:$Z$70,COLUMN()-12,0),\"\")","v":"B47"},{"$f":"IFERROR(VLOOKUP($M17,Liste!$W$7:$Z$70,COLUMN()-12,0),\"\")","v":"C47"},8,null,13,{"$f":"IFERROR(VLOOKUP($W17,Liste!$W$7:$Z$70,COLUMN()-18,0),\"\")","v":"A44"},{"$f":"IFERROR(VLOOKUP($W17,Liste!$W$7:$Z$70,COLUMN()-18,0),\"\")","v":"B44"},{"$f":"IFERROR(VLOOKUP($W17,Liste!$W$7:$Z$70,COLUMN()-18,0),\"\")","v":"C44"},{"$f":"Liste!AV36","v":44}]
[{"$f":"Liste!AT21","v":51},{"$f":"IFERROR(VLOOKUP($A18,Liste!$W$7:$Z$70,COLUMN(),0),\"\")","v":"A51"},{"$f":"IFERROR(VLOOKUP($A18,Liste!$W$7:$Z$70,COLUMN(),0),\"\")","v":"B51"},{"$f":"IFERROR(VLOOKUP($A18,Liste!$W$7:$Z$70,COLUMN(),0),\"\")","v":"C51"},13,null,7,{"$f":"IFERROR(VLOOKUP($K18,Liste!$W$7:$Z$70,COLUMN()-6,0),\"\")","v":"A53"},{"$f":"IFERROR(VLOOKUP($K18,Liste!$W$7:$Z$70,COLUMN()-6,0),\"\")","v":"B53"},{"$f":"IFERROR(VLOOKUP($K18,Liste!$W$7:$Z$70,COLUMN()-6,0),\"\")","v":"C53"},{"$f":"Liste!AV21","v":53},null,{"$f":"Liste!AT37","v":55},{"$f":"IFERROR(VLOOKUP($M18,Liste!$W$7:$Z$70,COLUMN()-12,0),\"\")","v":"A55"},{"$f":"IFERROR(VLOOKUP($M18,Liste!$W$7:$Z$70,COLUMN()-12,0),\"\")","v":"B55"},{"$f":"IFERROR(VLOOKUP($M18,Liste!$W$7:$Z$70,COLUMN()-12,0),\"\")","v":"C55"},7,null,13,{"$f":"IFERROR(VLOOKUP($W18,Liste!$W$7:$Z$70,COLUMN()-18,0),\"\")","v":"A50"},{"$f":"IFERROR(VLOOKUP($W18,Liste!$W$7:$Z$70,COLUMN()-18,0),\"\")","v":"B50"},{"$f":"IFERROR(VLOOKUP($W18,Liste!$W$7:$Z$70,COLUMN()-18,0),\"\")","v":"C50"},{"$f":"Liste!AV37","v":50}]
[{"$f":"Liste!AT22","v":58},{"$f":"IFERROR(VLOOKUP($A19,Liste!$W$7:$Z$70,COLUMN(),0),\"\")","v":"A58"},{"$f":"IFERROR(VLOOKUP($A19,Liste!$W$7:$Z$70,COLUMN(),0),\"\")","v":"B58"},{"$f":"IFERROR(VLOOKUP($A19,Liste!$W$7:$Z$70,COLUMN(),0),\"\")","v":"C58"},4,null,13,{"$f":"IFERROR(VLOOKUP($K19,Liste!$W$7:$Z$70,COLUMN()-6,0),\"\")","v":"A64"},{"$f":"IFERROR(VLOOKUP($K19,Liste!$W$7:$Z$70,COLUMN()-6,0),\"\")","v":"B64"},{"$f":"IFERROR(VLOOKUP($K19,Liste!$W$7:$Z$70,COLUMN()-6,0),\"\")","v":"C64"},{"$f":"Liste!AV22","v":64},null,{"$f":"Liste!AT38","v":61},{"$f":"IFERROR(VLOOKUP($M19,Liste!$W$7:$Z$70,COLUMN()-12,0),\"\")","v":"A61"},{"$f":"IFERROR(VLOOKUP($M19,Liste!$W$7:$Z$70,COLUMN()-12,0),\"\")","v":"B61"},{"$f":"IFERROR(VLOOKUP($M19,Liste!$W$7:$Z$70,COLUMN()-12,0),\"\")","v":"C61"},13,null,4,{"$f":"IFERROR(VLOOKUP($W19,Liste!$W$7:$Z$70,COLUMN()-18,0),\"\")","v":"A59"},{"$f":"IFERROR(VLOOKUP($W19,Liste!$W$7:$Z$70,COLUMN()-18,0),\"\")","v":"B59"},{"$f":"IFERROR(VLOOKUP($W19,Liste!$W$7:$Z$70,COLUMN()-18,0),\"\")","v":"C59"},{"$f":"Liste!AV38","v":59}]
[]
[null,null,null," "]
[null,null,null,null,null,null,null,null,null," "]
[]
[]
[]
[]
[null,{"$f":"B3","v":"A4"},{"$f":"E3","v":2},{"$f":"G3","v":13}]
[null,{"$f":"B4","v":"A9"},{"$f":"E4","v":13},{"$f":"G4","v":10}]
[null,"A20",13,11]
[null,"A25",13,2]
[null,"A35",5,13]
[null,"A42",13,8]
[null,"A52",13,7]
[null,"A57",4,13]
[null,{"$f":"B12","v":"A3"},{"$f":"E12","v":2},{"$f":"G12","v":13}]
[null,"A10",13,10]
[null,"A19",13,11]
[null,"A26",13,2]
[null,"A36",5,13]
[null,"A41",13,8]
[null,"A51",13,7]
[null,"A58",4,13]
[null,{"$f":"H3","v":"A6"},{"$f":"G3","v":13},{"$f":"E3","v":2}]
[null,{"$f":"H4","v":"A14"},{"$f":"G4","v":10},{"$f":"E4","v":13}]
[null,"A22",11,13]
[null,"A31",2,13]
[null,"A37",13,5]
[null,"A45",8,13]
[null,"A54",7,13]
[null,"A63",13,4]
[null,{"$f":"H12","v":"A5"},{"$f":"G12","v":13},{"$f":"E12","v":2}]
[null,"A13",10,13]
[null,"A21",11,13]
[null,"A32",2,13]
[null,"A38",13,5]
[null,"A46",8,13]
[null,"A53",7,13]
[null,"A64",13,4]
[null,{"$f":"N3","v":"A8"},{"$f":"Q3","v":13},{"$f":"S3","v":2}]
[null,{"$f":"N4","v":"A15"},{"$f":"Q4","v":10},{"$f":"S4","v":13}]
[null,"A24",11,13]
[null,"A30",2,13]
[null,"A39",13,5]
[null,"A48",8,13]
[null,"A56",7,13]
[null,"A62",13,4]
[null,{"$f":"N12","v":"A7"},{"$f":"Q12","v":13},{"$f":"S12","v":2}]
[null,"A16",10,13]
[null,"A23",11,13]
[null,"A29",2,13]
[null,"A40",13,5]
[null,"A47",8,13]
[null,"A55",7,13]
[null,"A61",13,4]
[null,{"$f":"T3","v":"A1"},{"$f":"S3","v":2},{"$f":"Q3","v":13}]
[null,{"$f":"T4","v":"A12"},{"$f":"S4","v":13},{"$f":"Q4","v":10}]
[null,"A17",13,11]
[null,"A28",13,2]
[null,"A34",5,13]
[null,"A43",13,8]
[null,"A49",13,7]
[null,"A60",4,13]
[null,{"$f":"T12","v":"A2"},{"$f":"S12","v":2},{"$f":"Q12","v":13}]
[null,"A11",13,10]
[null,"A18",13,11]
[null,"A27",13,2]
[null,"A33",5,13]
[null,"A44",13,8]
[null,"A50",13,7]
[null,"A59",4,13]
[null,{"$f":"C3","v":"B4"},{"$f":"E3","v":2},{"$f":"G3","v":13}]
[null,{"$f":"C4","v":"B9"},{"$f":"E4","v":13},{"$f":"G4","v":10}]
[null,"B20",13,11]
[null,"B25",13,2]
[null,"B35",5,13]
[null,"B42",13,8]
[null,"B52",13,7]
[null,"B57",4,13]
[null,{"$f":"C12","v":"B3"},{"$f":"E12","v":2},{"$f":"G12","v":13}]
[null,"B10",13,10]
[null,"B19",13,11]
[null,"B26",13,2]
[null,"B36",5,13]
[null,"B41",13,8]
[null,"B51",13,7]
[null,"B58",4,13]
[null,{"$f":"D3","v":"C4"},{"$f":"E3","v":2},{"$f":"G3","v":13}]
[null,{"$f":"D4","v":"C9"},13,{"$f":"G4","v":10}]
[null,"C20",13,11]
[null,"C25",13,2]
[null,"C35",5,13]
[null,"C42",13,8]
[null,"C52",13,7]
[null,"C57",4,13]
[null,{"$f":"D12","v":"C3"},2,{"$f":"G12","v":13}]
[null,"C10",13,10]
[null,"C19",13,11]
[null,"C26",13,2]
[null,"C36",5,13]
[null,"C41",13,8]
[null,"C51",13,7]
[null,"C58",4,13]
[null,{"$f":"I3","v":"B6"},{"$f":"G3","v":13},{"$f":"E3","v":2}]
[null,{"$f":"I4","v":"B14"},{"$f":"G4","v":10},{"$f":"E4","v":13}]
[null,"B22",11,13]
[null,"B31",2,13]
[null,"B37",13,5]
[null,"B45",8,13]
[null,"B54",7,13]
[null,"B63",13,4]
[null,{"$f":"I12","v":"B5"},{"$f":"G12","v":13},{"$f":"E12","v":2}]
[null,"B13",10,13]
[null,"B21",11,13]
[null,"B32",2,13]
[null,"B38",13,5]
[null,"B46",8,13]
[null,"B53",7,13]
[null,"B64",13,4]
[null,{"$f":"J3","v":"C6"},{"$f":"G3","v":13},{"$f":"E3","v":2}]
[null,{"$f":"J4","v":"C14"},{"$f":"G4","v":10},{"$f":"E4","v":13}]
[null,"C22",11,13]
[null,"C31",2,13]
[null,"C37",13,5]
[null,"C45",8,13]
[null,"C54",7,13]
[null,"C63",13,4]
[null,{"$f":"J12","v":"C5"},{"$f":"G12","v":13},{"$f":"E12","v":2}]
[null,"C13",10,13]
[null,"C21",11,13]
[null,"C32",2,13]
[null,"C38",13,5]
[null,"C46",8,13]
[null,"C53",7,13]
[null,"C64",13,4]
[null,{"$f":"O3","v":"B8"},{"$f":"Q3","v":13},{"$f":"S3","v":2}]
[null,{"$f":"O4","v":"B15"},{"$f":"Q4","v":10},{"$f":"S4","v":13}]
[null,"B24",11,13]
[null,"B30",2,13]
[null,"B39",13,5]
[null,"B48",8,13]
[null,"B56",7,13]
[null,"B62",13,4]
[null,{"$f":"O12","v":"B7"},{"$f":"Q12","v":13},{"$f":"S12","v":2}]
[null,"B16",10,13]
[null,"B23",11,13]
[null,"B29",2,13]
[null,"B40",13,5]
[null,"B47",8,13]
[null,"B55",7,13]
[null,"B61",13,4]
[null,{"$f":"P3","v":"C8"},{"$f":"Q3","v":13},{"$f":"S3","v":2}]
[null,{"$f":"P4","v":"C15"},10,{"$f":"S4","v":13}]
[null,"C24",11,13]
[null,"C30",2,13]
[null,"C39",13,5]
[null,"C48",8,13]
[null,"C56",7,13]
[null,"C62",13,4]
[null,{"$f":"P12","v":"C7"},13,{"$f":"S12","v":2}]
[null,"C16",10,13]
[null,"C23",11,13]
[null,"C29",2,13]
[null,"C40",13,5]
[null,"C47",8,13]
[null,"C55",7,13]
[null,"C61",13,4]
[null,{"$f":"U3","v":"B1"},{"$f":"S3","v":2},{"$f":"Q3","v":13}]
[null,{"$f":"U4","v":"B12"},{"$f":"S4","v":13},{"$f":"Q4","v":10}]
[null,"B17",13,11]
[null,"B28",13,2]
[null,"B34",5,13]
[null,"B43",13,8]
[null,"B49",13,7]
[null,"B60",4,13]
[null,{"$f":"U12","v":"B2"},{"$f":"S12","v":2},{"$f":"Q12","v":13}]
[null,"B11",13,10]
[null,"B18",13,11]
[null,"B27",13,2]
[null,"B33",5,13]
[null,"B44",13,8]
[null,"B50",13,7]
[null,"B59",4,13]
[null,{"$f":"V3","v":"C1"},{"$f":"S3","v":2},{"$f":"Q3","v":13}]
[null,{"$f":"V4","v":"C12"},{"$f":"S4","v":13},{"$f":"Q4","v":10}]
[null,"C17",13,11]
[null,"C28",13,2]
[null,"C34",5,13]
[null,"C43",13,8]
[null,"C49",13,7]
[null,"C60",4,13]
[null,{"$f":"V12","v":"C2"},{"$f":"S12","v":2},{"$f":"Q12","v":13}]
[null,"C11",13,10]
[null,"C18",13,11]
[null,"C27",13,2]
[null,"C33",5,13]
[null,"C44",13,8]
[null,"C50",13,7]
[null,"C59",4,13]

{"sheet":"Partie 4","index":4,"n_rows":218,"n_cols":27,"rows_kept":218,"cut":false,"hidden":false,"merged":[[0,0,0,22],[10,0,10,3],[10,7,10,10],[10,12,10,15],[10,19,10,22],[1,0,1,3],[1,7,1,10],[1,12,1,15],[1,19,1,22]]}
["TRIPLETTES ",null,null,null,null,null,null,null,null,null,null,null,null,null,null,null,null,null,null,null,null,null,null,null,null,null,30072022]
["Equipes ",null,null,null,"PTS     EQ 1",null,"PTS     EQ 2","Equipes ",null,null,null,null,"Equipes ",null,null,null,"PTS     EQ 1",null,"PTS     EQ 2","Equipes "]
[{"$f":"Liste!BA7","v":6},{"$f":"IFERROR(VLOOKUP($A3,Liste!$AA$7:$AD$70,COLUMN(),0),\"\")","v":"A6"},{"$f":"IFERROR(VLOOKUP($A3,Liste!$AA$7:$AD$70,COLUMN(),0),\"\")","v":"B6"},{"$f":"IFERROR(VLOOKUP($A3,Liste!$AA$7:$AD$70,COLUMN(),0),\"\")","v":"C6"},2,null,13,{"$f":"IFERROR(VLOOKUP($K3,Liste!$AA$7:$AD$70,COLUMN()-6,0),\"\")","v":"A9"},{"$f":"IFERROR(VLOOKUP($K3,Liste!$AA$7:$AD$70,COLUMN()-6,0),\"\")","v":"B9"},{"$f":"IFERROR(VLOOKUP($K3,Liste!$AA$7:$AD$70,COLUMN()-6,0),\"\")","v":"C9"},{"$f":"Liste!BC7","v":9},null,{"$f":"Liste!BA23","v":14},{"$f":"IFERROR(VLOOKUP($M3,Liste!$AA$7:$AD$70,COLUMN()-12,0),\"\")","v":"A14"},{"$f":"IFERROR(VLOOKUP($M3,Liste!$AA$7:$AD$70,COLUMN()-12,0),\"\")","v":"B14"},{"$f":"IFERROR(VLOOKUP($M3,Liste!$AA$7:$AD$70,COLUMN()-12,0),\"\")","v":"C14"},13,null,2,{"$f":"IFERROR(VLOOKUP($W3,Liste!$AA$7:$AD$70,COLUMN()-18,0),\"\")","v":"A4"},{"$f":"IFERROR(VLOOKUP($W3,Liste!$AA$7:$AD$70,COLUMN()-18,0),\"\")","v":"B4"},{"$f":"IFERROR(VLOOKUP($W3,Liste!$AA$7:$AD$70,COLUMN()-18,0),\"\")","v":"C4"},{"$f":"Liste!BC23","v":4}]
[{"$f":"Liste!BA8","v":20},{"$f":"IFERROR(VLOOKUP($A4,Liste!$AA$7:$AD$70,COLUMN(),0),\"\")","v":"A20"},{"$f":"IFERROR(VLOOKUP($A4,Liste!$AA$7:$AD$70,COLUMN(),0),\"\")","v":"B20"},{"$f":"IFERROR(VLOOKUP($A4,Liste!$AA$7:$AD$70,COLUMN(),0),\"\")","v":"C20"},13,null,10,{"$f":"IFERROR(VLOOKUP($K4,Liste!$AA$7:$AD$70,COLUMN()-6,0),\"\")","v":"A25"},{"$f":"IFERROR(VLOOKUP($K4,Liste!$AA$7:$AD$70,COLUMN()-6,0),\"\")","v":"B25"},{"$f":"IFERROR(VLOOKUP($K4,Liste!$AA$7:$AD$70,COLUMN()-6,0),\"\")","v":"C25"},{"$f":"Liste!BC8","v":25},null,{"$f":"Liste!BA24","v":31},{"$f":"IFERROR(VLOOKUP($M4,Liste!$AA$7:$AD$70,COLUMN()-12,0),\"\")","v":"A31"},{"$f":"IFERROR(VLOOKUP($M4,Liste!$AA$7:$AD$70,COLUMN()-12,0),\"\")","v":"B31"},{"$f":"IFERROR(VLOOKUP($M4,Liste!$AA$7:$AD$70,COLUMN()-12,0),\"\")","v":"C31"},10,null,13,{"$f":"IFERROR(VLOOKUP($W4,Liste!$AA$7:$AD$70,COLUMN()-18,0),\"\")","v":"A22"},{"$f":"IFERROR(VLOOKUP($W4,Liste!$AA$7:$AD$70,COLUMN()-18,0),\"\")","v":"B22"},{"$f":"IFERROR(VLOOKUP($W4,Liste!$AA$7:$AD$70,COLUMN()-18,0),\"\")","v":"C22"},{"$f":"Liste!BC24","v":22}]
[{"$f":"Liste!BA9","v":37},{"$f":"IFERROR(VLOOKUP($A5,Liste!$AA$7:$AD$70,COLUMN(),0),\"\")","v":"A37"},{"$f":"IFERROR(VLOOKUP($A5,Liste!$AA$7:$AD$70,COLUMN(),0),\"\")","v":"B37"},{"$f":"IFERROR(VLOOKUP($A5,Liste!$AA$7:$AD$70,COLUMN(),0),\"\")","v":"C37"},13,null,11,{"$f":"IFERROR(VLOOKUP($K5,Liste!$AA$7:$AD$70,COLUMN()-6,0),\"\")","v":"A42"},{"$f":"IFERROR(VLOOKUP($K5,Liste!$AA$7:$AD$70,COLUMN()-6,0),\"\")","v":"B42"},{"$f":"IFERROR(VLOOKUP($K5,Liste!$AA$7:$AD$70,COLUMN()-6,0),\"\")","v":"C42"},{"$f":"Liste!BC9","v":42},null,{"$f":"Liste!BA25","v":45},{"$f":"IFERROR(VLOOKUP($M5,Liste!$AA$7:$AD$70,COLUMN()-12,0),\"\")","v":"A45"},{"$f":"IFERROR(VLOOKUP($M5,Liste!$AA$7:$AD$70,COLUMN()-12,0),\"\")","v":"B45"},{"$f":"IFERROR(VLOOKUP($M5,Liste!$AA$7:$AD$70,COLUMN()-12,0),\"\")","v":"C45"},11,null,13,{"$f":"IFERROR(VLOOKUP($W5,Liste!$AA$7:$AD$70,COLUMN()-18,0),\"\")","v":"A35"},{"$f":"IFERROR(VLOOKUP($W5,Liste!$AA$7:$AD$70,COLUMN()-18,0),\"\")","v":"B35"},{"$f":"IFERROR(VLOOKUP($W5,Liste!$AA$7:$AD$70,COLUMN()-18,0),\"\")","v":"C35"},{"$f":"Liste!BC25","v":35}]
[{"$f":"Liste!BA10","v":52},{"$f":"IFERROR(VLOOKUP($A6,Liste!$AA$7:$AD$70,COLUMN(),0),\"\")","v":"A52"},{"$f":"IFERROR(VLOOKUP($A6,Liste!$AA$7:$AD$70,COLUMN(),0),\"\")","v":"B52"},{"$f":"IFERROR(VLOOKUP($A6,Liste!$AA$7:$AD$70,COLUMN(),0),\"\")","v":"C52"},13,null,2,{"$f":"IFERROR(VLOOKUP($K6,Liste!$AA$7:$AD$70,COLUMN()-6,0),\"\")","v":"A63"},{"$f":"IFERROR(VLOOKUP($K6,Liste!$AA$7:$AD$70,COLUMN()-6,0),\"\")","v":"B63"},{"$f":"IFERROR(VLOOKUP($K6,Liste!$AA$7:$AD$70,COLUMN()-6,0),\"\")","v":"C63"},{"$f":"Liste!BC10","v":63},null,{"$f":"Liste!BA26","v":57},{"$f":"IFERROR(VLOOKUP($M6,Liste!$AA$7:$AD$70,COLUMN()-12,0),\"\")","v":"A57"},{"$f":"IFERROR(VLOOKUP($M6,Liste!$AA$7:$AD$70,COLUMN()-12,0),\"\")","v":"B57"},{"$f":"IFERROR(VLOOKUP($M6,Liste!$AA$7:$AD$70,COLUMN()-12,0),\"\")","v":"C57"},2,null,13,{"$f":"IFERROR(VLOOKUP($W6,Liste!$AA$7:$AD$70,COLUMN()-18,0),\"\")","v":"A54"},{"$f":"IFERROR(VLOOKUP($W6,Liste!$AA$7:$AD$70,COLUMN()-18,0),\"\")","v":"B54"},{"$f":"IFERROR(VLOOKUP($W6,Liste!$AA$7:$AD$70,COLUMN()-18,0),\"\")","v":"C54"},{"$f":"Liste!BC26","v":54}]
[{"$f":"Liste!BA11","v":5},{"$f":"IFERROR(VLOOKUP($A7,Liste!$AA$7:$AD$70,COLUMN(),0),\"\")","v":"A5"},{"$f":"IFERROR(VLOOKUP($A7,Liste!$AA$7:$AD$70,COLUMN(),0),\"\")","v":"B5"},{"$f":"IFERROR(VLOOKUP($A7,Liste!$AA$7:$AD$70,COLUMN(),0),\"\")","v":"C5"},5,null,13,{"$f":"IFERROR(VLOOKUP($K7,Liste!$AA$7:$AD$70,COLUMN()-6,0),\"\")","v":"A10"},{"$f":"IFERROR(VLOOKUP($K7,Liste!$AA$7:$AD$70,COLUMN()-6,0),\"\")","v":"B10"},{"$f":"IFERROR(VLOOKUP($K7,Liste!$AA$7:$AD$70,COLUMN()-6,0),\"\")","v":"C10"},{"$f":"Liste!BC11","v":10},null,{"$f":"Liste!BA27","v":13},{"$f":"IFERROR(VLOOKUP($M7,Liste!$AA$7:$AD$70,COLUMN()-12,0),\"\")","v":"A13"},{"$f":"IFERROR(VLOOKUP($M7,Liste!$AA$7:$AD$70,COLUMN()-12,0),\"\")","v":"B13"},{"$f":"IFERROR(VLOOKUP($M7,Liste!$AA$7:$AD$70,COLUMN()-12,0),\"\")","v":"C13"},13,null,5,{"$f":"IFERROR(VLOOKUP($W7,Liste!$AA$7:$AD$70,COLUMN()-18,0),\"\")","v":"A3"},{"$f":"IFERROR(VLOOKUP($W7,Liste!$AA$7:$AD$70,COLUMN()-18,0),\"\")","v":"B3"},{"$f":"IFERROR(VLOOKUP($W7,Liste!$AA$7:$AD$70,COLUMN()-18,0),\"\")","v":"C3"},{"$f":"Liste!BC27","v":3}]
[{"$f":"Liste!BA12","v":19},{"$f":"IFERROR(VLOOKUP($A8,Liste!$AA$7:$AD$70,COLUMN(),0),\"\")","v":"A19"},{"$f":"IFERROR(VLOOKUP($A8,Liste!$AA$7:$AD$70,COLUMN(),0),\"\")","v":"B19"},{"$f":"IFERROR(VLOOKUP($A8,Liste!$AA$7:$AD$70,COLUMN(),0),\"\")","v":"C19"},13,null,8,{"$f":"IFERROR(VLOOKUP($K8,Liste!$AA$7:$AD$70,COLUMN()-6,0),\"\")","v":"A26"},{"$f":"IFERROR(VLOOKUP($K8,Liste!$AA$7:$AD$70,COLUMN()-6,0),\"\")","v":"B26"},{"$f":"IFERROR(VLOOKUP($K8,Liste!$AA$7:$AD$70,COLUMN()-6,0),\"\")","v":"C26"},{"$f":"Liste!BC12","v":26},null,{"$f":"Liste!BA28","v":32},{"$f":"IFERROR(VLOOKUP($M8,Liste!$AA$7:$AD$70,COLUMN()-12,0),\"\")","v":"A32"},{"$f":"IFERROR(VLOOKUP($M8,Liste!$AA$7:$AD$70,COLUMN()-12,0),\"\")","v":"B32"},{"$f":"IFERROR(VLOOKUP($M8,Liste!$AA$7:$AD$70,COLUMN()-12,0),\"\")","v":"C32"},8,null,13,{"$f":"IFERROR(VLOOKUP($W8,Liste!$AA$7:$AD$70,COLUMN()-18,0),\"\")","v":"A21"},{"$f":"IFERROR(VLOOKUP($W8,Liste!$AA$7:$AD$70,COLUMN()-18,0),\"\")","v":"B21"},{"$f":"IFERROR(VLOOKUP($W8,Liste!$AA$7:$AD$70,COLUMN()-18,0),\"\")","v":"C21"},{"$f":"Liste!BC28","v":21}]
[{"$f":"Liste!BA13","v":38},{"$f":"IFERROR(VLOOKUP($A9,Liste!$AA$7:$AD$70,COLUMN(),0),\"\")","v":"A38"},{"$f":"IFERROR(VLOOKUP($A9,Liste!$AA$7:$AD$70,COLUMN(),0),\"\")","v":"B38"},{"$f":"IFERROR(VLOOKUP($A9,Liste!$AA$7:$AD$70,COLUMN(),0),\"\")","v":"C38"},13,null,7,{"$f":"IFERROR(VLOOKUP($K9,Liste!$AA$7:$AD$70,COLUMN()-6,0),\"\")","v":"A41"},{"$f":"IFERROR(VLOOKUP($K9,Liste!$AA$7:$AD$70,COLUMN()-6,0),\"\")","v":"B41"},{"$f":"IFERROR(VLOOKUP($K9,Liste!$AA$7:$AD$70,COLUMN()-6,0),\"\")","v":"C41"},{"$f":"Liste!BC13","v":41},null,{"$f":"Liste!BA29","v":46},{"$f":"IFERROR(VLOOKUP($M9,Liste!$AA$7:$AD$70,COLUMN()-12,0),\"\")","v":"A46"},{"$f":"IFERROR(VLOOKUP($M9,Liste!$AA$7:$AD$70,COLUMN()-12,0),\"\")","v":"B46"},{"$f":"IFERROR(VLOOKUP($M9,Liste!$AA$7:$AD$70,COLUMN()-12,0),\"\")","v":"C46"},7,null,13,{"$f":"IFERROR(VLOOKUP($W9,Liste!$AA$7:$AD$70,COLUMN()-18,0),\"\")","v":"A36"},{"$f":"IFERROR(VLOOKUP($W9,Liste!$AA$7:$AD$70,COLUMN()-18,0),\"\")","v":"B36"},{"$f":"IFERROR(VLOOKUP($W9,Liste!$AA$7:$AD$70,COLUMN()-18,0),\"\")","v":"C36"},{"$f":"Liste!BC29","v":36}]
[{"$f":"Liste!BA14","v":51},{"$f":"IFERROR(VLOOKUP($A10,Liste!$AA$7:$AD$70,COLUMN(),0),\"\")","v":"A51"},{"$f":"IFERROR(VLOOKUP($A10,Liste!$AA$7:$AD$70,COLUMN(),0),\"\")","v":"B51"},{"$f":"IFERROR(VLOOKUP($A10,Liste!$AA$7:$AD$70,COLUMN(),0),\"\")","v":"C51"},4,null,13,{"$f":"IFERROR(VLOOKUP($K10,Liste!$AA$7:$AD$70,COLUMN()-6,0),\"\")","v":"A64"},{"$f":"IFERROR(VLOOKUP($K10,Liste!$AA$7:$AD$70,COLUMN()-6,0),\"\")","v":"B64"},{"$f":"IFERROR(VLOOKUP($K10,Liste!$AA$7:$AD$70,COLUMN()-6,0),\"\")","v":"C64"},{"$f":"Liste!BC14","v":64},null,{"$f":"Liste!BA30","v":58},{"$f":"IFERROR(VLOOKUP($M10,Liste!$AA$7:$AD$70,COLUMN()-12,0),\"\")","v":"A58"},{"$f":"IFERROR(VLOOKUP($M10,Liste!$AA$7:$AD$70,COLUMN()-12,0),\"\")","v":"B58"},{"$f":"IFERROR(VLOOKUP($M10,Liste!$AA$7:$AD$70,COLUMN()-12,0),\"\")","v":"C58"},13,null,4,{"$f":"IFERROR(VLOOKUP($W10,Liste!$AA$7:$AD$70,COLUMN()-18,0),\"\")","v":"A53"},{"$f":"IFERROR(VLOOKUP($W10,Liste!$AA$7:$AD$70,COLUMN()-18,0),\"\")","v":"B53"},{"$f":"IFERROR(VLOOKUP($W10,Liste!$AA$7:$AD$70,COLUMN()-18,0),\"\")","v":"C53"},{"$f":"Liste!BC30","v":53}]
["Equipes ",null,null,null,"PTS     EQ 1",null,"PTS     EQ 2","Equipes ",null,null,null,null,"Equipes ",null,null,null,"PTS     EQ 1",null,"PTS     EQ 2","Equipes "]
[{"$f":"Liste!BA15","v":8},{"$f":"IFERROR(VLOOKUP($A12,Liste!$AA$7:$AD$70,COLUMN(),0),\"\")","v":"A8"},{"$f":"IFERROR(VLOOKUP($A12,Liste!$AA$7:$AD$70,COLUMN(),0),\"\")","v":"B8"},{"$f":"IFERROR(VLOOKUP($A12,Liste!$AA$7:$AD$70,COLUMN(),0),\"\")","v":"C8"},2,null,13,{"$f":"IFERROR(VLOOKUP($K12,Liste!$AA$7:$AD$70,COLUMN()-6,0),\"\")","v":"A12"},{"$f":"IFERROR(VLOOKUP($K12,Liste!$AA$7:$AD$70,COLUMN()-6,0),\"\")","v":"B12"},{"$f":"IFERROR(VLOOKUP($K12,Liste!$AA$7:$AD$70,COLUMN()-6,0),\"\")","v":"C12"},{"$f":"Liste!BC15","v":12},null,{"$f":"Liste!BA31","v":15},{"$f":"IFERROR(VLOOKUP($M12,Liste!$AA$7:$AD$70,COLUMN()-12,0),\"\")","v":"A15"},{"$f":"IFERROR(VLOOKUP($M12,Liste!$AA$7:$AD$70,COLUMN()-12,0),\"\")","v":"B15"},{"$f":"IFERROR(VLOOKUP($M12,Liste!$AA$7:$AD$70,COLUMN()-12,0),\"\")","v":"C15"},13,null,2,{"$f":"IFERROR(VLOOKUP($W12,Liste!$AA$7:$AD$70,COLUMN()-18,0),\"\")","v":"A1"},{"$f":"IFERROR(VLOOKUP($W12,Liste!$AA$7:$AD$70,COLUMN()-18,0),\"\")","v":"B1"},{"$f":"IFERROR(VLOOKUP($W12,Liste!$AA$7:$AD$70,COLUMN()-18,0),\"\")","v":"C1"},{"$f":"Liste!BC31","v":1}]
[{"$f":"Liste!BA16","v":17},{"$f":"IFERROR(VLOOKUP($A13,Liste!$AA$7:$AD$70,COLUMN(),0),\"\")","v":"A17"},{"$f":"IFERROR(VLOOKUP($A13,Liste!$AA$7:$AD$70,COLUMN(),0),\"\")","v":"B17"},{"$f":"IFERROR(VLOOKUP($A13,Liste!$AA$7:$AD$70,COLUMN(),0),\"\")","v":"C17"},13,null,10,{"$f":"IFERROR(VLOOKUP($K13,Liste!$AA$7:$AD$70,COLUMN()-6,0),\"\")","v":"A28"},{"$f":"IFERROR(VLOOKUP($K13,Liste!$AA$7:$AD$70,COLUMN()-6,0),\"\")","v":"B28"},{"$f":"IFERROR(VLOOKUP($K13,Liste!$AA$7:$AD$70,COLUMN()-6,0),\"\")","v":"C28"},{"$f":"Liste!BC16","v":28},null,{"$f":"Liste!BA32","v":30},{"$f":"IFERROR(VLOOKUP($M13,Liste!$AA$7:$AD$70,COLUMN()-12,0),\"\")","v":"A30"},{"$f":"IFERROR(VLOOKUP($M13,Liste!$AA$7:$AD$70,COLUMN()-12,0),\"\")","v":"B30"},{"$f":"IFERROR(VLOOKUP($M13,Liste!$AA$7:$AD$70,COLUMN()-12,0),\"\")","v":"C30"},10,null,13,{"$f":"IFERROR(VLOOKUP($W13,Liste!$AA$7:$AD$70,COLUMN()-18,0),\"\")","v":"A24"},{"$f":"IFERROR(VLOOKUP($W13,Liste!$AA$7:$AD$70,COLUMN()-18,0),\"\")","v":"B24"},{"$f":"IFERROR(VLOOKUP($W13,Liste!$AA$7:$AD$70,COLUMN()-18,0),\"\")","v":"C24"},{"$f":"Liste!BC32","v":24}]
[{"$f":"Liste!BA17","v":39},{"$f":"IFERROR(VLOOKUP($A14,Liste!$AA$7:$AD$70,COLUMN(),0),\"\")","v":"A39"},{"$f":"IFERROR(VLOOKUP($A14,Liste!$AA$7:$AD$70,COLUMN(),0),\"\")","v":"B39"},{"$f":"IFERROR(VLOOKUP($A14,Liste!$AA$7:$AD$70,COLUMN(),0),\"\")","v":"C39"},13,null,11,{"$f":"IFERROR(VLOOKUP($K14,Liste!$AA$7:$AD$70,COLUMN()-6,0),\"\")","v":"A43"},{"$f":"IFERROR(VLOOKUP($K14,Liste!$AA$7:$AD$70,COLUMN()-6,0),\"\")","v":"B43"},{"$f":"IFERROR(VLOOKUP($K14,Liste!$AA$7:$AD$70,COLUMN()-6,0),\"\")","v":"C43"},{"$f":"Liste!BC17","v":43},null,{"$f":"Liste!BA33","v":48},{"$f":"IFERROR(VLOOKUP($M14,Liste!$AA$7:$AD$70,COLUMN()-12,0),\"\")","v":"A48"},{"$f":"IFERROR(VLOOKUP($M14,Liste!$AA$7:$AD$70,COLUMN()-12,0),\"\")","v":"B48"},{"$f":"IFERROR(VLOOKUP($M14,Liste!$AA$7:$AD$70,COLUMN()-12,0),\"\")","v":"C48"},11,null,13,{"$f":"IFERROR(VLOOKUP($W14,Liste!$AA$7:$AD$70,COLUMN()-18,0),\"\")","v":"A34"},{"$f":"IFERROR(VLOOKUP($W14,Liste!$AA$7:$AD$70,COLUMN()-18,0),\"\")","v":"B34"},{"$f":"IFERROR(VLOOKUP($W14,Liste!$AA$7:$AD$70,COLUMN()-18,0),\"\")","v":"C34"},{"$f":"Liste!BC33","v":34}]
[{"$f":"Liste!BA18","v":49},{"$f":"IFERROR(VLOOKUP($A15,Liste!$AA$7:$AD$70,COLUMN(),0),\"\")","v":"A49"},{"$f":"IFERROR(VLOOKUP($A15,Liste!$AA$7:$AD$70,COLUMN(),0),\"\")","v":"B49"},{"$f":"IFERROR(VLOOKUP($A15,Liste!$AA$7:$AD$70,COLUMN(),0),\"\")","v":"C49"},13,null,2,{"$f":"IFERROR(VLOOKUP($K15,Liste!$AA$7:$AD$70,COLUMN()-6,0),\"\")","v":"A62"},{"$f":"IFERROR(VLOOKUP($K15,Liste!$AA$7:$AD$70,COLUMN()-6,0),\"\")","v":"B62"},{"$f":"IFERROR(VLOOKUP($K15,Liste!$AA$7:$AD$70,COLUMN()-6,0),\"\")","v":"C62"},{"$f":"Liste!BC18","v":62},null,{"$f":"Liste!BA34","v":60},{"$f":"IFERROR(VLOOKUP($M15,Liste!$AA$7:$AD$70,COLUMN()-12,0),\"\")","v":"A60"},{"$f":"IFERROR(VLOOKUP($M15,Liste!$AA$7:$AD$70,COLUMN()-12,0),\"\")","v":"B60"},{"$f":"IFERROR(VLOOKUP($M15,Liste!$AA$7:$AD$70,COLUMN()-12,0),\"\")","v":"C60"},2,null,13,{"$f":"IFERROR(VLOOKUP($W15,Liste!$AA$7:$AD$70,COLUMN()-18,0),\"\")","v":"A56"},{"$f":"IFERROR(VLOOKUP($W15,Liste!$AA$7:$AD$70,COLUMN()-18,0),\"\")","v":"B56"},{"$f":"IFERROR(VLOOKUP($W15,Liste!$AA$7:$AD$70,COLUMN()-18,0),\"\")","v":"C56"},{"$f":"Liste!BC34","v":56}]
[{"$f":"Liste!BA19","v":7},{"$f":"IFERROR(VLOOKUP($A16,Liste!$AA$7:$AD$70,COLUMN(),0),\"\")","v":"A7"},{"$f":"IFERROR(VLOOKUP($A16,Liste!$AA$7:$AD$70,COLUMN(),0),\"\")","v":"B7"},{"$f":"IFERROR(VLOOKUP($A16,Liste!$AA$7:$AD$70,COLUMN(),0),\"\")","v":"C7"},5,null,13,{"$f":"IFERROR(VLOOKUP($K16,Liste!$AA$7:$AD$70,COLUMN()-6,0),\"\")","v":"A11"},{"$f":"IFERROR(VLOOKUP($K16,Liste!$AA$7:$AD$70,COLUMN()-6,0),\"\")","v":"B11"},{"$f":"IFERROR(VLOOKUP($K16,Liste!$AA$7:$AD$70,COLUMN()-6,0),\"\")","v":"C11"},{"$f":"Liste!BC19","v":11},null,{"$f":"Liste!BA35","v":16},{"$f":"IFERROR(VLOOKUP($M16,Liste!$AA$7:$AD$70,COLUMN()-12,0),\"\")","v":"A16"},{"$f":"IFERROR(VLOOKUP($M16,Liste!$AA$7:$AD$70,COLUMN()-12,0),\"\")","v":"B16"},{"$f":"IFERROR(VLOOKUP($M16,Liste!$AA$7:$AD$70,COLUMN()-12,0),\"\")","v":"C16"},13,null,5,{"$f":"IFERROR(VLOOKUP($W16,Liste!$AA$7:$AD$70,COLUMN()-18,0),\"\")","v":"A2"},{"$f":"IFERROR(VLOOKUP($W16,Liste!$AA$7:$AD$70,COLUMN()-18,0),\"\")","v":"B2"},{"$f":"IFERROR(VLOOKUP($W16,Liste!$AA$7:$AD$70,COLUMN()-18,0),\"\")","v":"C2"},{"$f":"Liste!BC35","v":2}]
[{"$f":"Liste!BA20","v":18},{"$f":"IFERROR(VLOOKUP($A17,Liste!$AA$7:$AD$70,COLUMN(),0),\"\")","v":"A18"},{"$f":"IFERROR(VLOOKUP($A17,Liste!$AA$7:$AD$70,COLUMN(),0),\"\")","v":"B18"},{"$f":"IFERROR(VLOOKUP($A17,Liste!$AA$7:$AD$70,COLUMN(),0),\"\")","v":"C18"},13,null,8,{"$f":"IFERROR(VLOOKUP($K17,Liste!$AA$7:$AD$70,COLUMN()-6,0),\"\")","v":"A27"},{"$f":"IFERROR(VLOOKUP($K17,Liste!$AA$7:$AD$70,COLUMN()-6,0),\"\")","v":"B27"},{"$f":"IFERROR(VLOOKUP($K17,Liste!$AA$7:$AD$70,COLUMN()-6,0),\"\")","v":"C27"},{"$f":"Liste!BC20","v":27},null,{"$f":"Liste!BA36","v":29},{"$f":"IFERROR(VLOOKUP($M17,Liste!$AA$7:$AD$70,COLUMN()-12,0),\"\")","v":"A29"},{"$f":"IFERROR(VLOOKUP($M17,Liste!$AA$7:$AD$70,COLUMN()-12,0),\"\")","v":"B29"},{"$f":"IFERROR(VLOOKUP($M17,Liste!$AA$7:$AD$70,COLUMN()-12,0),\"\")","v":"C29"},8,null,13,{"$f":"IFERROR(VLOOKUP($W17,Liste!$AA$7:$AD$70,COLUMN()-18,0),\"\")","v":"A23"},{"$f":"IFERROR(VLOOKUP($W17,Liste!$AA$7:$AD$70,COLUMN()-18,0),\"\")","v":"B23"},{"$f":"IFERROR(VLOOKUP($W17,Liste!$AA$7:$AD$70,COLUMN()-18,0),\"\")","v":"C23"},{"$f":"Liste!BC36","v":23}]
[{"$f":"Liste!BA21","v":40},{"$f":"IFERROR(VLOOKUP($A18,Liste!$AA$7:$AD$70,COLUMN(),0),\"\")","v":"A40"},{"$f":"IFERROR(VLOOKUP($A18,Liste!$AA$7:$AD$70,COLUMN(),0),\"\")","v":"B40"},{"$f":"IFERROR(VLOOKUP($A18,Liste!$AA$7:$AD$70,COLUMN(),0),\"\")","v":"C40"},13,null,7,{"$f":"IFERROR(VLOOKUP($K18,Liste!$AA$7:$AD$70,COLUMN()-6,0),\"\")","v":"A44"},{"$f":"IFERROR(VLOOKUP($K18,Liste!$AA$7:$AD$70,COLUMN()-6,0),\"\")","v":"B44"},{"$f":"IFERROR(VLOOKUP($K18,Liste!$AA$7:$AD$70,COLUMN()-6,0),\"\")","v":"C44"},{"$f":"Liste!BC21","v":44},null,{"$f":"Liste!BA37","v":47},{"$f":"IFERROR(VLOOKUP($M18,Liste!$AA$7:$AD$70,COLUMN()-12,0),\"\")","v":"A47"},{"$f":"IFERROR(VLOOKUP($M18,Liste!$AA$7:$AD$70,COLUMN()-12,0),\"\")","v":"B47"},{"$f":"IFERROR(VLOOKUP($M18,Liste!$AA$7:$AD$70,COLUMN()-12,0),\"\")","v":"C47"},7,null,13,{"$f":"IFERROR(VLOOKUP($W18,Liste!$AA$7:$AD$70,COLUMN()-18,0),\"\")","v":"A33"},{"$f":"IFERROR(VLOOKUP($W18,Liste!$AA$7:$AD$70,COLUMN()-18,0),\"\")","v":"B33"},{"$f":"IFERROR(VLOOKUP($W18,Liste!$AA$7:$AD$70,COLUMN()-18,0),\"\")","v":"C33"},{"$f":"Liste!BC37","v":33}]
[{"$f":"Liste!BA22","v":50},{"$f":"IFERROR(VLOOKUP($A19,Liste!$AA$7:$AD$70,COLUMN(),0),\"\")","v":"A50"},{"$f":"IFERROR(VLOOKUP($A19,Liste!$AA$7:$AD$70,COLUMN(),0),\"\")","v":"B50"},{"$f":"IFERROR(VLOOKUP($A19,Liste!$AA$7:$AD$70,COLUMN(),0),\"\")","v":"C50"},4,null,13,{"$f":"IFERROR(VLOOKUP($K19,Liste!$AA$7:$AD$70,COLUMN()-6,0),\"\")","v":"A61"},{"$f":"IFERROR(VLOOKUP($K19,Liste!$AA$7:$AD$70,COLUMN()-6,0),\"\")","v":"B61"},{"$f":"IFERROR(VLOOKUP($K19,Liste!$AA$7:$AD$70,COLUMN()-6,0),\"\")","v":"C61"},{"$f":"Liste!BC22","v":61},null,{"$f":"Liste!BA38","v":59},{"$f":"IFERROR(VLOOKUP($M19,Liste!$AA$7:$AD$70,COLUMN()-12,0),\"\")","v":"A59"},{"$f":"IFERROR(VLOOKUP($M19,Liste!$AA$7:$AD$70,COLUMN()-12,0),\"\")","v":"B59"},{"$f":"IFERROR(VLOOKUP($M19,Liste!$AA$7:$AD$70,COLUMN()-12,0),\"\")","v":"C59"},13,null,4,{"$f":"IFERROR(VLOOKUP($W19,Liste!$AA$7:$AD$70,COLUMN()-18,0),\"\")","v":"A55"},{"$f":"IFERROR(VLOOKUP($W19,Liste!$AA$7:$AD$70,COLUMN()-18,0),\"\")","v":"B55"},{"$f":"IFERROR(VLOOKUP($W19,Liste!$AA$7:$AD$70,COLUMN()-18,0),\"\")","v":"C55"},{"$f":"Liste!BC38","v":55}]
[]
[null,null,null," "]
[null,null,null,null,null,null,null,null,null," "]
[]
[]
[]
[]
[null,{"$f":"B3","v":"A6"},{"$f":"E3","v":2},{"$f":"G3","v":13}]
[null,{"$f":"B4","v":"A20"},{"$f":"E4","v":13},{"$f":"G4","v":10}]
[null,"A37",13,11]
[null,"A52",13,2]
[null,"A5",5,13]
[null,"A19",13,8]
[null,"A38",13,7]
[null,"A51",4,13]
[null,{"$f":"B12","v":"A8"},{"$f":"E12","v":2},{"$f":"G12","v":13}]
[null,"A17",13,10]
[null,"A39",13,11]
[null,"A49",13,2]
[null,"A7",5,13]
[null,"A18",13,8]
[null,"A40",13,7]
[null,"A50",4,13]
[null,{"$f":"H3","v":"A9"},{"$f":"G3","v":13},{"$f":"E3","v":2}]
[null,{"$f":"H4","v":"A25"},{"$f":"G4","v":10},{"$f":"E4","v":13}]
[null,"A42",11,13]
[null,"A63",2,13]
[null,"A10",13,5]
[null,"A26",8,13]
[null,"A41",7,13]
[null,"A64",13,4]
[null,{"$f":"H12","v":"A12"},{"$f":"G12","v":13},{"$f":"E12","v":2}]
[null,"A28",10,13]
[null,"A43",11,13]
[null,"A62",2,13]
[null,"A11",13,5]
[null,"A27",8,13]
[null,"A44",7,13]
[null,"A61",13,4]
[null,{"$f":"N3","v":"A14"},{"$f":"Q3","v":13},{"$f":"S3","v":2}]
[null,{"$f":"N4","v":"A31"},{"$f":"Q4","v":10},{"$f":"S4","v":13}]
[null,"A45",11,13]
[null,"A57",2,13]
[null,"A13",13,5]
[null,"A32",8,13]
[null,"A46",7,13]
[null,"A58",13,4]
[null,{"$f":"N12","v":"A15"},{"$f":"Q12","v":13},{"$f":"S12","v":2}]
[null,"A30",10,13]
[null,"A48",11,13]
[null,"A60",2,13]
[null,"A16",13,5]
[null,"A29",8,13]
[null,"A47",7,13]
[null,"A59",13,4]
[null,{"$f":"T3","v":"A4"},{"$f":"S3","v":2},{"$f":"Q3","v":13}]
[null,{"$f":"T4","v":"A22"},{"$f":"S4","v":13},{"$f":"Q4","v":10}]
[null,"A35",13,11]
[null,"A54",13,2]
[null,"A3",5,13]
[null,"A21",13,8]
[null,"A36",13,7]
[null,"A53",4,13]
[null,{"$f":"T12","v":"A1"},{"$f":"S12","v":2},{"$f":"Q12","v":13}]
[null,"A24",13,10]
[null,"A34",13,11]
[null,"A56",13,2]
[null,"A2",5,13]
[null,"A23",13,8]
[null,"A33",13,7]
[null,"A55",4,13]
[null,{"$f":"C3","v":"B6"},{"$f":"E3","v":2},{"$f":"G3","v":13}]
[null,{"$f":"C4","v":"B20"},{"$f":"E4","v":13},{"$f":"G4","v":10}]
[null,"B37",13,11]
[null,"B52",13,2]
[null,"B5",5,13]
[null,"B19",13,8]
[null,"B38",13,7]
[null,"B51",4,13]
[null,{"$f":"C12","v":"B8"},{"$f":"E12","v":2},{"$f":"G12","v":13}]
[null,"B17",13,10]
[null,"B39",13,11]
[null,"B49",13,2]
[null,"B7",5,13]
[null,"B18",13,8]
[null,"B40",13,7]
[null,"B50",4,13]
[null,{"$f":"D3","v":"C6"},{"$f":"E3","v":2},{"$f":"G3","v":13}]
[null,{"$f":"D4","v":"C20"},{"$f":"E4","v":13},{"$f":"G4","v":10}]
[null,"C37",13,11]
[null,"C52",13,2]
[null,"C5",5,13]
[null,"C19",13,8]
[null,"C38",13,7]
[null,"C51",4,13]
[null,{"$f":"D12","v":"C8"},2,{"$f":"G12","v":13}]
[null,"C17",13,10]
[null,"C39",13,11]
[null,"C49",13,2]
[null,"C7",5,13]
[null,"C18",13,8]
[null,"C40",13,7]
[null,"C50",4,13]
[null,{"$f":"I3","v":"B9"},{"$f":"G3","v":13},{"$f":"E3","v":2}]
[null,{"$f":"I4","v":"B25"},{"$f":"G4","v":10},{"$f":"E4","v":13}]
[null,"B42",11,13]
[null,"B63",2,13]
[null,"B10",13,5]
[null,"B26",8,13]
[null,"B41",7,13]
[null,"B64",13,4]
[null,{"$f":"I12","v":"B12"},{"$f":"G12","v":13},{"$f":"E12","v":2}]
[null,"B28",10,13]
[null,"B43",11,13]
[null,"B62",2,13]
[null,"B11",13,5]
[null,"B27",8,13]
[null,"B44",7,13]
[null,"B61",13,4]
[null,{"$f":"J3","v":"C9"},{"$f":"G3","v":13},{"$f":"E3","v":2}]
[null,{"$f":"J4","v":"C25"},{"$f":"G4","v":10},{"$f":"E4","v":13}]
[null,"C42",11,13]
[null,"C63",2,13]
[null,"C10",13,5]
[null,"C26",8,13]
[null,"C41",7,13]
[null,"C64",13,4]
[null,{"$f":"J12","v":"C12"},{"$f":"G12","v":13},{"$f":"E12","v":2}]
[null,"C28",10,13]
[null,"C43",11,13]
[null,"C62",2,13]
[null,"C11",13,5]
[null,"C27",8,13]
[null,"C44",7,13]
[null,"C61",13,4]
[null,{"$f":"O3","v":"B14"},{"$f":"Q3","v":13},{"$f":"S3","v":2}]
[null,{"$f":"O4","v":"B31"},{"$f":"Q4","v":10},{"$f":"S4","v":13}]
[null,"B45",11,13]
[null,"B57",2,13]
[null,"B13",13,5]
[null,"B32",8,13]
[null,"B46",7,13]
[null,"B58",13,4]
[null,{"$f":"O12","v":"B15"},{"$f":"Q12","v":13},{"$f":"S12","v":2}]
[null,"B30",10,13]
[null,"B48",11,13]
[null,"B60",2,13]
[null,"B16",13,5]
[null,"B29",8,13]
[null,"B47",7,13]
[null,"B59",13,4]
[null,{"$f":"P3","v":"C14"},{"$f":"Q3","v":13},{"$f":"S3","v":2}]
[null,{"$f":"P4","v":"C31"},10,{"$f":"S4","v":13}]
[null,"C45",11,13]
[null,"C57",2,13]
[null,"C13",13,5]
[null,"C32",8,13]
[null,"C46",7,13]
[null,"C58",13,4]
[null,{"$f":"P12","v":"C15"},13,{"$f":"S12","v":2}]
[null,"C30",10,13]
[null,"C48",11,13]
[null,"C60",2,13]
[null,"C16",13,5]
[null,"C29",8,13]
[null,"C47",7,13]
[null,"C59",13,4]
[null,{"$f":"U3","v":"B4"},{"$f":"S3","v":2},{"$f":"Q3","v":13}]
[null,{"$f":"U4","v":"B22"},{"$f":"S4","v":13},{"$f":"Q4","v":10}]
[null,"B35",13,11]
[null,"B54",13,2]
[null,"B3",5,13]
[null,"B21",13,8]
[null,"B36",13,7]
[null,"B53",4,13]
[null,{"$f":"U12","v":"B1"},{"$f":"S12","v":2},{"$f":"Q12","v":13}]
[null,"B24",13,10]
[null,"B34",13,11]
[null,"B56",13,2]
[null,"B2",5,13]
[null,"B23",13,8]
[null,"B33",13,7]
[null,"B55",4,13]
[null,{"$f":"V3","v":"C4"},{"$f":"S3","v":2},{"$f":"Q3","v":13}]
[null,{"$f":"V4","v":"C22"},{"$f":"S4","v":13},{"$f":"Q4","v":10}]
[null,"C35",13,11]
[null,"C54",13,2]
[null,"C3",5,13]
[null,"C21",13,8]
[null,"C36",13,7]
[null,"C53",4,13]
[null,{"$f":"V12","v":"C1"},{"$f":"S12","v":2},{"$f":"Q12","v":13}]
[null,"C24",13,10]
[null,"C34",13,11]
[null,"C56",13,2]
[null,"C2",5,13]
[null,"C23",13,8]
[null,"C33",13,7]
[null,"C55",4,13]

{"sheet":"Recap","index":5,"n_rows":194,"n_cols":27,"rows_kept":194,"cut":false,"hidden":false,"merged":[[1,3,1,4],[1,5,1,6],[1,7,1,8],[1,9,1,10]]}
["Liste des joueurs",null,null,null,null,null,null,null,null,null,null,null,null,null,null,null,"Liste des joueurs",null,null,null,null,null,null,null,null,null,30072022]
["N° \n","Noms Prénoms",null,"P1",null,"P2",null,"P3",null,"P4",null,"Nom Prénoms","Total Points réalisés","Points Concédés","Parties Gagnées",null,"Cub","Nom Prénoms","Total Points réalisés","Points Concédés","Parties gagnées"]
[{"$f":"ROW()-2","v":1},{"$f":"IFERROR(INDEX(Liste!$I$7:$I$198,MATCH(Recap!A3,Liste!$L$7:$L$198,0)),\"\")","v":"A1"},null,{"$f":"IFERROR(VLOOKUP($B3,'Partie 1'!$B$27:$D$218,2,0),\"\")","v":13},{"$f":"IFERROR(VLOOKUP($B3,'Partie 1'!$B$27:$D$218,3,0),\"\")","v":2},{"$f":"IFERROR(VLOOKUP($B3,'Partie 2'!$B$27:$D$218,2,0),\"\")","v":2},{"$f":"IFERROR(VLOOKUP($B3,'Partie 2'!$B$27:$D$218,3,0),\"\")","v":13},{"$f":"IFERROR(VLOOKUP($B3,'Partie 3'!$B$27:$D$218,2,0),\"\")","v":2},{"$f":"IFERROR(VLOOKUP($B3,'Partie 3'!$B$27:$D$218,3,0),\"\")","v":13},{"$f":"IFERROR(VLOOKUP($B3,'Partie 4'!$B$27:$D$218,2,0),\"\")","v":2},{"$f":"IFERROR(VLOOKUP($B3,'Partie 4'!$B$27:$D$218,3,0),\"\")","v":13},{"$f":"IF(ISBLANK(B3),\"\",B3)","v":"A1"},{"$f":"SUMIF($D$2:$K$2,\"P*\",D3:K3)","v":19},{"$f":"SUMIF($D$2:$K$2,\"\",D3:K3)","v":41},{"$f":"COUNTIFS($D$2:$K$2,\"P*\",D3:K3,13)","v":1},null,{"$f":"IFERROR(INDEX(Liste!$G$7:$G$198,MATCH(B3,Liste!$I$7:$I$198,0)),\"\")","v":0},{"$f":"B3","v":"A1"},{"$f":"M3","v":19},{"$f":"N3","v":41},1]
[2,{"$f":"IFERROR(INDEX(Liste!$I$7:$I$198,MATCH(Recap!A4,Liste!$L$7:$L$198,0)),\"\")","v":"A2"},null,{"$f":"IFERROR(VLOOKUP($B4,'Partie 1'!$B$27:$D$218,2,0),\"\")","v":2},{"$f":"IFERROR(VLOOKUP($B4,'Partie 1'!$B$27:$D$218,3,0),\"\")","v":13},{"$f":"IFERROR(VLOOKUP($B4,'Partie 2'!$B$27:$D$218,2,0),\"\")","v":2},{"$f":"IFERROR(VLOOKUP($B4,'Partie 2'!$B$27:$D$218,3,0),\"\")","v":13},{"$f":"IFERROR(VLOOKUP($B4,'Partie 3'!$B$27:$D$218,2,0),\"\")","v":2},{"$f":"IFERROR(VLOOKUP($B4,'Partie 3'!$B$27:$D$218,3,0),\"\")","v":13},{"$f":"IFERROR(VLOOKUP($B4,'Partie 4'!$B$27:$D$218,2,0),\"\")","v":5},{"$f":"IFERROR(VLOOKUP($B4,'Partie 4'!$B$27:$D$218,3,0),\"\")","v":13},{"$f":"IF(ISBLANK(B4),\"\",B4)","v":"A2"},11,52,{"$f":"COUNTIFS($D$2:$K$2,\"P*\",D4:K4,13)","v":0},null,{"$f":"IFERROR(INDEX(Liste!$G$7:$G$198,MATCH(B4,Liste!$I$7:$I$198,0)),\"\")","v":0},{"$f":"B4","v":"A2"},{"$f":"M4","v":11},{"$f":"N4","v":52},{"$f":"O4","v":0}]
[3,{"$f":"IFERROR(INDEX(Liste!$I$7:$I$198,MATCH(Recap!A5,Liste!$L$7:$L$198,0)),\"\")","v":"A3"},null,{"$f":"IFERROR(VLOOKUP($B5,'Partie 1'!$B$27:$D$218,2,0),\"\")","v":10},{"$f":"IFERROR(VLOOKUP($B5,'Partie 1'!$B$27:$D$218,3,0),\"\")","v":13},{"$f":"IFERROR(VLOOKUP($B5,'Partie 2'!$B$27:$D$218,2,0),\"\")","v":13},{"$f":"IFERROR(VLOOKUP($B5,'Partie 2'!$B$27:$D$218,3,0),\"\")","v":2},{"$f":"IFERROR(VLOOKUP($B5,'Partie 3'!$B$27:$D$218,2,0),\"\")","v":2},{"$f":"IFERROR(VLOOKUP($B5,'Partie 3'!$B$27:$D$218,3,0),\"\")","v":13},{"$f":"IFERROR(VLOOKUP($B5,'Partie 4'!$B$27:$D$218,2,0),\"\")","v":5},{"$f":"IFERROR(VLOOKUP($B5,'Partie 4'!$B$27:$D$218,3,0),\"\")","v":13},"A3",30,41,1,null,{"$f":"IFERROR(INDEX(Liste!$G$7:$G$198,MATCH(B5,Liste!$I$7:$I$198,0)),\"\")","v":0},"A3",30,41,1]
[4,{"$f":"IFERROR(INDEX(Liste!$I$7:$I$198,MATCH(Recap!A6,Liste!$L$7:$L$198,0)),\"\")","v":"A4"},null,{"$f":"IFERROR(VLOOKUP($B6,'Partie 1'!$B$27:$D$218,2,0),\"\")","v":13},{"$f":"IFERROR(VLOOKUP($B6,'Partie 1'!$B$27:$D$218,3,0),\"\")","v":10},{"$f":"IFERROR(VLOOKUP($B6,'Partie 2'!$B$27:$D$218,2,0),\"\")","v":13},{"$f":"IFERROR(VLOOKUP($B6,'Partie 2'!$B$27:$D$218,3,0),\"\")","v":2},{"$f":"IFERROR(VLOOKUP($B6,'Partie 3'!$B$27:$D$218,2,0),\"\")","v":2},{"$f":"IFERROR(VLOOKUP($B6,'Partie 3'!$B$27:$D$218,3,0),\"\")","v":13},{"$f":"IFERROR(VLOOKUP($B6,'Partie 4'!$B$27:$D$218,2,0),\"\")","v":2},{"$f":"IFERROR(VLOOKUP($B6,'Partie 4'!$B$27:$D$218,3,0),\"\")","v":13},"A4",30,38,2,null,{"$f":"IFERROR(INDEX(Liste!$G$7:$G$198,MATCH(B6,Liste!$I$7:$I$198,0)),\"\")","v":0},"A4",30,38,2]
[5,{"$f":"IFERROR(INDEX(Liste!$I$7:$I$198,MATCH(Recap!A7,Liste!$L$7:$L$198,0)),\"\")","v":"A5"},null,{"$f":"IFERROR(VLOOKUP($B7,'Partie 1'!$B$27:$D$218,2,0),\"\")","v":11},{"$f":"IFERROR(VLOOKUP($B7,'Partie 1'!$B$27:$D$218,3,0),\"\")","v":13},{"$f":"IFERROR(VLOOKUP($B7,'Partie 2'!$B$27:$D$218,2,0),\"\")","v":13},{"$f":"IFERROR(VLOOKUP($B7,'Partie 2'!$B$27:$D$218,3,0),\"\")","v":10},{"$f":"IFERROR(VLOOKUP($B7,'Partie 3'!$B$27:$D$218,2,0),\"\")","v":13},{"$f":"IFERROR(VLOOKUP($B7,'Partie 3'!$B$27:$D$218,3,0),\"\")","v":2},{"$f":"IFERROR(VLOOKUP($B7,'Partie 4'!$B$27:$D$218,2,0),\"\")","v":5},{"$f":"IFERROR(VLOOKUP($B7,'Partie 4'!$B$27:$D$218,3,0),\"\")","v":13},"A5",42,38,2,null,{"$f":"IFERROR(INDEX(Liste!$G$7:$G$198,MATCH(B7,Liste!$I$7:$I$198,0)),\"\")","v":0},"A5",42,38,2]
[6,{"$f":"IFERROR(INDEX(Liste!$I$7:$I$198,MATCH(Recap!A8,Liste!$L$7:$L$198,0)),\"\")","v":"A6"},null,{"$f":"IFERROR(VLOOKUP($B8,'Partie 1'!$B$27:$D$218,2,0),\"\")","v":13},{"$f":"IFERROR(VLOOKUP($B8,'Partie 1'!$B$27:$D$218,3,0),\"\")","v":11},{"$f":"IFERROR(VLOOKUP($B8,'Partie 2'!$B$27:$D$218,2,0),\"\")","v":13},{"$f":"IFERROR(VLOOKUP($B8,'Partie 2'!$B$27:$D$218,3,0),\"\")","v":10},{"$f":"IFERROR(VLOOKUP($B8,'Partie 3'!$B$27:$D$218,2,0),\"\")","v":13},{"$f":"IFERROR(VLOOKUP($B8,'Partie 3'!$B$27:$D$218,3,0),\"\")","v":2},{"$f":"IFERROR(VLOOKUP($B8,'Partie 4'!$B$27:$D$218,2,0),\"\")","v":2},{"$f":"IFERROR(VLOOKUP($B8,'Partie 4'!$B$27:$D$218,3,0),\"\")","v":13},"A6",41,36,3,null,{"$f":"IFERROR(INDEX(Liste!$G$7:$G$198,MATCH(B8,Liste!$I$7:$I$198,0)),\"\")","v":0},"A6",41,36,3]
[7,{"$f":"IFERROR(INDEX(Liste!$I$7:$I$198,MATCH(Recap!A9,Liste!$L$7:$L$198,0)),\"\")","v":"A7"},null,{"$f":"IFERROR(VLOOKUP($B9,'Partie 1'!$B$27:$D$218,2,0),\"\")","v":2},{"$f":"IFERROR(VLOOKUP($B9,'Partie 1'!$B$27:$D$218,3,0),\"\")","v":13},{"$f":"IFERROR(VLOOKUP($B9,'Partie 2'!$B$27:$D$218,2,0),\"\")","v":10},{"$f":"IFERROR(VLOOKUP($B9,'Partie 2'!$B$27:$D$218,3,0),\"\")","v":13},{"$f":"IFERROR(VLOOKUP($B9,'Partie 3'!$B$27:$D$218,2,0),\"\")","v":13},{"$f":"IFERROR(VLOOKUP($B9,'Partie 3'!$B$27:$D$218,3,0),\"\")","v":2},{"$f":"IFERROR(VLOOKUP($B9,'Partie 4'!$B$27:$D$218,2,0),\"\")","v":5},{"$f":"IFERROR(VLOOKUP($B9,'Partie 4'!$B$27:$D$218,3,0),\"\")","v":13},"A7",30,41,1,null,{"$f":"IFERROR(INDEX(Liste!$G$7:$G$198,MATCH(B9,Liste!$I$7:$I$198,0)),\"\")","v":0},"A7",30,41,1]
[8,{"$f":"IFERROR(INDEX(Liste!$I$7:$I$198,MATCH(Recap!A10,Liste!$L$7:$L$198,0)),\"\")","v":"A8"},null,{"$f":"IFERROR(VLOOKUP($B10,'Partie 1'!$B$27:$D$218,2,0),\"\")","v":13},{"$f":"IFERROR(VLOOKUP($B10,'Partie 1'!$B$27:$D$218,3,0),\"\")","v":2},{"$f":"IFERROR(VLOOKUP($B10,'Partie 2'!$B$27:$D$218,2,0),\"\")","v":10},{"$f":"IFERROR(VLOOKUP($B10,'Partie 2'!$B$27:$D$218,3,0),\"\")","v":13},{"$f":"IFERROR(VLOOKUP($B10,'Partie 3'!$B$27:$D$218,2,0),\"\")","v":13},{"$f":"IFERROR(VLOOKUP($B10,'Partie 3'!$B$27:$D$218,3,0),\"\")","v":2},{"$f":"IFERROR(VLOOKUP($B10,'Partie 4'!$B$27:$D$218,2,0),\"\")","v":2},{"$f":"IFERROR(VLOOKUP($B10,'Partie 4'!$B$27:$D$218,3,0),\"\")","v":13},"A8",38,30,2,null,{"$f":"IFERROR(INDEX(Liste!$G$7:$G$198,MATCH(B10,Liste!$I$7:$I$198,0)),\"\")","v":0},"A8",38,30,2]
[9,{"$f":"IFERROR(INDEX(Liste!$I$7:$I$198,MATCH(Recap!A11,Liste!$L$7:$L$198,0)),\"\")","v":"A9"},null,{"$f":"IFERROR(VLOOKUP($B11,'Partie 1'!$B$27:$D$218,2,0),\"\")","v":13},{"$f":"IFERROR(VLOOKUP($B11,'Partie 1'!$B$27:$D$218,3,0),\"\")","v":1},{"$f":"IFERROR(VLOOKUP($B11,'Partie 2'!$B$27:$D$218,2,0),\"\")","v":13},{"$f":"IFERROR(VLOOKUP($B11,'Partie 2'!$B$27:$D$218,3,0),\"\")","v":11},{"$f":"IFERROR(VLOOKUP($B11,'Partie 3'!$B$27:$D$218,2,0),\"\")","v":13},{"$f":"IFERROR(VLOOKUP($B11,'Partie 3'!$B$27:$D$218,3,0),\"\")","v":10},{"$f":"IFERROR(VLOOKUP($B11,'Partie 4'!$B$27:$D$218,2,0),\"\")","v":13},{"$f":"IFERROR(VLOOKUP($B11,'Partie 4'!$B$27:$D$218,3,0),\"\")","v":2},"A9",52,24,4,null,{"$f":"IFERROR(INDEX(Liste!$G$7:$G$198,MATCH(B11,Liste!$I$7:$I$198,0)),\"\")","v":0},"A9",52,24,4]
[10,{"$f":"IFERROR(INDEX(Liste!$I$7:$I$198,MATCH(Recap!A12,Liste!$L$7:$L$198,0)),\"\")","v":"A10"},null,{"$f":"IFERROR(VLOOKUP($B12,'Partie 1'!$B$27:$D$218,2,0),\"\")","v":1},{"$f":"IFERROR(VLOOKUP($B12,'Partie 1'!$B$27:$D$218,3,0),\"\")","v":13},{"$f":"IFERROR(VLOOKUP($B12,'Partie 2'!$B$27:$D$218,2,0),\"\")","v":13},{"$f":"IFERROR(VLOOKUP($B12,'Partie 2'!$B$27:$D$218,3,0),\"\")","v":11},{"$f":"IFERROR(VLOOKUP($B12,'Partie 3'!$B$27:$D$218,2,0),\"\")","v":13},{"$f":"IFERROR(VLOOKUP($B12,'Partie 3'!$B$27:$D$218,3,0),\"\")","v":10},{"$f":"IFERROR(VLOOKUP($B12,'Partie 4'!$B$27:$D$218,2,0),\"\")","v":13},{"$f":"IFERROR(VLOOKUP($B12,'Partie 4'!$B$27:$D$218,3,0),\"\")","v":5},"A10",40,39,3,null,{"$f":"IFERROR(INDEX(Liste!$G$7:$G$198,MATCH(B12,Liste!$I$7:$I$198,0)),\"\")","v":0},"A10",40,39,3]
[11,{"$f":"IFERROR(INDEX(Liste!$I$7:$I$198,MATCH(Recap!A13,Liste!$L$7:$L$198,0)),\"\")","v":"A11"},null,{"$f":"IFERROR(VLOOKUP($B13,'Partie 1'!$B$27:$D$218,2,0),\"\")","v":8},{"$f":"IFERROR(VLOOKUP($B13,'Partie 1'!$B$27:$D$218,3,0),\"\")","v":13},{"$f":"IFERROR(VLOOKUP($B13,'Partie 2'!$B$27:$D$218,2,0),\"\")","v":11},{"$f":"IFERROR(VLOOKUP($B13,'Partie 2'!$B$27:$D$218,3,0),\"\")","v":13},{"$f":"IFERROR(VLOOKUP($B13,'Partie 3'!$B$27:$D$218,2,0),\"\")","v":13},{"$f":"IFERROR(VLOOKUP($B13,'Partie 3'!$B$27:$D$218,3,0),\"\")","v":10},{"$f":"IFERROR(VLOOKUP($B13,'Partie 4'!$B$27:$D$218,2,0),\"\")","v":13},{"$f":"IFERROR(VLOOKUP($B13,'Partie 4'!$B$27:$D$218,3,0),\"\")","v":5},"A11",45,41,2,null,{"$f":"IFERROR(INDEX(Liste!$G$7:$G$198,MATCH(B13,Liste!$I$7:$I$198,0)),\"\")","v":0},"A11",45,41,2]
[12,{"$f":"IFERROR(INDEX(Liste!$I$7:$I$198,MATCH(Recap!A14,Liste!$L$7:$L$198,0)),\"\")","v":"A12"},null,{"$f":"IFERROR(VLOOKUP($B14,'Partie 1'!$B$27:$D$218,2,0),\"\")","v":13},{"$f":"IFERROR(VLOOKUP($B14,'Partie 1'!$B$27:$D$218,3,0),\"\")","v":8},{"$f":"IFERROR(VLOOKUP($B14,'Partie 2'!$B$27:$D$218,2,0),\"\")","v":11},{"$f":"IFERROR(VLOOKUP($B14,'Partie 2'!$B$27:$D$218,3,0),\"\")","v":13},{"$f":"IFERROR(VLOOKUP($B14,'Partie 3'!$B$27:$D$218,2,0),\"\")","v":13},{"$f":"IFERROR(VLOOKUP($B14,'Partie 3'!$B$27:$D$218,3,0),\"\")","v":10},{"$f":"IFERROR(VLOOKUP($B14,'Partie 4'!$B$27:$D$218,2,0),\"\")","v":13},{"$f":"IFERROR(VLOOKUP($B14,'Partie 4'!$B$27:$D$218,3,0),\"\")","v":2},"A12",50,33,3,null,{"$f":"IFERROR(INDEX(Liste!$G$7:$G$198,MATCH(B14,Liste!$I$7:$I$198,0)),\"\")","v":0},"A12",50,33,3]
[13,{"$f":"IFERROR(INDEX(Liste!$I$7:$I$198,MATCH(Recap!A15,Liste!$L$7:$L$198,0)),\"\")","v":"A13"},null,{"$f":"IFERROR(VLOOKUP($B15,'Partie 1'!$B$27:$D$218,2,0),\"\")","v":7},{"$f":"IFERROR(VLOOKUP($B15,'Partie 1'!$B$27:$D$218,3,0),\"\")","v":13},{"$f":"IFERROR(VLOOKUP($B15,'Partie 2'!$B$27:$D$218,2,0),\"\")","v":13},{"$f":"IFERROR(VLOOKUP($B15,'Partie 2'!$B$27:$D$218,3,0),\"\")","v":2},{"$f":"IFERROR(VLOOKUP($B15,'Partie 3'!$B$27:$D$218,2,0),\"\")","v":10},{"$f":"IFERROR(VLOOKUP($B15,'Partie 3'!$B$27:$D$218,3,0),\"\")","v":13},{"$f":"IFERROR(VLOOKUP($B15,'Partie 4'!$B$27:$D$218,2,0),\"\")","v":13},{"$f":"IFERROR(VLOOKUP($B15,'Partie 4'!$B$27:$D$218,3,0),\"\")","v":5},"A13",43,33,2,null,{"$f":"IFERROR(INDEX(Liste!$G$7:$G$198,MATCH(B15,Liste!$I$7:$I$198,0)),\"\")","v":0},"A13",43,33,2]
[14,{"$f":"IFERROR(INDEX(Liste!$I$7:$I$198,MATCH(Recap!A16,Liste!$L$7:$L$198,0)),\"\")","v":"A14"},null,{"$f":"IFERROR(VLOOKUP($B16,'Partie 1'!$B$27:$D$218,2,0),\"\")","v":13},{"$f":"IFERROR(VLOOKUP($B16,'Partie 1'!$B$27:$D$218,3,0),\"\")","v":7},{"$f":"IFERROR(VLOOKUP($B16,'Partie 2'!$B$27:$D$218,2,0),\"\")","v":13},{"$f":"IFERROR(VLOOKUP($B16,'Partie 2'!$B$27:$D$218,3,0),\"\")","v":2},{"$f":"IFERROR(VLOOKUP($B16,'Partie 3'!$B$27:$D$218,2,0),\"\")","v":10},{"$f":"IFERROR(VLOOKUP($B16,'Partie 3'!$B$27:$D$218,3,0),\"\")","v":13},{"$f":"IFERROR(VLOOKUP($B16,'Partie 4'!$B$27:$D$218,2,0),\"\")","v":13},{"$f":"IFERROR(VLOOKUP($B16,'Partie 4'!$B$27:$D$218,3,0),\"\")","v":2},"A14",49,24,3,null,{"$f":"IFERROR(INDEX(Liste!$G$7:$G$198,MATCH(B16,Liste!$I$7:$I$198,0)),\"\")","v":0},"A14",49,24,3]
[15,{"$f":"IFERROR(INDEX(Liste!$I$7:$I$198,MATCH(Recap!A17,Liste!$L$7:$L$198,0)),\"\")","v":"A15"},null,{"$f":"IFERROR(VLOOKUP($B17,'Partie 1'!$B$27:$D$218,2,0),\"\")","v":13},{"$f":"IFERROR(VLOOKUP($B17,'Partie 1'!$B$27:$D$218,3,0),\"\")","v":4},{"$f":"IFERROR(VLOOKUP($B17,'Partie 2'!$B$27:$D$218,2,0),\"\")","v":2},{"$f":"IFERROR(VLOOKUP($B17,'Partie 2'!$B$27:$D$218,3,0),\"\")","v":13},{"$f":"IFERROR(VLOOKUP($B17,'Partie 3'!$B$27:$D$218,2,0),\"\")","v":10},{"$f":"IFERROR(VLOOKUP($B17,'Partie 3'!$B$27:$D$218,3,0),\"\")","v":13},{"$f":"IFERROR(VLOOKUP($B17,'Partie 4'!$B$27:$D$218,2,0),\"\")","v":13},{"$f":"IFERROR(VLOOKUP($B17,'Partie 4'!$B$27:$D$218,3,0),\"\")","v":2},"A15",38,32,2,null,{"$f":"IFERROR(INDEX(Liste!$G$7:$G$198,MATCH(B17,Liste!$I$7:$I$198,0)),\"\")","v":0},"A15",38,32,2]
[16,{"$f":"IFERROR(INDEX(Liste!$I$7:$I$198,MATCH(Recap!A18,Liste!$L$7:$L$198,0)),\"\")","v":"A16"},null,{"$f":"IFERROR(VLOOKUP($B18,'Partie 1'!$B$27:$D$218,2,0),\"\")","v":4},{"$f":"IFERROR(VLOOKUP($B18,'Partie 1'!$B$27:$D$218,3,0),\"\")","v":13},{"$f":"IFERROR(VLOOKUP($B18,'Partie 2'!$B$27:$D$218,2,0),\"\")","v":2},{"$f":"IFERROR(VLOOKUP($B18,'Partie 2'!$B$27:$D$218,3,0),\"\")","v":13},{"$f":"IFERROR(VLOOKUP($B18,'Partie 3'!$B$27:$D$218,2,0),\"\")","v":10},{"$f":"IFERROR(VLOOKUP($B18,'Partie 3'!$B$27:$D$218,3,0),\"\")","v":13},{"$f":"IFERROR(VLOOKUP($B18,'Partie 4'!$B$27:$D$218,2,0),\"\")","v":13},{"$f":"IFERROR(VLOOKUP($B18,'Partie 4'!$B$27:$D$218,3,0),\"\")","v":5},"A16",29,44,1,null,{"$f":"IFERROR(INDEX(Liste!$G$7:$G$198,MATCH(B18,Liste!$I$7:$I$198,0)),\"\")","v":0},"A16",29,44,1]
[17,{"$f":"IFERROR(INDEX(Liste!$I$7:$I$198,MATCH(Recap!A19,Liste!$L$7:$L$198,0)),\"\")","v":"A17"},null,{"$f":"IFERROR(VLOOKUP($B19,'Partie 1'!$B$27:$D$218,2,0),\"\")","v":13},{"$f":"IFERROR(VLOOKUP($B19,'Partie 1'!$B$27:$D$218,3,0),\"\")","v":2},{"$f":"IFERROR(VLOOKUP($B19,'Partie 2'!$B$27:$D$218,2,0),\"\")","v":5},{"$f":"IFERROR(VLOOKUP($B19,'Partie 2'!$B$27:$D$218,3,0),\"\")","v":13},{"$f":"IFERROR(VLOOKUP($B19,'Partie 3'!$B$27:$D$218,2,0),\"\")","v":13},{"$f":"IFERROR(VLOOKUP($B19,'Partie 3'!$B$27:$D$218,3,0),\"\")","v":11},{"$f":"IFERROR(VLOOKUP($B19,'Partie 4'!$B$27:$D$218,2,0),\"\")","v":13},{"$f":"IFERROR(VLOOKUP($B19,'Partie 4'!$B$27:$D$218,3,0),\"\")","v":10},"A17",44,36,3,null,{"$f":"IFERROR(INDEX(Liste!$G$7:$G$198,MATCH(B19,Liste!$I$7:$I$198,0)),\"\")","v":0},"A17",44,36,3]
[18,{"$f":"IFERROR(INDEX(Liste!$I$7:$I$198,MATCH(Recap!A20,Liste!$L$7:$L$198,0)),\"\")","v":"A18"},null,{"$f":"IFERROR(VLOOKUP($B20,'Partie 1'!$B$27:$D$218,2,0),\"\")","v":2},{"$f":"IFERROR(VLOOKUP($B20,'Partie 1'!$B$27:$D$218,3,0),\"\")","v":13},{"$f":"IFERROR(VLOOKUP($B20,'Partie 2'!$B$27:$D$218,2,0),\"\")","v":5},{"$f":"IFERROR(VLOOKUP($B20,'Partie 2'!$B$27:$D$218,3,0),\"\")","v":13},{"$f":"IFERROR(VLOOKUP($B20,'Partie 3'!$B$27:$D$218,2,0),\"\")","v":13},{"$f":"IFERROR(VLOOKUP($B20,'Partie 3'!$B$27:$D$218,3,0),\"\")","v":11},{"$f":"IFERROR(VLOOKUP($B20,'Partie 4'!$B$27:$D$218,2,0),\"\")","v":13},{"$f":"IFERROR(VLOOKUP($B20,'Partie 4'!$B$27:$D$218,3,0),\"\")","v":8},"A18",33,45,2,null,{"$f":"IFERROR(INDEX(Liste!$G$7:$G$198,MATCH(B20,Liste!$I$7:$I$198,0)),\"\")","v":0},"A18",33,45,2]
[19,{"$f":"IFERROR(INDEX(Liste!$I$7:$I$198,MATCH(Recap!A21,Liste!$L$7:$L$198,0)),\"\")","v":"A19"},null,{"$f":"IFERROR(VLOOKUP($B21,'Partie 1'!$B$27:$D$218,2,0),\"\")","v":10},{"$f":"IFERROR(VLOOKUP($B21,'Partie 1'!$B$27:$D$218,3,0),\"\")","v":13},{"$f":"IFERROR(VLOOKUP($B21,'Partie 2'!$B$27:$D$218,2,0),\"\")","v":13},{"$f":"IFERROR(VLOOKUP($B21,'Partie 2'!$B$27:$D$218,3,0),\"\")","v":5},{"$f":"IFERROR(VLOOKUP($B21,'Partie 3'!$B$27:$D$218,2,0),\"\")","v":13},{"$f":"IFERROR(VLOOKUP($B21,'Partie 3'!$B$27:$D$218,3,0),\"\")","v":11},{"$f":"IFERROR(VLOOKUP($B21,'Partie 4'!$B$27:$D$218,2,0),\"\")","v":13},{"$f":"IFERROR(VLOOKUP($B21,'Partie 4'!$B$27:$D$218,3,0),\"\")","v":8},"A19",49,37,3,null,{"$f":"IFERROR(INDEX(Liste!$G$7:$G$198,MATCH(B21,Liste!$I$7:$I$198,0)),\"\")","v":0},"A19",49,37,3]
[20,{"$f":"IFERROR(INDEX(Liste!$I$7:$I$198,MATCH(Recap!A22,Liste!$L$7:$L$198,0)),\"\")","v":"A20"},null,{"$f":"IFERROR(VLOOKUP($B22,'Partie 1'!$B$27:$D$218,2,0),\"\")","v":13},{"$f":"IFERROR(VLOOKUP($B22,'Partie 1'!$B$27:$D$218,3,0),\"\")","v":10},{"$f":"IFERROR(VLOOKUP($B22,'Partie 2'!$B$27:$D$218,2,0),\"\")","v":13},{"$f":"IFERROR(VLOOKUP($B22,'Partie 2'!$B$27:$D$218,3,0),\"\")","v":5},{"$f":"IFERROR(VLOOKUP($B22,'Partie 3'!$B$27:$D$218,2,0),\"\")","v":13},{"$f":"IFERROR(VLOOKUP($B22,'Partie 3'!$B$27:$D$218,3,0),\"\")","v":11},{"$f":"IFERROR(VLOOKUP($B22,'Partie 4'!$B$27:$D$218,2,0),\"\")","v":13},{"$f":"IFERROR(VLOOKUP($B22,'Partie 4'!$B$27:$D$218,3,0),\"\")","v":10},"A20",52,36,4,null,{"$f":"IFERROR(INDEX(Liste!$G$7:$G$198,MATCH(B22,Liste!$I$7:$I$198,0)),\"\")","v":0},"A20",52,36,4]
[21,{"$f":"IFERROR(INDEX(Liste!$I$7:$I$198,MATCH(Recap!A23,Liste!$L$7:$L$198,0)),\"\")","v":"A21"},null,{"$f":"IFERROR(VLOOKUP($B23,'Partie 1'!$B$27:$D$218,2,0),\"\")","v":11},{"$f":"IFERROR(VLOOKUP($B23,'Partie 1'!$B$27:$D$218,3,0),\"\")","v":13},{"$f":"IFERROR(VLOOKUP($B23,'Partie 2'!$B$27:$D$218,2,0),\"\")","v":13},{"$f":"IFERROR(VLOOKUP($B23,'Partie 2'!$B$27:$D$218,3,0),\"\")","v":8},{"$f":"IFERROR(VLOOKUP($B23,'Partie 3'!$B$27:$D$218,2,0),\"\")","v":11},{"$f":"IFERROR(VLOOKUP($B23,'Partie 3'!$B$27:$D$218,3,0),\"\")","v":13},{"$f":"IFERROR(VLOOKUP($B23,'Partie 4'!$B$27:$D$218,2,0),\"\")","v":13},{"$f":"IFERROR(VLOOKUP($B23,'Partie 4'!$B$27:$D$218,3,0),\"\")","v":8},"A21",48,42,2,null,{"$f":"IFERROR(INDEX(Liste!$G$7:$G$198,MATCH(B23,Liste!$I$7:$I$198,0)),\"\")","v":0},"A21",48,42,2]
[22,{"$f":"IFERROR(INDEX(Liste!$I$7:$I$198,MATCH(Recap!A24,Liste!$L$7:$L$198,0)),\"\")","v":"A22"},null,{"$f":"IFERROR(VLOOKUP($B24,'Partie 1'!$B$27:$D$218,2,0),\"\")","v":13},{"$f":"IFERROR(VLOOKUP($B24,'Partie 1'!$B$27:$D$218,3,0),\"\")","v":11},{"$f":"IFERROR(VLOOKUP($B24,'Partie 2'!$B$27:$D$218,2,0),\"\")","v":13},{"$f":"IFERROR(VLOOKUP($B24,'Partie 2'!$B$27:$D$218,3,0),\"\")","v":8},{"$f":"IFERROR(VLOOKUP($B24,'Partie 3'!$B$27:$D$218,2,0),\"\")","v":11},{"$f":"IFERROR(VLOOKUP($B24,'Partie 3'!$B$27:$D$218,3,0),\"\")","v":13},{"$f":"IFERROR(VLOOKUP($B24,'Partie 4'!$B$27:$D$218,2,0),\"\")","v":13},{"$f":"IFERROR(VLOOKUP($B24,'Partie 4'!$B$27:$D$218,3,0),\"\")","v":10},"A22",50,42,3,null,{"$f":"IFERROR(INDEX(Liste!$G$7:$G$198,MATCH(B24,Liste!$I$7:$I$198,0)),\"\")","v":0},"A22",50,42,3]
[23,{"$f":"IFERROR(INDEX(Liste!$I$7:$I$198,MATCH(Recap!A25,Liste!$L$7:$L$198,0)),\"\")","v":"A23"},null,{"$f":"IFERROR(VLOOKUP($B25,'Partie 1'!$B$27:$D$218,2,0),\"\")","v":2},{"$f":"IFERROR(VLOOKUP($B25,'Partie 1'!$B$27:$D$218,3,0),\"\")","v":13},{"$f":"IFERROR(VLOOKUP($B25,'Partie 2'!$B$27:$D$218,2,0),\"\")","v":8},{"$f":"IFERROR(VLOOKUP($B25,'Partie 2'!$B$27:$D$218,3,0),\"\")","v":13},{"$f":"IFERROR(VLOOKUP($B25,'Partie 3'!$B$27:$D$218,2,0),\"\")","v":11},{"$f":"IFERROR(VLOOKUP($B25,'Partie 3'!$B$27:$D$218,3,0),\"\")","v":13},{"$f":"IFERROR(VLOOKUP($B25,'Partie 4'!$B$27:$D$218,2,0),\"\")","v":13},{"$f":"IFERROR(VLOOKUP($B25,'Partie 4'!$B$27:$D$218,3,0),\"\")","v":8},"A23",34,47,1,null,{"$f":"IFERROR(INDEX(Liste!$G$7:$G$198,MATCH(B25,Liste!$I$7:$I$198,0)),\"\")","v":0},"A23",34,47,1]
[24,{"$f":"IFERROR(INDEX(Liste!$I$7:$I$198,MATCH(Recap!A26,Liste!$L$7:$L$198,0)),\"\")","v":"A24"},null,{"$f":"IFERROR(VLOOKUP($B26,'Partie 1'!$B$27:$D$218,2,0),\"\")","v":13},{"$f":"IFERROR(VLOOKUP($B26,'Partie 1'!$B$27:$D$218,3,0),\"\")","v":2},{"$f":"IFERROR(VLOOKUP($B26,'Partie 2'!$B$27:$D$218,2,0),\"\")","v":8},{"$f":"IFERROR(VLOOKUP($B26,'Partie 2'!$B$27:$D$218,3,0),\"\")","v":13},{"$f":"IFERROR(VLOOKUP($B26,'Partie 3'!$B$27:$D$218,2,0),\"\")","v":11},{"$f":"IFERROR(VLOOKUP($B26,'Partie 3'!$B$27:$D$218,3,0),\"\")","v":13},{"$f":"IFERROR(VLOOKUP($B26,'Partie 4'!$B$27:$D$218,2,0),\"\")","v":13},{"$f":"IFERROR(VLOOKUP($B26,'Partie 4'!$B$27:$D$218,3,0),\"\")","v":10},"A24",45,38,2,null,{"$f":"IFERROR(INDEX(Liste!$G$7:$G$198,MATCH(B26,Liste!$I$7:$I$198,0)),\"\")","v":0},"A24",45,38,2]
[25,{"$f":"IFERROR(INDEX(Liste!$I$7:$I$198,MATCH(Recap!A27,Liste!$L$7:$L$198,0)),\"\")","v":"A25"},null,{"$f":"IFERROR(VLOOKUP($B27,'Partie 1'!$B$27:$D$218,2,0),\"\")","v":13},{"$f":"IFERROR(VLOOKUP($B27,'Partie 1'!$B$27:$D$218,3,0),\"\")","v":5},{"$f":"IFERROR(VLOOKUP($B27,'Partie 2'!$B$27:$D$218,2,0),\"\")","v":13},{"$f":"IFERROR(VLOOKUP($B27,'Partie 2'!$B$27:$D$218,3,0),\"\")","v":7},{"$f":"IFERROR(VLOOKUP($B27,'Partie 3'!$B$27:$D$218,2,0),\"\")","v":13},{"$f":"IFERROR(VLOOKUP($B27,'Partie 3'!$B$27:$D$218,3,0),\"\")","v":2},{"$f":"IFERROR(VLOOKUP($B27,'Partie 4'!$B$27:$D$218,2,0),\"\")","v":10},{"$f":"IFERROR(VLOOKUP($B27,'Partie 4'!$B$27:$D$218,3,0),\"\")","v":13},"A25",49,27,3,null,{"$f":"IFERROR(INDEX(Liste!$G$7:$G$198,MATCH(B27,Liste!$I$7:$I$198,0)),\"\")","v":0},"A25",49,27,3]
[26,{"$f":"IFERROR(INDEX(Liste!$I$7:$I$198,MATCH(Recap!A28,Liste!$L$7:$L$198,0)),\"\")","v":"A26"},null,{"$f":"IFERROR(VLOOKUP($B28,'Partie 1'!$B$27:$D$218,2,0),\"\")","v":5},{"$f":"IFERROR(VLOOKUP($B28,'Partie 1'!$B$27:$D$218,3,0),\"\")","v":13},{"$f":"IFERROR(VLOOKUP($B28,'Partie 2'!$B$27:$D$218,2,0),\"\")","v":13},{"$f":"IFERROR(VLOOKUP($B28,'Partie 2'!$B$27:$D$218,3,0),\"\")","v":7},{"$f":"IFERROR(VLOOKUP($B28,'Partie 3'!$B$27:$D$218,2,0),\"\")","v":13},{"$f":"IFERROR(VLOOKUP($B28,'Partie 3'!$B$27:$D$218,3,0),\"\")","v":2},{"$f":"IFERROR(VLOOKUP($B28,'Partie 4'!$B$27:$D$218,2,0),\"\")","v":8},{"$f":"IFERROR(VLOOKUP($B28,'Partie 4'!$B$27:$D$218,3,0),\"\")","v":13},"A26",39,35,2,null,{"$f":"IFERROR(INDEX(Liste!$G$7:$G$198,MATCH(B28,Liste!$I$7:$I$198,0)),\"\")","v":0},"A26",39,35,2]
[27,{"$f":"IFERROR(INDEX(Liste!$I$7:$I$198,MATCH(Recap!A29,Liste!$L$7:$L$198,0)),\"\")","v":"A27"},null,{"$f":"IFERROR(VLOOKUP($B29,'Partie 1'!$B$27:$D$218,2,0),\"\")","v":8},{"$f":"IFERROR(VLOOKUP($B29,'Partie 1'!$B$27:$D$218,3,0),\"\")","v":13},{"$f":"IFERROR(VLOOKUP($B29,'Partie 2'!$B$27:$D$218,2,0),\"\")","v":7},{"$f":"IFERROR(VLOOKUP($B29,'Partie 2'!$B$27:$D$218,3,0),\"\")","v":13},{"$f":"IFERROR(VLOOKUP($B29,'Partie 3'!$B$27:$D$218,2,0),\"\")","v":13},{"$f":"IFERROR(VLOOKUP($B29,'Partie 3'!$B$27:$D$218,3,0),\"\")","v":2},{"$f":"IFERROR(VLOOKUP($B29,'Partie 4'!$B$27:$D$218,2,0),\"\")","v":8},{"$f":"IFERROR(VLOOKUP($B29,'Partie 4'!$B$27:$D$218,3,0),\"\")","v":13},"A27",36,41,1,null,{"$f":"IFERROR(INDEX(Liste!$G$7:$G$198,MATCH(B29,Liste!$I$7:$I$198,0)),\"\")","v":0},"A27",36,41,1]
[28,{"$f":"IFERROR(INDEX(Liste!$I$7:$I$198,MATCH(Recap!A30,Liste!$L$7:$L$198,0)),\"\")","v":"A28"},null,{"$f":"IFERROR(VLOOKUP($B30,'Partie 1'!$B$27:$D$218,2,0),\"\")","v":13},{"$f":"IFERROR(VLOOKUP($B30,'Partie 1'!$B$27:$D$218,3,0),\"\")","v":8},{"$f":"IFERROR(VLOOKUP($B30,'Partie 2'!$B$27:$D$218,2,0),\"\")","v":7},{"$f":"IFERROR(VLOOKUP($B30,'Partie 2'!$B$27:$D$218,3,0),\"\")","v":13},{"$f":"IFERROR(VLOOKUP($B30,'Partie 3'!$B$27:$D$218,2,0),\"\")","v":13},{"$f":"IFERROR(VLOOKUP($B30,'Partie 3'!$B$27:$D$218,3,0),\"\")","v":2},{"$f":"IFERROR(VLOOKUP($B30,'Partie 4'!$B$27:$D$218,2,0),\"\")","v":10},{"$f":"IFERROR(VLOOKUP($B30,'Partie 4'!$B$27:$D$218,3,0),\"\")","v":13},"A28",43,36,2,null,{"$f":"IFERROR(INDEX(Liste!$G$7:$G$198,MATCH(B30,Liste!$I$7:$I$198,0)),\"\")","v":0},"A28",43,36,2]
[29,{"$f":"IFERROR(INDEX(Liste!$I$7:$I$198,MATCH(Recap!A31,Liste!$L$7:$L$198,0)),\"\")","v":"A29"},null,{"$f":"IFERROR(VLOOKUP($B31,'Partie 1'!$B$27:$D$218,2,0),\"\")","v":7},{"$f":"IFERROR(VLOOKUP($B31,'Partie 1'!$B$27:$D$218,3,0),\"\")","v":13},{"$f":"IFERROR(VLOOKUP($B31,'Partie 2'!$B$27:$D$218,2,0),\"\")","v":4},{"$f":"IFERROR(VLOOKUP($B31,'Partie 2'!$B$27:$D$218,3,0),\"\")","v":13},{"$f":"IFERROR(VLOOKUP($B31,'Partie 3'!$B$27:$D$218,2,0),\"\")","v":2},{"$f":"IFERROR(VLOOKUP($B31,'Partie 3'!$B$27:$D$218,3,0),\"\")","v":13},{"$f":"IFERROR(VLOOKUP($B31,'Partie 4'!$B$27:$D$218,2,0),\"\")","v":8},{"$f":"IFERROR(VLOOKUP($B31,'Partie 4'!$B$27:$D$218,3,0),\"\")","v":13},"A29",21,52,0,null,{"$f":"IFERROR(INDEX(Liste!$G$7:$G$198,MATCH(B31,Liste!$I$7:$I$198,0)),\"\")","v":0},"A29",21,52,0]
[30,{"$f":"IFERROR(INDEX(Liste!$I$7:$I$198,MATCH(Recap!A32,Liste!$L$7:$L$198,0)),\"\")","v":"A30"},null,{"$f":"IFERROR(VLOOKUP($B32,'Partie 1'!$B$27:$D$218,2,0),\"\")","v":13},{"$f":"IFERROR(VLOOKUP($B32,'Partie 1'!$B$27:$D$218,3,0),\"\")","v":7},{"$f":"IFERROR(VLOOKUP($B32,'Partie 2'!$B$27:$D$218,2,0),\"\")","v":4},{"$f":"IFERROR(VLOOKUP($B32,'Partie 2'!$B$27:$D$218,3,0),\"\")","v":13},{"$f":"IFERROR(VLOOKUP($B32,'Partie 3'!$B$27:$D$218,2,0),\"\")","v":2},{"$f":"IFERROR(VLOOKUP($B32,'Partie 3'!$B$27:$D$218,3,0),\"\")","v":13},{"$f":"IFERROR(VLOOKUP($B32,'Partie 4'!$B$27:$D$218,2,0),\"\")","v":10},{"$f":"IFERROR(VLOOKUP($B32,'Partie 4'!$B$27:$D$218,3,0),\"\")","v":13},"A30",29,46,1,null,{"$f":"IFERROR(INDEX(Liste!$G$7:$G$198,MATCH(B32,Liste!$I$7:$I$198,0)),\"\")","v":0},"A30",29,46,1]
[31,{"$f":"IFERROR(INDEX(Liste!$I$7:$I$198,MATCH(Recap!A33,Liste!$L$7:$L$198,0)),\"\")","v":"A31"},null,{"$f":"IFERROR(VLOOKUP($B33,'Partie 1'!$B$27:$D$218,2,0),\"\")","v":13},{"$f":"IFERROR(VLOOKUP($B33,'Partie 1'!$B$27:$D$218,3,0),\"\")","v":4},{"$f":"IFERROR(VLOOKUP($B33,'Partie 2'!$B$27:$D$218,2,0),\"\")","v":13},{"$f":"IFERROR(VLOOKUP($B33,'Partie 2'!$B$27:$D$218,3,0),\"\")","v":4},{"$f":"IFERROR(VLOOKUP($B33,'Partie 3'!$B$27:$D$218,2,0),\"\")","v":2},{"$f":"IFERROR(VLOOKUP($B33,'Partie 3'!$B$27:$D$218,3,0),\"\")","v":13},{"$f":"IFERROR(VLOOKUP($B33,'Partie 4'!$B$27:$D$218,2,0),\"\")","v":10},{"$f":"IFERROR(VLOOKUP($B33,'Partie 4'!$B$27:$D$218,3,0),\"\")","v":13},"A31",38,34,2,null,{"$f":"IFERROR(INDEX(Liste!$G$7:$G$198,MATCH(B33,Liste!$I$7:$I$198,0)),\"\")","v":0},"A31",38,34,2]
[32,{"$f":"IFERROR(INDEX(Liste!$I$7:$I$198,MATCH(Recap!A34,Liste!$L$7:$L$198,0)),\"\")","v":"A32"},null,{"$f":"IFERROR(VLOOKUP($B34,'Partie 1'!$B$27:$D$218,2,0),\"\")","v":4},{"$f":"IFERROR(VLOOKUP($B34,'Partie 1'!$B$27:$D$218,3,0),\"\")","v":13},{"$f":"IFERROR(VLOOKUP($B34,'Partie 2'!$B$27:$D$218,2,0),\"\")","v":13},{"$f":"IFERROR(VLOOKUP($B34,'Partie 2'!$B$27:$D$218,3,0),\"\")","v":4},{"$f":"IFERROR(VLOOKUP($B34,'Partie 3'!$B$27:$D$218,2,0),\"\")","v":2},{"$f":"IFERROR(VLOOKUP($B34,'Partie 3'!$B$27:$D$218,3,0),\"\")","v":13},{"$f":"IFERROR(VLOOKUP($B34,'Partie 4'!$B$27:$D$218,2,0),\"\")","v":8},{"$f":"IFERROR(VLOOKUP($B34,'Partie 4'!$B$27:$D$218,3,0),\"\")","v":13},"A32",27,43,1,null,{"$f":"IFERROR(INDEX(Liste!$G$7:$G$198,MATCH(B34,Liste!$I$7:$I$198,0)),\"\")","v":0},"A32",27,43,1]
[33,{"$f":"IFERROR(INDEX(Liste!$I$7:$I$198,MATCH(Recap!A35,Liste!$L$7:$L$198,0)),\"\")","v":"A33"},null,{"$f":"IFERROR(VLOOKUP($B35,'Partie 1'!$B$27:$D$218,2,0),\"\")","v":2},{"$f":"IFERROR(VLOOKUP($B35,'Partie 1'!$B$27:$D$218,3,0),\"\")","v":13},{"$f":"IFERROR(VLOOKUP($B35,'Partie 2'!$B$27:$D$218,2,0),\"\")","v":2},{"$f":"IFERROR(VLOOKUP($B35,'Partie 2'!$B$27:$D$218,3,0),\"\")","v":13},{"$f":"IFERROR(VLOOKUP($B35,'Partie 3'!$B$27:$D$218,2,0),\"\")","v":5},{"$f":"IFERROR(VLOOKUP($B35,'Partie 3'!$B$27:$D$218,3,0),\"\")","v":13},{"$f":"IFERROR(VLOOKUP($B35,'Partie 4'!$B$27:$D$218,2,0),\"\")","v":13},{"$f":"IFERROR(VLOOKUP($B35,'Partie 4'!$B$27:$D$218,3,0),\"\")","v":7},"A33",{"$f":"SUMIF($D$2:$K$2,\"P*\",D35:K35)","v":22},{"$f":"SUMIF($D$2:$K$2,\"\",D35:K35)","v":46},1,null,{"$f":"IFERROR(INDEX(Liste!$G$7:$G$198,MATCH(B35,Liste!$I$7:$I$198,0)),\"\")","v":0},"A33",22,46,1]
[34,{"$f":"IFERROR(INDEX(Liste!$I$7:$I$198,MATCH(Recap!A36,Liste!$L$7:$L$198,0)),\"\")","v":"A34"},null,{"$f":"IFERROR(VLOOKUP($B36,'Partie 1'!$B$27:$D$218,2,0),\"\")","v":13},{"$f":"IFERROR(VLOOKUP($B36,'Partie 1'!$B$27:$D$218,3,0),\"\")","v":2},{"$f":"IFERROR(VLOOKUP($B36,'Partie 2'!$B$27:$D$218,2,0),\"\")","v":2},{"$f":"IFERROR(VLOOKUP($B36,'Partie 2'!$B$27:$D$218,3,0),\"\")","v":13},{"$f":"IFERROR(VLOOKUP($B36,'Partie 3'!$B$27:$D$218,2,0),\"\")","v":5},{"$f":"IFERROR(VLOOKUP($B36,'Partie 3'!$B$27:$D$218,3,0),\"\")","v":13},{"$f":"IFERROR(VLOOKUP($B36,'Partie 4'!$B$27:$D$218,2,0),\"\")","v":13},{"$f":"IFERROR(VLOOKUP($B36,'Partie 4'!$B$27:$D$218,3,0),\"\")","v":11},"A34",33,39,2,null,{"$f":"IFERROR(INDEX(Liste!$G$7:$G$198,MATCH(B36,Liste!$I$7:$I$198,0)),\"\")","v":0},"A34",33,39,2]
[35,{"$f":"IFERROR(INDEX(Liste!$I$7:$I$198,MATCH(Recap!A37,Liste!$L$7:$L$198,0)),\"\")","v":"A35"},null,{"$f":"IFERROR(VLOOKUP($B37,'Partie 1'!$B$27:$D$218,2,0),\"\")","v":13},{"$f":"IFERROR(VLOOKUP($B37,'Partie 1'!$B$27:$D$218,3,0),\"\")","v":10},{"$f":"IFERROR(VLOOKUP($B37,'Partie 2'!$B$27:$D$218,2,0),\"\")","v":13},{"$f":"IFERROR(VLOOKUP($B37,'Partie 2'!$B$27:$D$218,3,0),\"\")","v":2},{"$f":"IFERROR(VLOOKUP($B37,'Partie 3'!$B$27:$D$218,2,0),\"\")","v":5},{"$f":"IFERROR(VLOOKUP($B37,'Partie 3'!$B$27:$D$218,3,0),\"\")","v":13},{"$f":"IFERROR(VLOOKUP($B37,'Partie 4'!$B$27:$D$218,2,0),\"\")","v":13},{"$f":"IFERROR(VLOOKUP($B37,'Partie 4'!$B$27:$D$218,3,0),\"\")","v":11},"A35",44,36,3,null,{"$f":"IFERROR(INDEX(Liste!$G$7:$G$198,MATCH(B37,Liste!$I$7:$I$198,0)),\"\")","v":0},"A35",44,36,3]
[36,{"$f":"IFERROR(INDEX(Liste!$I$7:$I$198,MATCH(Recap!A38,Liste!$L$7:$L$198,0)),\"\")","v":"A36"},null,{"$f":"IFERROR(VLOOKUP($B38,'Partie 1'!$B$27:$D$218,2,0),\"\")","v":10},{"$f":"IFERROR(VLOOKUP($B38,'Partie 1'!$B$27:$D$218,3,0),\"\")","v":13},{"$f":"IFERROR(VLOOKUP($B38,'Partie 2'!$B$27:$D$218,2,0),\"\")","v":13},{"$f":"IFERROR(VLOOKUP($B38,'Partie 2'!$B$27:$D$218,3,0),\"\")","v":2},{"$f":"IFERROR(VLOOKUP($B38,'Partie 3'!$B$27:$D$218,2,0),\"\")","v":5},{"$f":"IFERROR(VLOOKUP($B38,'Partie 3'!$B$27:$D$218,3,0),\"\")","v":13},{"$f":"IFERROR(VLOOKUP($B38,'Partie 4'!$B$27:$D$218,2,0),\"\")","v":13},{"$f":"IFERROR(VLOOKUP($B38,'Partie 4'!$B$27:$D$218,3,0),\"\")","v":7},"A36",41,35,2,null,{"$f":"IFERROR(INDEX(Liste!$G$7:$G$198,MATCH(B38,Liste!$I$7:$I$198,0)),\"\")","v":0},"A36",41,35,2]
[37,{"$f":"IFERROR(INDEX(Liste!$I$7:$I$198,MATCH(Recap!A39,Liste!$L$7:$L$198,0)),\"\")","v":"A37"},null,{"$f":"IFERROR(VLOOKUP($B39,'Partie 1'!$B$27:$D$218,2,0),\"\")","v":13},{"$f":"IFERROR(VLOOKUP($B39,'Partie 1'!$B$27:$D$218,3,0),\"\")","v":11},{"$f":"IFERROR(VLOOKUP($B39,'Partie 2'!$B$27:$D$218,2,0),\"\")","v":13},{"$f":"IFERROR(VLOOKUP($B39,'Partie 2'!$B$27:$D$218,3,0),\"\")","v":10},{"$f":"IFERROR(VLOOKUP($B39,'Partie 3'!$B$27:$D$218,2,0),\"\")","v":13},{"$f":"IFERROR(VLOOKUP($B39,'Partie 3'!$B$27:$D$218,3,0),\"\")","v":5},{"$f":"IFERROR(VLOOKUP($B39,'Partie 4'!$B$27:$D$218,2,0),\"\")","v":13},{"$f":"IFERROR(VLOOKUP($B39,'Partie 4'!$B$27:$D$218,3,0),\"\")","v":11},"A37",52,37,4,null,{"$f":"IFERROR(INDEX(Liste!$G$7:$G$198,MATCH(B39,Liste!$I$7:$I$198,0)),\"\")","v":0},"A37",52,37,4]
[38,{"$f":"IFERROR(INDEX(Liste!$I$7:$I$198,MATCH(Recap!A40,Liste!$L$7:$L$198,0)),\"\")","v":"A38"},null,{"$f":"IFERROR(VLOOKUP($B40,'Partie 1'!$B$27:$D$218,2,0),\"\")","v":11},{"$f":"IFERROR(VLOOKUP($B40,'Partie 1'!$B$27:$D$218,3,0),\"\")","v":13},{"$f":"IFERROR(VLOOKUP($B40,'Partie 2'!$B$27:$D$218,2,0),\"\")","v":13},{"$f":"IFERROR(VLOOKUP($B40,'Partie 2'!$B$27:$D$218,3,0),\"\")","v":10},{"$f":"IFERROR(VLOOKUP($B40,'Partie 3'!$B$27:$D$218,2,0),\"\")","v":13},{"$f":"IFERROR(VLOOKUP($B40,'Partie 3'!$B$27:$D$218,3,0),\"\")","v":5},{"$f":"IFERROR(VLOOKUP($B40,'Partie 4'!$B$27:$D$218,2,0),\"\")","v":13},{"$f":"IFERROR(VLOOKUP($B40,'Partie 4'!$B$27:$D$218,3,0),\"\")","v":7},"A38",50,35,3,null,{"$f":"IFERROR(INDEX(Liste!$G$7:$G$198,MATCH(B40,Liste!$I$7:$I$198,0)),\"\")","v":0},"A38",50,35,3]
[39,{"$f":"IFERROR(INDEX(Liste!$I$7:$I$198,MATCH(Recap!A41,Liste!$L$7:$L$198,0)),\"\")","v":"A39"},null,{"$f":"IFERROR(VLOOKUP($B41,'Partie 1'!$B$27:$D$218,2,0),\"\")","v":13},{"$f":"IFERROR(VLOOKUP($B41,'Partie 1'!$B$27:$D$218,3,0),\"\")","v":2},{"$f":"IFERROR(VLOOKUP($B41,'Partie 2'!$B$27:$D$218,2,0),\"\")","v":10},{"$f":"IFERROR(VLOOKUP($B41,'Partie 2'!$B$27:$D$218,3,0),\"\")","v":13},{"$f":"IFERROR(VLOOKUP($B41,'Partie 3'!$B$27:$D$218,2,0),\"\")","v":13},{"$f":"IFERROR(VLOOKUP($B41,'Partie 3'!$B$27:$D$218,3,0),\"\")","v":5},{"$f":"IFERROR(VLOOKUP($B41,'Partie 4'!$B$27:$D$218,2,0),\"\")","v":13},{"$f":"IFERROR(VLOOKUP($B41,'Partie 4'!$B$27:$D$218,3,0),\"\")","v":11},"A39",49,31,3,null,{"$f":"IFERROR(INDEX(Liste!$G$7:$G$198,MATCH(B41,Liste!$I$7:$I$198,0)),\"\")","v":0},"A39",49,31,3]
[40,{"$f":"IFERROR(INDEX(Liste!$I$7:$I$198,MATCH(Recap!A42,Liste!$L$7:$L$198,0)),\"\")","v":"A40"},null,{"$f":"IFERROR(VLOOKUP($B42,'Partie 1'!$B$27:$D$218,2,0),\"\")","v":2},{"$f":"IFERROR(VLOOKUP($B42,'Partie 1'!$B$27:$D$218,3,0),\"\")","v":13},{"$f":"IFERROR(VLOOKUP($B42,'Partie 2'!$B$27:$D$218,2,0),\"\")","v":10},{"$f":"IFERROR(VLOOKUP($B42,'Partie 2'!$B$27:$D$218,3,0),\"\")","v":13},{"$f":"IFERROR(VLOOKUP($B42,'Partie 3'!$B$27:$D$218,2,0),\"\")","v":13},{"$f":"IFERROR(VLOOKUP($B42,'Partie 3'!$B$27:$D$218,3,0),\"\")","v":5},{"$f":"IFERROR(VLOOKUP($B42,'Partie 4'!$B$27:$D$218,2,0),\"\")","v":13},{"$f":"IFERROR(VLOOKUP($B42,'Partie 4'!$B$27:$D$218,3,0),\"\")","v":7},"A40",38,38,2,null,{"$f":"IFERROR(INDEX(Liste!$G$7:$G$198,MATCH(B42,Liste!$I$7:$I$198,0)),\"\")","v":0},"A40",38,38,2]
[41,{"$f":"IFERROR(INDEX(Liste!$I$7:$I$198,MATCH(Recap!A43,Liste!$L$7:$L$198,0)),\"\")","v":"A41"},null,{"$f":"IFERROR(VLOOKUP($B43,'Partie 1'!$B$27:$D$218,2,0),\"\")","v":5},{"$f":"IFERROR(VLOOKUP($B43,'Partie 1'!$B$27:$D$218,3,0),\"\")","v":13},{"$f":"IFERROR(VLOOKUP($B43,'Partie 2'!$B$27:$D$218,2,0),\"\")","v":13},{"$f":"IFERROR(VLOOKUP($B43,'Partie 2'!$B$27:$D$218,3,0),\"\")","v":11},{"$f":"IFERROR(VLOOKUP($B43,'Partie 3'!$B$27:$D$218,2,0),\"\")","v":13},{"$f":"IFERROR(VLOOKUP($B43,'Partie 3'!$B$27:$D$218,3,0),\"\")","v":8},{"$f":"IFERROR(VLOOKUP($B43,'Partie 4'!$B$27:$D$218,2,0),\"\")","v":7},{"$f":"IFERROR(VLOOKUP($B43,'Partie 4'!$B$27:$D$218,3,0),\"\")","v":13},"A41",38,45,2,null,{"$f":"IFERROR(INDEX(Liste!$G$7:$G$198,MATCH(B43,Liste!$I$7:$I$198,0)),\"\")","v":0},"A41",38,45,2]
[42,{"$f":"IFERROR(INDEX(Liste!$I$7:$I$198,MATCH(Recap!A44,Liste!$L$7:$L$198,0)),\"\")","v":"A42"},null,{"$f":"IFERROR(VLOOKUP($B44,'Partie 1'!$B$27:$D$218,2,0),\"\")","v":13},{"$f":"IFERROR(VLOOKUP($B44,'Partie 1'!$B$27:$D$218,3,0),\"\")","v":5},{"$f":"IFERROR(VLOOKUP($B44,'Partie 2'!$B$27:$D$218,2,0),\"\")","v":13},{"$f":"IFERROR(VLOOKUP($B44,'Partie 2'!$B$27:$D$218,3,0),\"\")","v":11},{"$f":"IFERROR(VLOOKUP($B44,'Partie 3'!$B$27:$D$218,2,0),\"\")","v":13},{"$f":"IFERROR(VLOOKUP($B44,'Partie 3'!$B$27:$D$218,3,0),\"\")","v":8},{"$f":"IFERROR(VLOOKUP($B44,'Partie 4'!$B$27:$D$218,2,0),\"\")","v":11},{"$f":"IFERROR(VLOOKUP($B44,'Partie 4'!$B$27:$D$218,3,0),\"\")","v":13},"A42",50,37,3,null,{"$f":"IFERROR(INDEX(Liste!$G$7:$G$198,MATCH(B44,Liste!$I$7:$I$198,0)),\"\")","v":0},"A42",50,37,3]
[43,{"$f":"IFERROR(INDEX(Liste!$I$7:$I$198,MATCH(Recap!A45,Liste!$L$7:$L$198,0)),\"\")","v":"A43"},null,{"$f":"IFERROR(VLOOKUP($B45,'Partie 1'!$B$27:$D$218,2,0),\"\")","v":13},{"$f":"IFERROR(VLOOKUP($B45,'Partie 1'!$B$27:$D$218,3,0),\"\")","v":8},{"$f":"IFERROR(VLOOKUP($B45,'Partie 2'!$B$27:$D$218,2,0),\"\")","v":11},{"$f":"IFERROR(VLOOKUP($B45,'Partie 2'!$B$27:$D$218,3,0),\"\")","v":13},{"$f":"IFERROR(VLOOKUP($B45,'Partie 3'!$B$27:$D$218,2,0),\"\")","v":13},{"$f":"IFERROR(VLOOKUP($B45,'Partie 3'!$B$27:$D$218,3,0),\"\")","v":8},{"$f":"IFERROR(VLOOKUP($B45,'Partie 4'!$B$27:$D$218,2,0),\"\")","v":11},{"$f":"IFERROR(VLOOKUP($B45,'Partie 4'!$B$27:$D$218,3,0),\"\")","v":13},"A43",48,42,2,null,{"$f":"IFERROR(INDEX(Liste!$G$7:$G$198,MATCH(B45,Liste!$I$7:$I$198,0)),\"\")","v":0},"A43",48,42,2]
[44,{"$f":"IFERROR(INDEX(Liste!$I$7:$I$198,MATCH(Recap!A46,Liste!$L$7:$L$198,0)),\"\")","v":"A44"},null,{"$f":"IFERROR(VLOOKUP($B46,'Partie 1'!$B$27:$D$218,2,0),\"\")","v":8},{"$f":"IFERROR(VLOOKUP($B46,'Partie 1'!$B$27:$D$218,3,0),\"\")","v":13},{"$f":"IFERROR(VLOOKUP($B46,'Partie 2'!$B$27:$D$218,2,0),\"\")","v":11},{"$f":"IFERROR(VLOOKUP($B46,'Partie 2'!$B$27:$D$218,3,0),\"\")","v":13},{"$f":"IFERROR(VLOOKUP($B46,'Partie 3'!$B$27:$D$218,2,0),\"\")","v":13},{"$f":"IFERROR(VLOOKUP($B46,'Partie 3'!$B$27:$D$218,3,0),\"\")","v":8},{"$f":"IFERROR(VLOOKUP($B46,'Partie 4'!$B$27:$D$218,2,0),\"\")","v":7},{"$f":"IFERROR(VLOOKUP($B46,'Partie 4'!$B$27:$D$218,3,0),\"\")","v":13},"A44",39,47,1,null,{"$f":"IFERROR(INDEX(Liste!$G$7:$G$198,MATCH(B46,Liste!$I$7:$I$198,0)),\"\")","v":0},"A44",39,47,1]
[45,{"$f":"IFERROR(INDEX(Liste!$I$7:$I$198,MATCH(Recap!A47,Liste!$L$7:$L$198,0)),\"\")","v":"A45"},null,{"$f":"IFERROR(VLOOKUP($B47,'Partie 1'!$B$27:$D$218,2,0),\"\")","v":13},{"$f":"IFERROR(VLOOKUP($B47,'Partie 1'!$B$27:$D$218,3,0),\"\")","v":7},{"$f":"IFERROR(VLOOKUP($B47,'Partie 2'!$B$27:$D$218,2,0),\"\")","v":13},{"$f":"IFERROR(VLOOKUP($B47,'Partie 2'!$B$27:$D$218,3,0),\"\")","v":2},{"$f":"IFERROR(VLOOKUP($B47,'Partie 3'!$B$27:$D$218,2,0),\"\")","v":8},{"$f":"IFERROR(VLOOKUP($B47,'Partie 3'!$B$27:$D$218,3,0),\"\")","v":13},{"$f":"IFERROR(VLOOKUP($B47,'Partie 4'!$B$27:$D$218,2,0),\"\")","v":11},{"$f":"IFERROR(VLOOKUP($B47,'Partie 4'!$B$27:$D$218,3,0),\"\")","v":13},"A45",45,35,2,null,{"$f":"IFERROR(INDEX(Liste!$G$7:$G$198,MATCH(B47,Liste!$I$7:$I$198,0)),\"\")","v":0},"A45",45,35,2]
[46,{"$f":"IFERROR(INDEX(Liste!$I$7:$I$198,MATCH(Recap!A48,Liste!$L$7:$L$198,0)),\"\")","v":"A46"},null,{"$f":"IFERROR(VLOOKUP($B48,'Partie 1'!$B$27:$D$218,2,0),\"\")","v":7},{"$f":"IFERROR(VLOOKUP($B48,'Partie 1'!$B$27:$D$218,3,0),\"\")","v":13},{"$f":"IFERROR(VLOOKUP($B48,'Partie 2'!$B$27:$D$218,2,0),\"\")","v":13},{"$f":"IFERROR(VLOOKUP($B48,'Partie 2'!$B$27:$D$218,3,0),\"\")","v":2},{"$f":"IFERROR(VLOOKUP($B48,'Partie 3'!$B$27:$D$218,2,0),\"\")","v":8},{"$f":"IFERROR(VLOOKUP($B48,'Partie 3'!$B$27:$D$218,3,0),\"\")","v":13},{"$f":"IFERROR(VLOOKUP($B48,'Partie 4'!$B$27:$D$218,2,0),\"\")","v":7},{"$f":"IFERROR(VLOOKUP($B48,'Partie 4'!$B$27:$D$218,3,0),\"\")","v":13},"A46",35,41,1,null,{"$f":"IFERROR(INDEX(Liste!$G$7:$G$198,MATCH(B48,Liste!$I$7:$I$198,0)),\"\")","v":0},"A46",35,41,1]
[47,{"$f":"IFERROR(INDEX(Liste!$I$7:$I$198,MATCH(Recap!A49,Liste!$L$7:$L$198,0)),\"\")","v":"A47"},null,{"$f":"IFERROR(VLOOKUP($B49,'Partie 1'!$B$27:$D$218,2,0),\"\")","v":4},{"$f":"IFERROR(VLOOKUP($B49,'Partie 1'!$B$27:$D$218,3,0),\"\")","v":13},{"$f":"IFERROR(VLOOKUP($B49,'Partie 2'!$B$27:$D$218,2,0),\"\")","v":2},{"$f":"IFERROR(VLOOKUP($B49,'Partie 2'!$B$27:$D$218,3,0),\"\")","v":13},{"$f":"IFERROR(VLOOKUP($B49,'Partie 3'!$B$27:$D$218,2,0),\"\")","v":8},{"$f":"IFERROR(VLOOKUP($B49,'Partie 3'!$B$27:$D$218,3,0),\"\")","v":13},{"$f":"IFERROR(VLOOKUP($B49,'Partie 4'!$B$27:$D$218,2,0),\"\")","v":7},{"$f":"IFERROR(VLOOKUP($B49,'Partie 4'!$B$27:$D$218,3,0),\"\")","v":13},"A47",21,52,0,null,{"$f":"IFERROR(INDEX(Liste!$G$7:$G$198,MATCH(B49,Liste!$I$7:$I$198,0)),\"\")","v":0},"A47",21,52,0]
[48,{"$f":"IFERROR(INDEX(Liste!$I$7:$I$198,MATCH(Recap!A50,Liste!$L$7:$L$198,0)),\"\")","v":"A48"},null,{"$f":"IFERROR(VLOOKUP($B50,'Partie 1'!$B$27:$D$218,2,0),\"\")","v":13},{"$f":"IFERROR(VLOOKUP($B50,'Partie 1'!$B$27:$D$218,3,0),\"\")","v":4},{"$f":"IFERROR(VLOOKUP($B50,'Partie 2'!$B$27:$D$218,2,0),\"\")","v":2},{"$f":"IFERROR(VLOOKUP($B50,'Partie 2'!$B$27:$D$218,3,0),\"\")","v":13},{"$f":"IFERROR(VLOOKUP($B50,'Partie 3'!$B$27:$D$218,2,0),\"\")","v":8},{"$f":"IFERROR(VLOOKUP($B50,'Partie 3'!$B$27:$D$218,3,0),\"\")","v":13},{"$f":"IFERROR(VLOOKUP($B50,'Partie 4'!$B$27:$D$218,2,0),\"\")","v":11},{"$f":"IFERROR(VLOOKUP($B50,'Partie 4'!$B$27:$D$218,3,0),\"\")","v":13},"A48",34,43,1,null,{"$f":"IFERROR(INDEX(Liste!$G$7:$G$198,MATCH(B50,Liste!$I$7:$I$198,0)),\"\")","v":0},"A48",34,43,1]
[49,{"$f":"IFERROR(INDEX(Liste!$I$7:$I$198,MATCH(Recap!A51,Liste!$L$7:$L$198,0)),\"\")","v":"A49"},null,{"$f":"IFERROR(VLOOKUP($B51,'Partie 1'!$B$27:$D$218,2,0),\"\")","v":13},{"$f":"IFERROR(VLOOKUP($B51,'Partie 1'!$B$27:$D$218,3,0),\"\")","v":2},{"$f":"IFERROR(VLOOKUP($B51,'Partie 2'!$B$27:$D$218,2,0),\"\")","v":5},{"$f":"IFERROR(VLOOKUP($B51,'Partie 2'!$B$27:$D$218,3,0),\"\")","v":13},{"$f":"IFERROR(VLOOKUP($B51,'Partie 3'!$B$27:$D$218,2,0),\"\")","v":13},{"$f":"IFERROR(VLOOKUP($B51,'Partie 3'!$B$27:$D$218,3,0),\"\")","v":7},{"$f":"IFERROR(VLOOKUP($B51,'Partie 4'!$B$27:$D$218,2,0),\"\")","v":13},{"$f":"IFERROR(VLOOKUP($B51,'Partie 4'!$B$27:$D$218,3,0),\"\")","v":2},"A49",44,24,3,null,{"$f":"IFERROR(INDEX(Liste!$G$7:$G$198,MATCH(B51,Liste!$I$7:$I$198,0)),\"\")","v":0},"A49",44,24,3]
[50,{"$f":"IFERROR(INDEX(Liste!$I$7:$I$198,MATCH(Recap!A52,Liste!$L$7:$L$198,0)),\"\")","v":"A50"},null,{"$f":"IFERROR(VLOOKUP($B52,'Partie 1'!$B$27:$D$218,2,0),\"\")","v":2},{"$f":"IFERROR(VLOOKUP($B52,'Partie 1'!$B$27:$D$218,3,0),\"\")","v":13},{"$f":"IFERROR(VLOOKUP($B52,'Partie 2'!$B$27:$D$218,2,0),\"\")","v":5},{"$f":"IFERROR(VLOOKUP($B52,'Partie 2'!$B$27:$D$218,3,0),\"\")","v":13},{"$f":"IFERROR(VLOOKUP($B52,'Partie 3'!$B$27:$D$218,2,0),\"\")","v":13},{"$f":"IFERROR(VLOOKUP($B52,'Partie 3'!$B$27:$D$218,3,0),\"\")","v":7},{"$f":"IFERROR(VLOOKUP($B52,'Partie 4'!$B$27:$D$218,2,0),\"\")","v":4},{"$f":"IFERROR(VLOOKUP($B52,'Partie 4'!$B$27:$D$218,3,0),\"\")","v":13},"A50",24,46,1,null,{"$f":"IFERROR(INDEX(Liste!$G$7:$G$198,MATCH(B52,Liste!$I$7:$I$198,0)),\"\")","v":0},"A50",24,46,1]
[51,{"$f":"IFERROR(INDEX(Liste!$I$7:$I$198,MATCH(Recap!A53,Liste!$L$7:$L$198,0)),\"\")","v":"A51"},null,{"$f":"IFERROR(VLOOKUP($B53,'Partie 1'!$B$27:$D$218,2,0),\"\")","v":10},{"$f":"IFERROR(VLOOKUP($B53,'Partie 1'!$B$27:$D$218,3,0),\"\")","v":13},{"$f":"IFERROR(VLOOKUP($B53,'Partie 2'!$B$27:$D$218,2,0),\"\")","v":13},{"$f":"IFERROR(VLOOKUP($B53,'Partie 2'!$B$27:$D$218,3,0),\"\")","v":5},{"$f":"IFERROR(VLOOKUP($B53,'Partie 3'!$B$27:$D$218,2,0),\"\")","v":13},{"$f":"IFERROR(VLOOKUP($B53,'Partie 3'!$B$27:$D$218,3,0),\"\")","v":7},{"$f":"IFERROR(VLOOKUP($B53,'Partie 4'!$B$27:$D$218,2,0),\"\")","v":4},{"$f":"IFERROR(VLOOKUP($B53,'Partie 4'!$B$27:$D$218,3,0),\"\")","v":13},"A51",40,38,2,null,{"$f":"IFERROR(INDEX(Liste!$G$7:$G$198,MATCH(B53,Liste!$I$7:$I$198,0)),\"\")","v":0},"A51",40,38,2]
[52,{"$f":"IFERROR(INDEX(Liste!$I$7:$I$198,MATCH(Recap!A54,Liste!$L$7:$L$198,0)),\"\")","v":"A52"},null,{"$f":"IFERROR(VLOOKUP($B54,'Partie 1'!$B$27:$D$218,2,0),\"\")","v":13},{"$f":"IFERROR(VLOOKUP($B54,'Partie 1'!$B$27:$D$218,3,0),\"\")","v":10},{"$f":"IFERROR(VLOOKUP($B54,'Partie 2'!$B$27:$D$218,2,0),\"\")","v":13},{"$f":"IFERROR(VLOOKUP($B54,'Partie 2'!$B$27:$D$218,3,0),\"\")","v":5},{"$f":"IFERROR(VLOOKUP($B54,'Partie 3'!$B$27:$D$218,2,0),\"\")","v":13},{"$f":"IFERROR(VLOOKUP($B54,'Partie 3'!$B$27:$D$218,3,0),\"\")","v":7},{"$f":"IFERROR(VLOOKUP($B54,'Partie 4'!$B$27:$D$218,2,0),\"\")","v":13},{"$f":"IFERROR(VLOOKUP($B54,'Partie 4'!$B$27:$D$218,3,0),\"\")","v":2},"A52",52,24,4,null,{"$f":"IFERROR(INDEX(Liste!$G$7:$G$198,MATCH(B54,Liste!$I$7:$I$198,0)),\"\")","v":0},"A52",52,24,4]
[53,{"$f":"IFERROR(INDEX(Liste!$I$7:$I$198,MATCH(Recap!A55,Liste!$L$7:$L$198,0)),\"\")","v":"A53"},null,{"$f":"IFERROR(VLOOKUP($B55,'Partie 1'!$B$27:$D$218,2,0),\"\")","v":11},{"$f":"IFERROR(VLOOKUP($B55,'Partie 1'!$B$27:$D$218,3,0),\"\")","v":13},{"$f":"IFERROR(VLOOKUP($B55,'Partie 2'!$B$27:$D$218,2,0),\"\")","v":13},{"$f":"IFERROR(VLOOKUP($B55,'Partie 2'!$B$27:$D$218,3,0),\"\")","v":8},{"$f":"IFERROR(VLOOKUP($B55,'Partie 3'!$B$27:$D$218,2,0),\"\")","v":7},{"$f":"IFERROR(VLOOKUP($B55,'Partie 3'!$B$27:$D$218,3,0),\"\")","v":13},{"$f":"IFERROR(VLOOKUP($B55,'Partie 4'!$B$27:$D$218,2,0),\"\")","v":4},{"$f":"IFERROR(VLOOKUP($B55,'Partie 4'!$B$27:$D$218,3,0),\"\")","v":13},"A53",35,47,1,null,{"$f":"IFERROR(INDEX(Liste!$G$7:$G$198,MATCH(B55,Liste!$I$7:$I$198,0)),\"\")","v":0},"A53",35,47,1]
[54,{"$f":"IFERROR(INDEX(Liste!$I$7:$I$198,MATCH(Recap!A56,Liste!$L$7:$L$198,0)),\"\")","v":"A54"},null,{"$f":"IFERROR(VLOOKUP($B56,'Partie 1'!$B$27:$D$218,2,0),\"\")","v":13},{"$f":"IFERROR(VLOOKUP($B56,'Partie 1'!$B$27:$D$218,3,0),\"\")","v":11},{"$f":"IFERROR(VLOOKUP($B56,'Partie 2'!$B$27:$D$218,2,0),\"\")","v":13},{"$f":"IFERROR(VLOOKUP($B56,'Partie 2'!$B$27:$D$218,3,0),\"\")","v":8},{"$f":"IFERROR(VLOOKUP($B56,'Partie 3'!$B$27:$D$218,2,0),\"\")","v":7},{"$f":"IFERROR(VLOOKUP($B56,'Partie 3'!$B$27:$D$218,3,0),\"\")","v":13},{"$f":"IFERROR(VLOOKUP($B56,'Partie 4'!$B$27:$D$218,2,0),\"\")","v":13},{"$f":"IFERROR(VLOOKUP($B56,'Partie 4'!$B$27:$D$218,3,0),\"\")","v":2},"A54",46,34,3,null,{"$f":"IFERROR(INDEX(Liste!$G$7:$G$198,MATCH(B56,Liste!$I$7:$I$198,0)),\"\")","v":0},"A54",46,34,3]
[55,{"$f":"IFERROR(INDEX(Liste!$I$7:$I$198,MATCH(Recap!A57,Liste!$L$7:$L$198,0)),\"\")","v":"A55"},null,{"$f":"IFERROR(VLOOKUP($B57,'Partie 1'!$B$27:$D$218,2,0),\"\")","v":2},{"$f":"IFERROR(VLOOKUP($B57,'Partie 1'!$B$27:$D$218,3,0),\"\")","v":13},{"$f":"IFERROR(VLOOKUP($B57,'Partie 2'!$B$27:$D$218,2,0),\"\")","v":8},{"$f":"IFERROR(VLOOKUP($B57,'Partie 2'!$B$27:$D$218,3,0),\"\")","v":13},{"$f":"IFERROR(VLOOKUP($B57,'Partie 3'!$B$27:$D$218,2,0),\"\")","v":7},{"$f":"IFERROR(VLOOKUP($B57,'Partie 3'!$B$27:$D$218,3,0),\"\")","v":13},{"$f":"IFERROR(VLOOKUP($B57,'Partie 4'!$B$27:$D$218,2,0),\"\")","v":4},{"$f":"IFERROR(VLOOKUP($B57,'Partie 4'!$B$27:$D$218,3,0),\"\")","v":13},"A55",21,52,0,null,{"$f":"IFERROR(INDEX(Liste!$G$7:$G$198,MATCH(B57,Liste!$I$7:$I$198,0)),\"\")","v":0},"A55",21,52,0]
[56,{"$f":"IFERROR(INDEX(Liste!$I$7:$I$198,MATCH(Recap!A58,Liste!$L$7:$L$198,0)),\"\")","v":"A56"},null,{"$f":"IFERROR(VLOOKUP($B58,'Partie 1'!$B$27:$D$218,2,0),\"\")","v":13},{"$f":"IFERROR(VLOOKUP($B58,'Partie 1'!$B$27:$D$218,3,0),\"\")","v":2},{"$f":"IFERROR(VLOOKUP($B58,'Partie 2'!$B$27:$D$218,2,0),\"\")","v":8},{"$f":"IFERROR(VLOOKUP($B58,'Partie 2'!$B$27:$D$218,3,0),\"\")","v":13},{"$f":"IFERROR(VLOOKUP($B58,'Partie 3'!$B$27:$D$218,2,0),\"\")","v":7},{"$f":"IFERROR(VLOOKUP($B58,'Partie 3'!$B$27:$D$218,3,0),\"\")","v":13},{"$f":"IFERROR(VLOOKUP($B58,'Partie 4'!$B$27:$D$218,2,0),\"\")","v":13},{"$f":"IFERROR(VLOOKUP($B58,'Partie 4'!$B$27:$D$218,3,0),\"\")","v":2},"A56",41,30,2,null,{"$f":"IFERROR(INDEX(Liste!$G$7:$G$198,MATCH(B58,Liste!$I$7:$I$198,0)),\"\")","v":0},"A56",41,30,2]
[57,{"$f":"IFERROR(INDEX(Liste!$I$7:$I$198,MATCH(Recap!A59,Liste!$L$7:$L$198,0)),\"\")","v":"A57"},null,{"$f":"IFERROR(VLOOKUP($B59,'Partie 1'!$B$27:$D$218,2,0),\"\")","v":13},{"$f":"IFERROR(VLOOKUP($B59,'Partie 1'!$B$27:$D$218,3,0),\"\")","v":5},{"$f":"IFERROR(VLOOKUP($B59,'Partie 2'!$B$27:$D$218,2,0),\"\")","v":13},{"$f":"IFERROR(VLOOKUP($B59,'Partie 2'!$B$27:$D$218,3,0),\"\")","v":7},{"$f":"IFERROR(VLOOKUP($B59,'Partie 3'!$B$27:$D$218,2,0),\"\")","v":4},{"$f":"IFERROR(VLOOKUP($B59,'Partie 3'!$B$27:$D$218,3,0),\"\")","v":13},{"$f":"IFERROR(VLOOKUP($B59,'Partie 4'!$B$27:$D$218,2,0),\"\")","v":2},{"$f":"IFERROR(VLOOKUP($B59,'Partie 4'!$B$27:$D$218,3,0),\"\")","v":13},"A57",32,38,2,null,{"$f":"IFERROR(INDEX(Liste!$G$7:$G$198,MATCH(B59,Liste!$I$7:$I$198,0)),\"\")","v":0},"A57",32,38,2]
[58,{"$f":"IFERROR(INDEX(Liste!$I$7:$I$198,MATCH(Recap!A60,Liste!$L$7:$L$198,0)),\"\")","v":"A58"},null,{"$f":"IFERROR(VLOOKUP($B60,'Partie 1'!$B$27:$D$218,2,0),\"\")","v":5},{"$f":"IFERROR(VLOOKUP($B60,'Partie 1'!$B$27:$D$218,3,0),\"\")","v":13},{"$f":"IFERROR(VLOOKUP($B60,'Partie 2'!$B$27:$D$218,2,0),\"\")","v":13},{"$f":"IFERROR(VLOOKUP($B60,'Partie 2'!$B$27:$D$218,3,0),\"\")","v":7},{"$f":"IFERROR(VLOOKUP($B60,'Partie 3'!$B$27:$D$218,2,0),\"\")","v":4},{"$f":"IFERROR(VLOOKUP($B60,'Partie 3'!$B$27:$D$218,3,0),\"\")","v":13},{"$f":"IFERROR(VLOOKUP($B60,'Partie 4'!$B$27:$D$218,2,0),\"\")","v":13},{"$f":"IFERROR(VLOOKUP($B60,'Partie 4'!$B$27:$D$218,3,0),\"\")","v":4},"A58",35,37,2,null,{"$f":"IFERROR(INDEX(Liste!$G$7:$G$198,MATCH(B60,Liste!$I$7:$I$198,0)),\"\")","v":0},"A58",35,37,2]
[59,{"$f":"IFERROR(INDEX(Liste!$I$7:$I$198,MATCH(Recap!A61,Liste!$L$7:$L$198,0)),\"\")","v":"A59"},null,{"$f":"IFERROR(VLOOKUP($B61,'Partie 1'!$B$27:$D$218,2,0),\"\")","v":8},{"$f":"IFERROR(VLOOKUP($B61,'Partie 1'!$B$27:$D$218,3,0),\"\")","v":13},{"$f":"IFERROR(VLOOKUP($B61,'Partie 2'!$B$27:$D$218,2,0),\"\")","v":7},{"$f":"IFERROR(VLOOKUP($B61,'Partie 2'!$B$27:$D$218,3,0),\"\")","v":13},{"$f":"IFERROR(VLOOKUP($B61,'Partie 3'!$B$27:$D$218,2,0),\"\")","v":4},{"$f":"IFERROR(VLOOKUP($B61,'Partie 3'!$B$27:$D$218,3,0),\"\")","v":13},{"$f":"IFERROR(VLOOKUP($B61,'Partie 4'!$B$27:$D$218,2,0),\"\")","v":13},{"$f":"IFERROR(VLOOKUP($B61,'Partie 4'!$B$27:$D$218,3,0),\"\")","v":4},"A59",32,43,1,null,{"$f":"IFERROR(INDEX(Liste!$G$7:$G$198,MATCH(B61,Liste!$I$7:$I$198,0)),\"\")","v":0},"A59",32,43,1]
[60,{"$f":"IFERROR(INDEX(Liste!$I$7:$I$198,MATCH(Recap!A62,Liste!$L$7:$L$198,0)),\"\")","v":"A60"},null,{"$f":"IFERROR(VLOOKUP($B62,'Partie 1'!$B$27:$D$218,2,0),\"\")","v":13},{"$f":"IFERROR(VLOOKUP($B62,'Partie 1'!$B$27:$D$218,3,0),\"\")","v":8},{"$f":"IFERROR(VLOOKUP($B62,'Partie 2'!$B$27:$D$218,2,0),\"\")","v":7},{"$f":"IFERROR(VLOOKUP($B62,'Partie 2'!$B$27:$D$218,3,0),\"\")","v":13},{"$f":"IFERROR(VLOOKUP($B62,'Partie 3'!$B$27:$D$218,2,0),\"\")","v":4},{"$f":"IFERROR(VLOOKUP($B62,'Partie 3'!$B$27:$D$218,3,0),\"\")","v":13},{"$f":"IFERROR(VLOOKUP($B62,'Partie 4'!$B$27:$D$218,2,0),\"\")","v":2},{"$f":"IFERROR(VLOOKUP($B62,'Partie 4'!$B$27:$D$218,3,0),\"\")","v":13},"A60",26,47,1,null,{"$f":"IFERROR(INDEX(Liste!$G$7:$G$198,MATCH(B62,Liste!$I$7:$I$198,0)),\"\")","v":0},"A60",26,47,1]
[61,{"$f":"IFERROR(INDEX(Liste!$I$7:$I$198,MATCH(Recap!A63,Liste!$L$7:$L$198,0)),\"\")","v":"A61"},null,{"$f":"IFERROR(VLOOKUP($B63,'Partie 1'!$B$27:$D$218,2,0),\"\")","v":7},{"$f":"IFERROR(VLOOKUP($B63,'Partie 1'!$B$27:$D$218,3,0),\"\")","v":13},{"$f":"IFERROR(VLOOKUP($B63,'Partie 2'!$B$27:$D$218,2,0),\"\")","v":4},{"$f":"IFERROR(VLOOKUP($B63,'Partie 2'!$B$27:$D$218,3,0),\"\")","v":13},{"$f":"IFERROR(VLOOKUP($B63,'Partie 3'!$B$27:$D$218,2,0),\"\")","v":13},{"$f":"IFERROR(VLOOKUP($B63,'Partie 3'!$B$27:$D$218,3,0),\"\")","v":4},{"$f":"IFERROR(VLOOKUP($B63,'Partie 4'!$B$27:$D$218,2,0),\"\")","v":13},{"$f":"IFERROR(VLOOKUP($B63,'Partie 4'!$B$27:$D$218,3,0),\"\")","v":4},"A61",37,34,2,null,{"$f":"IFERROR(INDEX(Liste!$G$7:$G$198,MATCH(B63,Liste!$I$7:$I$198,0)),\"\")","v":0},"A61",37,34,2]
[62,{"$f":"IFERROR(INDEX(Liste!$I$7:$I$198,MATCH(Recap!A64,Liste!$L$7:$L$198,0)),\"\")","v":"A62"},null,{"$f":"IFERROR(VLOOKUP($B64,'Partie 1'!$B$27:$D$218,2,0),\"\")","v":13},{"$f":"IFERROR(VLOOKUP($B64,'Partie 1'!$B$27:$D$218,3,0),\"\")","v":7},{"$f":"IFERROR(VLOOKUP($B64,'Partie 2'!$B$27:$D$218,2,0),\"\")","v":4},{"$f":"IFERROR(VLOOKUP($B64,'Partie 2'!$B$27:$D$218,3,0),\"\")","v":13},{"$f":"IFERROR(VLOOKUP($B64,'Partie 3'!$B$27:$D$218,2,0),\"\")","v":13},{"$f":"IFERROR(VLOOKUP($B64,'Partie 3'!$B$27:$D$218,3,0),\"\")","v":4},{"$f":"IFERROR(VLOOKUP($B64,'Partie 4'!$B$27:$D$218,2,0),\"\")","v":2},{"$f":"IFERROR(VLOOKUP($B64,'Partie 4'!$B$27:$D$218,3,0),\"\")","v":13},"A62",32,37,2,null,{"$f":"IFERROR(INDEX(Liste!$G$7:$G$198,MATCH(B64,Liste!$I$7:$I$198,0)),\"\")","v":0},"A62",32,37,2]
[63,{"$f":"IFERROR(INDEX(Liste!$I$7:$I$198,MATCH(Recap!A65,Liste!$L$7:$L$198,0)),\"\")","v":"A63"},null,{"$f":"IFERROR(VLOOKUP($B65,'Partie 1'!$B$27:$D$218,2,0),\"\")","v":13},{"$f":"IFERROR(VLOOKUP($B65,'Partie 1'!$B$27:$D$218,3,0),\"\")","v":4},{"$f":"IFERROR(VLOOKUP($B65,'Partie 2'!$B$27:$D$218,2,0),\"\")","v":13},{"$f":"IFERROR(VLOOKUP($B65,'Partie 2'!$B$27:$D$218,3,0),\"\")","v":4},{"$f":"IFERROR(VLOOKUP($B65,'Partie 3'!$B$27:$D$218,2,0),\"\")","v":13},{"$f":"IFERROR(VLOOKUP($B65,'Partie 3'!$B$27:$D$218,3,0),\"\")","v":4},{"$f":"IFERROR(VLOOKUP($B65,'Partie 4'!$B$27:$D$218,2,0),\"\")","v":2},{"$f":"IFERROR(VLOOKUP($B65,'Partie 4'!$B$27:$D$218,3,0),\"\")","v":13},"A63",41,25,3,null,{"$f":"IFERROR(INDEX(Liste!$G$7:$G$198,MATCH(B65,Liste!$I$7:$I$198,0)),\"\")","v":0},"A63",41,25,3]
[64,{"$f":"IFERROR(INDEX(Liste!$I$7:$I$198,MATCH(Recap!A66,Liste!$L$7:$L$198,0)),\"\")","v":"A64"},null,{"$f":"IFERROR(VLOOKUP($B66,'Partie 1'!$B$27:$D$218,2,0),\"\")","v":4},{"$f":"IFERROR(VLOOKUP($B66,'Partie 1'!$B$27:$D$218,3,0),\"\")","v":13},{"$f":"IFERROR(VLOOKUP($B66,'Partie 2'!$B$27:$D$218,2,0),\"\")","v":13},{"$f":"IFERROR(VLOOKUP($B66,'Partie 2'!$B$27:$D$218,3,0),\"\")","v":4},{"$f":"IFERROR(VLOOKUP($B66,'Partie 3'!$B$27:$D$218,2,0),\"\")","v":13},{"$f":"IFERROR(VLOOKUP($B66,'Partie 3'!$B$27:$D$218,3,0),\"\")","v":4},{"$f":"IFERROR(VLOOKUP($B66,'Partie 4'!$B$27:$D$218,2,0),\"\")","v":13},{"$f":"IFERROR(VLOOKUP($B66,'Partie 4'!$B$27:$D$218,3,0),\"\")","v":4},"A64",43,25,3,null,{"$f":"IFERROR(INDEX(Liste!$G$7:$G$198,MATCH(B66,Liste!$I$7:$I$198,0)),\"\")","v":0},"A64",43,25,3]
[65,{"$f":"IFERROR(INDEX(Liste!$I$7:$I$198,MATCH(Recap!A67,Liste!$L$7:$L$198,0)),\"\")","v":"B1"},null,{"$f":"IFERROR(VLOOKUP($B67,'Partie 1'!$B$27:$D$218,2,0),\"\")","v":13},{"$f":"IFERROR(VLOOKUP($B67,'Partie 1'!$B$27:$D$218,3,0),\"\")","v":2},{"$f":"IFERROR(VLOOKUP($B67,'Partie 2'!$B$27:$D$218,2,0),\"\")","v":2},{"$f":"IFERROR(VLOOKUP($B67,'Partie 2'!$B$27:$D$218,3,0),\"\")","v":13},{"$f":"IFERROR(VLOOKUP($B67,'Partie 3'!$B$27:$D$218,2,0),\"\")","v":2},{"$f":"IFERROR(VLOOKUP($B67,'Partie 3'!$B$27:$D$218,3,0),\"\")","v":13},{"$f":"IFERROR(VLOOKUP($B67,'Partie 4'!$B$27:$D$218,2,0),\"\")","v":2},{"$f":"IFERROR(VLOOKUP($B67,'Partie 4'!$B$27:$D$218,3,0),\"\")","v":13},{"$f":"IF(ISBLANK(B67),\"\",B67)","v":"B1"},{"$f":"SUMIF($D$2:$K$2,\"P*\",D67:K67)","v":19},{"$f":"SUMIF($D$2:$K$2,\"\",D67:K67)","v":41},{"$f":"COUNTIFS($D$2:$K$2,\"P*\",D67:K67,13)","v":1},null,{"$f":"IFERROR(INDEX(Liste!$G$7:$G$198,MATCH(B67,Liste!$I$7:$I$198,0)),\"\")","v":0},"B1",19,41,1]
[{"$f":"ROW()-2","v":66},{"$f":"IFERROR(INDEX(Liste!$I$7:$I$198,MATCH(Recap!A68,Liste!$L$7:$L$198,0)),\"\")","v":"B2"},null,{"$f":"IFERROR(VLOOKUP($B68,'Partie 1'!$B$27:$D$218,2,0),\"\")","v":2},{"$f":"IFERROR(VLOOKUP($B68,'Partie 1'!$B$27:$D$218,3,0),\"\")","v":13},{"$f":"IFERROR(VLOOKUP($B68,'Partie 2'!$B$27:$D$218,2,0),\"\")","v":2},{"$f":"IFERROR(VLOOKUP($B68,'Partie 2'!$B$27:$D$218,3,0),\"\")","v":13},{"$f":"IFERROR(VLOOKUP($B68,'Partie 3'!$B$27:$D$218,2,0),\"\")","v":2},{"$f":"IFERROR(VLOOKUP($B68,'Partie 3'!$B$27:$D$218,3,0),\"\")","v":13},{"$f":"IFERROR(VLOOKUP($B68,'Partie 4'!$B$27:$D$218,2,0),\"\")","v":5},{"$f":"IFERROR(VLOOKUP($B68,'Partie 4'!$B$27:$D$218,3,0),\"\")","v":13},"B2",11,52,0,null,{"$f":"IFERROR(INDEX(Liste!$G$7:$G$198,MATCH(B68,Liste!$I$7:$I$198,0)),\"\")","v":0},{"$f":"B68","v":"B2"},{"$f":"M68","v":11},{"$f":"N68","v":52},{"$f":"O68","v":0}]
[67,{"$f":"IFERROR(INDEX(Liste!$I$7:$I$198,MATCH(Recap!A69,Liste!$L$7:$L$198,0)),\"\")","v":"B3"},null,{"$f":"IFERROR(VLOOKUP($B69,'Partie 1'!$B$27:$D$218,2,0),\"\")","v":10},{"$f":"IFERROR(VLOOKUP($B69,'Partie 1'!$B$27:$D$218,3,0),\"\")","v":13},{"$f":"IFERROR(VLOOKUP($B69,'Partie 2'!$B$27:$D$218,2,0),\"\")","v":13},{"$f":"IFERROR(VLOOKUP($B69,'Partie 2'!$B$27:$D$218,3,0),\"\")","v":2},{"$f":"IFERROR(VLOOKUP($B69,'Partie 3'!$B$27:$D$218,2,0),\"\")","v":2},{"$f":"IFERROR(VLOOKUP($B69,'Partie 3'!$B$27:$D$218,3,0),\"\")","v":13},{"$f":"IFERROR(VLOOKUP($B69,'Partie 4'!$B$27:$D$218,2,0),\"\")","v":5},{"$f":"IFERROR(VLOOKUP($B69,'Partie 4'!$B$27:$D$218,3,0),\"\")","v":13},"B3",30,41,1,null,{"$f":"IFERROR(INDEX(Liste!$G$7:$G$198,MATCH(B69,Liste!$I$7:$I$198,0)),\"\")","v":0},"B3",30,41,1]
[68,{"$f":"IFERROR(INDEX(Liste!$I$7:$I$198,MATCH(Recap!A70,Liste!$L$7:$L$198,0)),\"\")","v":"B4"},null,{"$f":"IFERROR(VLOOKUP($B70,'Partie 1'!$B$27:$D$218,2,0),\"\")","v":13},{"$f":"IFERROR(VLOOKUP($B70,'Partie 1'!$B$27:$D$218,3,0),\"\")","v":10},{"$f":"IFERROR(VLOOKUP($B70,'Partie 2'!$B$27:$D$218,2,0),\"\")","v":13},{"$f":"IFERROR(VLOOKUP($B70,'Partie 2'!$B$27:$D$218,3,0),\"\")","v":2},{"$f":"IFERROR(VLOOKUP($B70,'Partie 3'!$B$27:$D$218,2,0),\"\")","v":2},{"$f":"IFERROR(VLOOKUP($B70,'Partie 3'!$B$27:$D$218,3,0),\"\")","v":13},{"$f":"IFERROR(VLOOKUP($B70,'Partie 4'!$B$27:$D$218,2,0),\"\")","v":2},{"$f":"IFERROR(VLOOKUP($B70,'Partie 4'!$B$27:$D$218,3,0),\"\")","v":13},"B4",30,38,2,null,{"$f":"IFERROR(INDEX(Liste!$G$7:$G$198,MATCH(B70,Liste!$I$7:$I$198,0)),\"\")","v":0},"B4",30,38,2]
[69,{"$f":"IFERROR(INDEX(Liste!$I$7:$I$198,MATCH(Recap!A71,Liste!$L$7:$L$198,0)),\"\")","v":"B5"},null,{"$f":"IFERROR(VLOOKUP($B71,'Partie 1'!$B$27:$D$218,2,0),\"\")","v":11},{"$f":"IFERROR(VLOOKUP($B71,'Partie 1'!$B$27:$D$218,3,0),\"\")","v":13},{"$f":"IFERROR(VLOOKUP($B71,'Partie 2'!$B$27:$D$218,2,0),\"\")","v":13},{"$f":"IFERROR(VLOOKUP($B71,'Partie 2'!$B$27:$D$218,3,0),\"\")","v":10},{"$f":"IFERROR(VLOOKUP($B71,'Partie 3'!$B$27:$D$218,2,0),\"\")","v":13},{"$f":"IFERROR(VLOOKUP($B71,'Partie 3'!$B$27:$D$218,3,0),\"\")","v":2},{"$f":"IFERROR(VLOOKUP($B71,'Partie 4'!$B$27:$D$218,2,0),\"\")","v":5},{"$f":"IFERROR(VLOOKUP($B71,'Partie 4'!$B$27:$D$218,3,0),\"\")","v":13},"B5",42,38,2,null,{"$f":"IFERROR(INDEX(Liste!$G$7:$G$198,MATCH(B71,Liste!$I$7:$I$198,0)),\"\")","v":0},"B5",42,38,2]
[70,{"$f":"IFERROR(INDEX(Liste!$I$7:$I$198,MATCH(Recap!A72,Liste!$L$7:$L$198,0)),\"\")","v":"B6"},null,{"$f":"IFERROR(VLOOKUP($B72,'Partie 1'!$B$27:$D$218,2,0),\"\")","v":13},{"$f":"IFERROR(VLOOKUP($B72,'Partie 1'!$B$27:$D$218,3,0),\"\")","v":11},{"$f":"IFERROR(VLOOKUP($B72,'Partie 2'!$B$27:$D$218,2,0),\"\")","v":13},{"$f":"IFERROR(VLOOKUP($B72,'Partie 2'!$B$27:$D$218,3,0),\"\")","v":10},{"$f":"IFERROR(VLOOKUP($B72,'Partie 3'!$B$27:$D$218,2,0),\"\")","v":13},{"$f":"IFERROR(VLOOKUP($B72,'Partie 3'!$B$27:$D$218,3,0),\"\")","v":2},{"$f":"IFERROR(VLOOKUP($B72,'Partie 4'!$B$27:$D$218,2,0),\"\")","v":2},{"$f":"IFERROR(VLOOKUP($B72,'Partie 4'!$B$27:$D$218,3,0),\"\")","v":13},"B6",41,36,3,null,{"$f":"IFERROR(INDEX(Liste!$G$7:$G$198,MATCH(B72,Liste!$I$7:$I$198,0)),\"\")","v":0},"B6",41,36,3]
[71,{"$f":"IFERROR(INDEX(Liste!$I$7:$I$198,MATCH(Recap!A73,Liste!$L$7:$L$198,0)),\"\")","v":"B7"},null,{"$f":"IFERROR(VLOOKUP($B73,'Partie 1'!$B$27:$D$218,2,0),\"\")","v":2},{"$f":"IFERROR(VLOOKUP($B73,'Partie 1'!$B$27:$D$218,3,0),\"\")","v":13},{"$f":"IFERROR(VLOOKUP($B73,'Partie 2'!$B$27:$D$218,2,0),\"\")","v":10},{"$f":"IFERROR(VLOOKUP($B73,'Partie 2'!$B$27:$D$218,3,0),\"\")","v":13},{"$f":"IFERROR(VLOOKUP($B73,'Partie 3'!$B$27:$D$218,2,0),\"\")","v":13},{"$f":"IFERROR(VLOOKUP($B73,'Partie 3'!$B$27:$D$218,3,0),\"\")","v":2},{"$f":"IFERROR(VLOOKUP($B73,'Partie 4'!$B$27:$D$218,2,0),\"\")","v":5},{"$f":"IFERROR(VLOOKUP($B73,'Partie 4'!$B$27:$D$218,3,0),\"\")","v":13},"B7",30,41,1,null,{"$f":"IFERROR(INDEX(Liste!$G$7:$G$198,MATCH(B73,Liste!$I$7:$I$198,0)),\"\")","v":0},"B7",30,41,1]
[72,{"$f":"IFERROR(INDEX(Liste!$I$7:$I$198,MATCH(Recap!A74,Liste!$L$7:$L$198,0)),\"\")","v":"B8"},null,{"$f":"IFERROR(VLOOKUP($B74,'Partie 1'!$B$27:$D$218,2,0),\"\")","v":13},{"$f":"IFERROR(VLOOKUP($B74,'Partie 1'!$B$27:$D$218,3,0),\"\")","v":2},{"$f":"IFERROR(VLOOKUP($B74,'Partie 2'!$B$27:$D$218,2,0),\"\")","v":10},{"$f":"IFERROR(VLOOKUP($B74,'Partie 2'!$B$27:$D$218,3,0),\"\")","v":13},{"$f":"IFERROR(VLOOKUP($B74,'Partie 3'!$B$27:$D$218,2,0),\"\")","v":13},{"$f":"IFERROR(VLOOKUP($B74,'Partie 3'!$B$27:$D$218,3,0),\"\")","v":2},{"$f":"IFERROR(VLOOKUP($B74,'Partie 4'!$B$27:$D$218,2,0),\"\")","v":2},{"$f":"IFERROR(VLOOKUP($B74,'Partie 4'!$B$27:$D$218,3,0),\"\")","v":13},"B8",38,30,2,null,{"$f":"IFERROR(INDEX(Liste!$G$7:$G$198,MATCH(B74,Liste!$I$7:$I$198,0)),\"\")","v":0},"B8",38,30,2]
[73,{"$f":"IFERROR(INDEX(Liste!$I$7:$I$198,MATCH(Recap!A75,Liste!$L$7:$L$198,0)),\"\")","v":"B9"},null,{"$f":"IFERROR(VLOOKUP($B75,'Partie 1'!$B$27:$D$218,2,0),\"\")","v":13},{"$f":"IFERROR(VLOOKUP($B75,'Partie 1'!$B$27:$D$218,3,0),\"\")","v":1},{"$f":"IFERROR(VLOOKUP($B75,'Partie 2'!$B$27:$D$218,2,0),\"\")","v":13},{"$f":"IFERROR(VLOOKUP($B75,'Partie 2'!$B$27:$D$218,3,0),\"\")","v":11},{"$f":"IFERROR(VLOOKUP($B75,'Partie 3'!$B$27:$D$218,2,0),\"\")","v":13},{"$f":"IFERROR(VLOOKUP($B75,'Partie 3'!$B$27:$D$218,3,0),\"\")","v":10},{"$f":"IFERROR(VLOOKUP($B75,'Partie 4'!$B$27:$D$218,2,0),\"\")","v":13},{"$f":"IFERROR(VLOOKUP($B75,'Partie 4'!$B$27:$D$218,3,0),\"\")","v":2},"B9",52,24,4,null,{"$f":"IFERROR(INDEX(Liste!$G$7:$G$198,MATCH(B75,Liste!$I$7:$I$198,0)),\"\")","v":0},"B9",52,24,4]
[74,{"$f":"IFERROR(INDEX(Liste!$I$7:$I$198,MATCH(Recap!A76,Liste!$L$7:$L$198,0)),\"\")","v":"B10"},null,{"$f":"IFERROR(VLOOKUP($B76,'Partie 1'!$B$27:$D$218,2,0),\"\")","v":1},{"$f":"IFERROR(VLOOKUP($B76,'Partie 1'!$B$27:$D$218,3,0),\"\")","v":13},{"$f":"IFERROR(VLOOKUP($B76,'Partie 2'!$B$27:$D$218,2,0),\"\")","v":13},{"$f":"IFERROR(VLOOKUP($B76,'Partie 2'!$B$27:$D$218,3,0),\"\")","v":11},{"$f":"IFERROR(VLOOKUP($B76,'Partie 3'!$B$27:$D$218,2,0),\"\")","v":13},{"$f":"IFERROR(VLOOKUP($B76,'Partie 3'!$B$27:$D$218,3,0),\"\")","v":10},{"$f":"IFERROR(VLOOKUP($B76,'Partie 4'!$B$27:$D$218,2,0),\"\")","v":13},{"$f":"IFERROR(VLOOKUP($B76,'Partie 4'!$B$27:$D$218,3,0),\"\")","v":5},"B10",40,39,3,null,{"$f":"IFERROR(INDEX(Liste!$G$7:$G$198,MATCH(B76,Liste!$I$7:$I$198,0)),\"\")","v":0},"B10",40,39,3]
[75,{"$f":"IFERROR(INDEX(Liste!$I$7:$I$198,MATCH(Recap!A77,Liste!$L$7:$L$198,0)),\"\")","v":"B11"},null,{"$f":"IFERROR(VLOOKUP($B77,'Partie 1'!$B$27:$D$218,2,0),\"\")","v":8},{"$f":"IFERROR(VLOOKUP($B77,'Partie 1'!$B$27:$D$218,3,0),\"\")","v":13},{"$f":"IFERROR(VLOOKUP($B77,'Partie 2'!$B$27:$D$218,2,0),\"\")","v":11},{"$f":"IFERROR(VLOOKUP($B77,'Partie 2'!$B$27:$D$218,3,0),\"\")","v":13},{"$f":"IFERROR(VLOOKUP($B77,'Partie 3'!$B$27:$D$218,2,0),\"\")","v":13},{"$f":"IFERROR(VLOOKUP($B77,'Partie 3'!$B$27:$D$218,3,0),\"\")","v":10},{"$f":"IFERROR(VLOOKUP($B77,'Partie 4'!$B$27:$D$218,2,0),\"\")","v":13},{"$f":"IFERROR(VLOOKUP($B77,'Partie 4'!$B$27:$D$218,3,0),\"\")","v":5},"B11",45,41,2,null,{"$f":"IFERROR(INDEX(Liste!$G$7:$G$198,MATCH(B77,Liste!$I$7:$I$198,0)),\"\")","v":0},"B11",45,41,2]
[76,{"$f":"IFERROR(INDEX(Liste!$I$7:$I$198,MATCH(Recap!A78,Liste!$L$7:$L$198,0)),\"\")","v":"B12"},null,{"$f":"IFERROR(VLOOKUP($B78,'Partie 1'!$B$27:$D$218,2,0),\"\")","v":13},{"$f":"IFERROR(VLOOKUP($B78,'Partie 1'!$B$27:$D$218,3,0),\"\")","v":8},{"$f":"IFERROR(VLOOKUP($B78,'Partie 2'!$B$27:$D$218,2,0),\"\")","v":11},{"$f":"IFERROR(VLOOKUP($B78,'Partie 2'!$B$27:$D$218,3,0),\"\")","v":13},{"$f":"IFERROR(VLOOKUP($B78,'Partie 3'!$B$27:$D$218,2,0),\"\")","v":13},{"$f":"IFERROR(VLOOKUP($B78,'Partie 3'!$B$27:$D$218,3,0),\"\")","v":10},{"$f":"IFERROR(VLOOKUP($B78,'Partie 4'!$B$27:$D$218,2,0),\"\")","v":13},{"$f":"IFERROR(VLOOKUP($B78,'Partie 4'!$B$27:$D$218,3,0),\"\")","v":2},"B12",50,33,3,null,{"$f":"IFERROR(INDEX(Liste!$G$7:$G$198,MATCH(B78,Liste!$I$7:$I$198,0)),\"\")","v":0},"B12",50,33,3]
[77,{"$f":"IFERROR(INDEX(Liste!$I$7:$I$198,MATCH(Recap!A79,Liste!$L$7:$L$198,0)),\"\")","v":"B13"},null,{"$f":"IFERROR(VLOOKUP($B79,'Partie 1'!$B$27:$D$218,2,0),\"\")","v":7},{"$f":"IFERROR(VLOOKUP($B79,'Partie 1'!$B$27:$D$218,3,0),\"\")","v":13},{"$f":"IFERROR(VLOOKUP($B79,'Partie 2'!$B$27:$D$218,2,0),\"\")","v":13},{"$f":"IFERROR(VLOOKUP($B79,'Partie 2'!$B$27:$D$218,3,0),\"\")","v":2},{"$f":"IFERROR(VLOOKUP($B79,'Partie 3'!$B$27:$D$218,2,0),\"\")","v":10},{"$f":"IFERROR(VLOOKUP($B79,'Partie 3'!$B$27:$D$218,3,0),\"\")","v":13},{"$f":"IFERROR(VLOOKUP($B79,'Partie 4'!$B$27:$D$218,2,0),\"\")","v":13},{"$f":"IFERROR(VLOOKUP($B79,'Partie 4'!$B$27:$D$218,3,0),\"\")","v":5},"B13",43,33,2,null,{"$f":"IFERROR(INDEX(Liste!$G$7:$G$198,MATCH(B79,Liste!$I$7:$I$198,0)),\"\")","v":0},"B13",43,33,2]
[78,{"$f":"IFERROR(INDEX(Liste!$I$7:$I$198,MATCH(Recap!A80,Liste!$L$7:$L$198,0)),\"\")","v":"B14"},null,{"$f":"IFERROR(VLOOKUP($B80,'Partie 1'!$B$27:$D$218,2,0),\"\")","v":13},{"$f":"IFERROR(VLOOKUP($B80,'Partie 1'!$B$27:$D$218,3,0),\"\")","v":7},{"$f":"IFERROR(VLOOKUP($B80,'Partie 2'!$B$27:$D$218,2,0),\"\")","v":13},{"$f":"IFERROR(VLOOKUP($B80,'Partie 2'!$B$27:$D$218,3,0),\"\")","v":2},{"$f":"IFERROR(VLOOKUP($B80,'Partie 3'!$B$27:$D$218,2,0),\"\")","v":10},{"$f":"IFERROR(VLOOKUP($B80,'Partie 3'!$B$27:$D$218,3,0),\"\")","v":13},{"$f":"IFERROR(VLOOKUP($B80,'Partie 4'!$B$27:$D$218,2,0),\"\")","v":13},{"$f":"IFERROR(VLOOKUP($B80,'Partie 4'!$B$27:$D$218,3,0),\"\")","v":2},"B14",49,24,3,null,{"$f":"IFERROR(INDEX(Liste!$G$7:$G$198,MATCH(B80,Liste!$I$7:$I$198,0)),\"\")","v":0},"B14",49,24,3]
[79,{"$f":"IFERROR(INDEX(Liste!$I$7:$I$198,MATCH(Recap!A81,Liste!$L$7:$L$198,0)),\"\")","v":"B15"},null,{"$f":"IFERROR(VLOOKUP($B81,'Partie 1'!$B$27:$D$218,2,0),\"\")","v":13},{"$f":"IFERROR(VLOOKUP($B81,'Partie 1'!$B$27:$D$218,3,0),\"\")","v":4},{"$f":"IFERROR(VLOOKUP($B81,'Partie 2'!$B$27:$D$218,2,0),\"\")","v":2},{"$f":"IFERROR(VLOOKUP($B81,'Partie 2'!$B$27:$D$218,3,0),\"\")","v":13},{"$f":"IFERROR(VLOOKUP($B81,'Partie 3'!$B$27:$D$218,2,0),\"\")","v":10},{"$f":"IFERROR(VLOOKUP($B81,'Partie 3'!$B$27:$D$218,3,0),\"\")","v":13},{"$f":"IFERROR(VLOOKUP($B81,'Partie 4'!$B$27:$D$218,2,0),\"\")","v":13},{"$f":"IFERROR(VLOOKUP($B81,'Partie 4'!$B$27:$D$218,3,0),\"\")","v":2},"B15",38,32,2,null,{"$f":"IFERROR(INDEX(Liste!$G$7:$G$198,MATCH(B81,Liste!$I$7:$I$198,0)),\"\")","v":0},"B15",38,32,2]
[80,{"$f":"IFERROR(INDEX(Liste!$I$7:$I$198,MATCH(Recap!A82,Liste!$L$7:$L$198,0)),\"\")","v":"B16"},null,{"$f":"IFERROR(VLOOKUP($B82,'Partie 1'!$B$27:$D$218,2,0),\"\")","v":4},{"$f":"IFERROR(VLOOKUP($B82,'Partie 1'!$B$27:$D$218,3,0),\"\")","v":13},{"$f":"IFERROR(VLOOKUP($B82,'Partie 2'!$B$27:$D$218,2,0),\"\")","v":2},{"$f":"IFERROR(VLOOKUP($B82,'Partie 2'!$B$27:$D$218,3,0),\"\")","v":13},{"$f":"IFERROR(VLOOKUP($B82,'Partie 3'!$B$27:$D$218,2,0),\"\")","v":10},{"$f":"IFERROR(VLOOKUP($B82,'Partie 3'!$B$27:$D$218,3,0),\"\")","v":13},{"$f":"IFERROR(VLOOKUP($B82,'Partie 4'!$B$27:$D$218,2,0),\"\")","v":13},{"$f":"IFERROR(VLOOKUP($B82,'Partie 4'!$B$27:$D$218,3,0),\"\")","v":5},"B16",29,44,1,null,{"$f":"IFERROR(INDEX(Liste!$G$7:$G$198,MATCH(B82,Liste!$I$7:$I$198,0)),\"\")","v":0},"B16",29,44,1]
[81,{"$f":"IFERROR(INDEX(Liste!$I$7:$I$198,MATCH(Recap!A83,Liste!$L$7:$L$198,0)),\"\")","v":"B17"},null,{"$f":"IFERROR(VLOOKUP($B83,'Partie 1'!$B$27:$D$218,2,0),\"\")","v":13},{"$f":"IFERROR(VLOOKUP($B83,'Partie 1'!$B$27:$D$218,3,0),\"\")","v":2},{"$f":"IFERROR(VLOOKUP($B83,'Partie 2'!$B$27:$D$218,2,0),\"\")","v":5},{"$f":"IFERROR(VLOOKUP($B83,'Partie 2'!$B$27:$D$218,3,0),\"\")","v":13},{"$f":"IFERROR(VLOOKUP($B83,'Partie 3'!$B$27:$D$218,2,0),\"\")","v":13},{"$f":"IFERROR(VLOOKUP($B83,'Partie 3'!$B$27:$D$218,3,0),\"\")","v":11},{"$f":"IFERROR(VLOOKUP($B83,'Partie 4'!$B$27:$D$218,2,0),\"\")","v":13},{"$f":"IFERROR(VLOOKUP($B83,'Partie 4'!$B$27:$D$218,3,0),\"\")","v":10},"B17",44,36,3,null,{"$f":"IFERROR(INDEX(Liste!$G$7:$G$198,MATCH(B83,Liste!$I$7:$I$198,0)),\"\")","v":0},"B17",44,36,3]
[82,{"$f":"IFERROR(INDEX(Liste!$I$7:$I$198,MATCH(Recap!A84,Liste!$L$7:$L$198,0)),\"\")","v":"B18"},null,{"$f":"IFERROR(VLOOKUP($B84,'Partie 1'!$B$27:$D$218,2,0),\"\")","v":2},{"$f":"IFERROR(VLOOKUP($B84,'Partie 1'!$B$27:$D$218,3,0),\"\")","v":13},{"$f":"IFERROR(VLOOKUP($B84,'Partie 2'!$B$27:$D$218,2,0),\"\")","v":5},{"$f":"IFERROR(VLOOKUP($B84,'Partie 2'!$B$27:$D$218,3,0),\"\")","v":13},{"$f":"IFERROR(VLOOKUP($B84,'Partie 3'!$B$27:$D$218,2,0),\"\")","v":13},{"$f":"IFERROR(VLOOKUP($B84,'Partie 3'!$B$27:$D$218,3,0),\"\")","v":11},{"$f":"IFERROR(VLOOKUP($B84,'Partie 4'!$B$27:$D$218,2,0),\"\")","v":13},{"$f":"IFERROR(VLOOKUP($B84,'Partie 4'!$B$27:$D$218,3,0),\"\")","v":8},"B18",33,45,2,null,{"$f":"IFERROR(INDEX(Liste!$G$7:$G$198,MATCH(B84,Liste!$I$7:$I$198,0)),\"\")","v":0},"B18",33,45,2]
[83,{"$f":"IFERROR(INDEX(Liste!$I$7:$I$198,MATCH(Recap!A85,Liste!$L$7:$L$198,0)),\"\")","v":"B19"},null,{"$f":"IFERROR(VLOOKUP($B85,'Partie 1'!$B$27:$D$218,2,0),\"\")","v":10},{"$f":"IFERROR(VLOOKUP($B85,'Partie 1'!$B$27:$D$218,3,0),\"\")","v":13},{"$f":"IFERROR(VLOOKUP($B85,'Partie 2'!$B$27:$D$218,2,0),\"\")","v":13},{"$f":"IFERROR(VLOOKUP($B85,'Partie 2'!$B$27:$D$218,3,0),\"\")","v":5},{"$f":"IFERROR(VLOOKUP($B85,'Partie 3'!$B$27:$D$218,2,0),\"\")","v":13},{"$f":"IFERROR(VLOOKUP($B85,'Partie 3'!$B$27:$D$218,3,0),\"\")","v":11},{"$f":"IFERROR(VLOOKUP($B85,'Partie 4'!$B$27:$D$218,2,0),\"\")","v":13},{"$f":"IFERROR(VLOOKUP($B85,'Partie 4'!$B$27:$D$218,3,0),\"\")","v":8},"B19",49,37,3,null,{"$f":"IFERROR(INDEX(Liste!$G$7:$G$198,MATCH(B85,Liste!$I$7:$I$198,0)),\"\")","v":0},"B19",49,37,3]
[84,{"$f":"IFERROR(INDEX(Liste!$I$7:$I$198,MATCH(Recap!A86,Liste!$L$7:$L$198,0)),\"\")","v":"B20"},null,{"$f":"IFERROR(VLOOKUP($B86,'Partie 1'!$B$27:$D$218,2,0),\"\")","v":13},{"$f":"IFERROR(VLOOKUP($B86,'Partie 1'!$B$27:$D$218,3,0),\"\")","v":10},{"$f":"IFERROR(VLOOKUP($B86,'Partie 2'!$B$27:$D$218,2,0),\"\")","v":13},{"$f":"IFERROR(VLOOKUP($B86,'Partie 2'!$B$27:$D$218,3,0),\"\")","v":5},{"$f":"IFERROR(VLOOKUP($B86,'Partie 3'!$B$27:$D$218,2,0),\"\")","v":13},{"$f":"IFERROR(VLOOKUP($B86,'Partie 3'!$B$27:$D$218,3,0),\"\")","v":11},{"$f":"IFERROR(VLOOKUP($B86,'Partie 4'!$B$27:$D$218,2,0),\"\")","v":13},{"$f":"IFERROR(VLOOKUP($B86,'Partie 4'!$B$27:$D$218,3,0),\"\")","v":10},"B20",52,36,4,null,{"$f":"IFERROR(INDEX(Liste!$G$7:$G$198,MATCH(B86,Liste!$I$7:$I$198,0)),\"\")","v":0},"B20",52,36,4]
[85,{"$f":"IFERROR(INDEX(Liste!$I$7:$I$198,MATCH(Recap!A87,Liste!$L$7:$L$198,0)),\"\")","v":"B21"},null,{"$f":"IFERROR(VLOOKUP($B87,'Partie 1'!$B$27:$D$218,2,0),\"\")","v":11},{"$f":"IFERROR(VLOOKUP($B87,'Partie 1'!$B$27:$D$218,3,0),\"\")","v":13},{"$f":"IFERROR(VLOOKUP($B87,'Partie 2'!$B$27:$D$218,2,0),\"\")","v":13},{"$f":"IFERROR(VLOOKUP($B87,'Partie 2'!$B$27:$D$218,3,0),\"\")","v":8},{"$f":"IFERROR(VLOOKUP($B87,'Partie 3'!$B$27:$D$218,2,0),\"\")","v":11},{"$f":"IFERROR(VLOOKUP($B87,'Partie 3'!$B$27:$D$218,3,0),\"\")","v":13},{"$f":"IFERROR(VLOOKUP($B87,'Partie 4'!$B$27:$D$218,2,0),\"\")","v":13},{"$f":"IFERROR(VLOOKUP($B87,'Partie 4'!$B$27:$D$218,3,0),\"\")","v":8},"B21",48,42,2,null,{"$f":"IFERROR(INDEX(Liste!$G$7:$G$198,MATCH(B87,Liste!$I$7:$I$198,0)),\"\")","v":0},"B21",48,42,2]
[86,{"$f":"IFERROR(INDEX(Liste!$I$7:$I$198,MATCH(Recap!A88,Liste!$L$7:$L$198,0)),\"\")","v":"B22"},null,{"$f":"IFERROR(VLOOKUP($B88,'Partie 1'!$B$27:$D$218,2,0),\"\")","v":13},{"$f":"IFERROR(VLOOKUP($B88,'Partie 1'!$B$27:$D$218,3,0),\"\")","v":11},{"$f":"IFERROR(VLOOKUP($B88,'Partie 2'!$B$27:$D$218,2,0),\"\")","v":13},{"$f":"IFERROR(VLOOKUP($B88,'Partie 2'!$B$27:$D$218,3,0),\"\")","v":8},{"$f":"IFERROR(VLOOKUP($B88,'Partie 3'!$B$27:$D$218,2,0),\"\")","v":11},{"$f":"IFERROR(VLOOKUP($B88,'Partie 3'!$B$27:$D$218,3,0),\"\")","v":13},{"$f":"IFERROR(VLOOKUP($B88,'Partie 4'!$B$27:$D$218,2,0),\"\")","v":13},{"$f":"IFERROR(VLOOKUP($B88,'Partie 4'!$B$27:$D$218,3,0),\"\")","v":10},"B22",50,42,3,null,{"$f":"IFERROR(INDEX(Liste!$G$7:$G$198,MATCH(B88,Liste!$I$7:$I$198,0)),\"\")","v":0},"B22",50,42,3]
[87,{"$f":"IFERROR(INDEX(Liste!$I$7:$I$198,MATCH(Recap!A89,Liste!$L$7:$L$198,0)),\"\")","v":"B23"},null,{"$f":"IFERROR(VLOOKUP($B89,'Partie 1'!$B$27:$D$218,2,0),\"\")","v":2},{"$f":"IFERROR(VLOOKUP($B89,'Partie 1'!$B$27:$D$218,3,0),\"\")","v":13},{"$f":"IFERROR(VLOOKUP($B89,'Partie 2'!$B$27:$D$218,2,0),\"\")","v":8},{"$f":"IFERROR(VLOOKUP($B89,'Partie 2'!$B$27:$D$218,3,0),\"\")","v":13},{"$f":"IFERROR(VLOOKUP($B89,'Partie 3'!$B$27:$D$218,2,0),\"\")","v":11},{"$f":"IFERROR(VLOOKUP($B89,'Partie 3'!$B$27:$D$218,3,0),\"\")","v":13},{"$f":"IFERROR(VLOOKUP($B89,'Partie 4'!$B$27:$D$218,2,0),\"\")","v":13},{"$f":"IFERROR(VLOOKUP($B89,'Partie 4'!$B$27:$D$218,3,0),\"\")","v":8},"B23",34,47,1,null,{"$f":"IFERROR(INDEX(Liste!$G$7:$G$198,MATCH(B89,Liste!$I$7:$I$198,0)),\"\")","v":0},"B23",34,47,1,null,{"$f":"COUNTIF(U3:U194,4)","v":12}]
[88,{"$f":"IFERROR(INDEX(Liste!$I$7:$I$198,MATCH(Recap!A90,Liste!$L$7:$L$198,0)),\"\")","v":"B24"},null,{"$f":"IFERROR(VLOOKUP($B90,'Partie 1'!$B$27:$D$218,2,0),\"\")","v":13},{"$f":"IFERROR(VLOOKUP($B90,'Partie 1'!$B$27:$D$218,3,0),\"\")","v":2},{"$f":"IFERROR(VLOOKUP($B90,'Partie 2'!$B$27:$D$218,2,0),\"\")","v":8},{"$f":"IFERROR(VLOOKUP($B90,'Partie 2'!$B$27:$D$218,3,0),\"\")","v":13},{"$f":"IFERROR(VLOOKUP($B90,'Partie 3'!$B$27:$D$218,2,0),\"\")","v":11},{"$f":"IFERROR(VLOOKUP($B90,'Partie 3'!$B$27:$D$218,3,0),\"\")","v":13},{"$f":"IFERROR(VLOOKUP($B90,'Partie 4'!$B$27:$D$218,2,0),\"\")","v":13},{"$f":"IFERROR(VLOOKUP($B90,'Partie 4'!$B$27:$D$218,3,0),\"\")","v":10},"B24",45,38,2,null,{"$f":"IFERROR(INDEX(Liste!$G$7:$G$198,MATCH(B90,Liste!$I$7:$I$198,0)),\"\")","v":0},"B24",45,38,2]
[89,{"$f":"IFERROR(INDEX(Liste!$I$7:$I$198,MATCH(Recap!A91,Liste!$L$7:$L$198,0)),\"\")","v":"B25"},null,{"$f":"IFERROR(VLOOKUP($B91,'Partie 1'!$B$27:$D$218,2,0),\"\")","v":13},{"$f":"IFERROR(VLOOKUP($B91,'Partie 1'!$B$27:$D$218,3,0),\"\")","v":5},{"$f":"IFERROR(VLOOKUP($B91,'Partie 2'!$B$27:$D$218,2,0),\"\")","v":13},{"$f":"IFERROR(VLOOKUP($B91,'Partie 2'!$B$27:$D$218,3,0),\"\")","v":7},{"$f":"IFERROR(VLOOKUP($B91,'Partie 3'!$B$27:$D$218,2,0),\"\")","v":13},{"$f":"IFERROR(VLOOKUP($B91,'Partie 3'!$B$27:$D$218,3,0),\"\")","v":2},{"$f":"IFERROR(VLOOKUP($B91,'Partie 4'!$B$27:$D$218,2,0),\"\")","v":10},{"$f":"IFERROR(VLOOKUP($B91,'Partie 4'!$B$27:$D$218,3,0),\"\")","v":13},"B25",49,27,3,null,{"$f":"IFERROR(INDEX(Liste!$G$7:$G$198,MATCH(B91,Liste!$I$7:$I$198,0)),\"\")","v":0},"B25",49,27,3]
[90,{"$f":"IFERROR(INDEX(Liste!$I$7:$I$198,MATCH(Recap!A92,Liste!$L$7:$L$198,0)),\"\")","v":"B26"},null,{"$f":"IFERROR(VLOOKUP($B92,'Partie 1'!$B$27:$D$218,2,0),\"\")","v":5},{"$f":"IFERROR(VLOOKUP($B92,'Partie 1'!$B$27:$D$218,3,0),\"\")","v":13},{"$f":"IFERROR(VLOOKUP($B92,'Partie 2'!$B$27:$D$218,2,0),\"\")","v":13},{"$f":"IFERROR(VLOOKUP($B92,'Partie 2'!$B$27:$D$218,3,0),\"\")","v":7},{"$f":"IFERROR(VLOOKUP($B92,'Partie 3'!$B$27:$D$218,2,0),\"\")","v":13},{"$f":"IFERROR(VLOOKUP($B92,'Partie 3'!$B$27:$D$218,3,0),\"\")","v":2},{"$f":"IFERROR(VLOOKUP($B92,'Partie 4'!$B$27:$D$218,2,0),\"\")","v":8},{"$f":"IFERROR(VLOOKUP($B92,'Partie 4'!$B$27:$D$218,3,0),\"\")","v":13},"B26",39,35,2,null,{"$f":"IFERROR(INDEX(Liste!$G$7:$G$198,MATCH(B92,Liste!$I$7:$I$198,0)),\"\")","v":0},"B26",39,35,2]
[91,{"$f":"IFERROR(INDEX(Liste!$I$7:$I$198,MATCH(Recap!A93,Liste!$L$7:$L$198,0)),\"\")","v":"B27"},null,{"$f":"IFERROR(VLOOKUP($B93,'Partie 1'!$B$27:$D$218,2,0),\"\")","v":8},{"$f":"IFERROR(VLOOKUP($B93,'Partie 1'!$B$27:$D$218,3,0),\"\")","v":13},{"$f":"IFERROR(VLOOKUP($B93,'Partie 2'!$B$27:$D$218,2,0),\"\")","v":7},{"$f":"IFERROR(VLOOKUP($B93,'Partie 2'!$B$27:$D$218,3,0),\"\")","v":13},{"$f":"IFERROR(VLOOKUP($B93,'Partie 3'!$B$27:$D$218,2,0),\"\")","v":13},{"$f":"IFERROR(VLOOKUP($B93,'Partie 3'!$B$27:$D$218,3,0),\"\")","v":2},{"$f":"IFERROR(VLOOKUP($B93,'Partie 4'!$B$27:$D$218,2,0),\"\")","v":8},{"$f":"IFERROR(VLOOKUP($B93,'Partie 4'!$B$27:$D$218,3,0),\"\")","v":13},"B27",36,41,1,null,{"$f":"IFERROR(INDEX(Liste!$G$7:$G$198,MATCH(B93,Liste!$I$7:$I$198,0)),\"\")","v":0},"B27",36,41,1]
[92,{"$f":"IFERROR(INDEX(Liste!$I$7:$I$198,MATCH(Recap!A94,Liste!$L$7:$L$198,0)),\"\")","v":"B28"},null,{"$f":"IFERROR(VLOOKUP($B94,'Partie 1'!$B$27:$D$218,2,0),\"\")","v":13},{"$f":"IFERROR(VLOOKUP($B94,'Partie 1'!$B$27:$D$218,3,0),\"\")","v":8},{"$f":"IFERROR(VLOOKUP($B94,'Partie 2'!$B$27:$D$218,2,0),\"\")","v":7},{"$f":"IFERROR(VLOOKUP($B94,'Partie 2'!$B$27:$D$218,3,0),\"\")","v":13},{"$f":"IFERROR(VLOOKUP($B94,'Partie 3'!$B$27:$D$218,2,0),\"\")","v":13},{"$f":"IFERROR(VLOOKUP($B94,'Partie 3'!$B$27:$D$218,3,0),\"\")","v":2},{"$f":"IFERROR(VLOOKUP($B94,'Partie 4'!$B$27:$D$218,2,0),\"\")","v":10},{"$f":"IFERROR(VLOOKUP($B94,'Partie 4'!$B$27:$D$218,3,0),\"\")","v":13},"B28",43,36,2,null,{"$f":"IFERROR(INDEX(Liste!$G$7:$G$198,MATCH(B94,Liste!$I$7:$I$198,0)),\"\")","v":0},"B28",43,36,2]
[93,{"$f":"IFERROR(INDEX(Liste!$I$7:$I$198,MATCH(Recap!A95,Liste!$L$7:$L$198,0)),\"\")","v":"B29"},null,{"$f":"IFERROR(VLOOKUP($B95,'Partie 1'!$B$27:$D$218,2,0),\"\")","v":7},{"$f":"IFERROR(VLOOKUP($B95,'Partie 1'!$B$27:$D$218,3,0),\"\")","v":13},{"$f":"IFERROR(VLOOKUP($B95,'Partie 2'!$B$27:$D$218,2,0),\"\")","v":4},{"$f":"IFERROR(VLOOKUP($B95,'Partie 2'!$B$27:$D$218,3,0),\"\")","v":13},{"$f":"IFERROR(VLOOKUP($B95,'Partie 3'!$B$27:$D$218,2,0),\"\")","v":2},{"$f":"IFERROR(VLOOKUP($B95,'Partie 3'!$B$27:$D$218,3,0),\"\")","v":13},{"$f":"IFERROR(VLOOKUP($B95,'Partie 4'!$B$27:$D$218,2,0),\"\")","v":8},{"$f":"IFERROR(VLOOKUP($B95,'Partie 4'!$B$27:$D$218,3,0),\"\")","v":13},"B29",21,52,0,null,{"$f":"IFERROR(INDEX(Liste!$G$7:$G$198,MATCH(B95,Liste!$I$7:$I$198,0)),\"\")","v":0},"B29",21,52,0]
[94,{"$f":"IFERROR(INDEX(Liste!$I$7:$I$198,MATCH(Recap!A96,Liste!$L$7:$L$198,0)),\"\")","v":"B30"},null,{"$f":"IFERROR(VLOOKUP($B96,'Partie 1'!$B$27:$D$218,2,0),\"\")","v":13},{"$f":"IFERROR(VLOOKUP($B96,'Partie 1'!$B$27:$D$218,3,0),\"\")","v":7},{"$f":"IFERROR(VLOOKUP($B96,'Partie 2'!$B$27:$D$218,2,0),\"\")","v":4},{"$f":"IFERROR(VLOOKUP($B96,'Partie 2'!$B$27:$D$218,3,0),\"\")","v":13},{"$f":"IFERROR(VLOOKUP($B96,'Partie 3'!$B$27:$D$218,2,0),\"\")","v":2},{"$f":"IFERROR(VLOOKUP($B96,'Partie 3'!$B$27:$D$218,3,0),\"\")","v":13},{"$f":"IFERROR(VLOOKUP($B96,'Partie 4'!$B$27:$D$218,2,0),\"\")","v":10},{"$f":"IFERROR(VLOOKUP($B96,'Partie 4'!$B$27:$D$218,3,0),\"\")","v":13},"B30",29,46,1,null,{"$f":"IFERROR(INDEX(Liste!$G$7:$G$198,MATCH(B96,Liste!$I$7:$I$198,0)),\"\")","v":0},"B30",29,46,1]
[95,{"$f":"IFERROR(INDEX(Liste!$I$7:$I$198,MATCH(Recap!A97,Liste!$L$7:$L$198,0)),\"\")","v":"B31"},null,{"$f":"IFERROR(VLOOKUP($B97,'Partie 1'!$B$27:$D$218,2,0),\"\")","v":13},{"$f":"IFERROR(VLOOKUP($B97,'Partie 1'!$B$27:$D$218,3,0),\"\")","v":4},{"$f":"IFERROR(VLOOKUP($B97,'Partie 2'!$B$27:$D$218,2,0),\"\")","v":13},{"$f":"IFERROR(VLOOKUP($B97,'Partie 2'!$B$27:$D$218,3,0),\"\")","v":4},{"$f":"IFERROR(VLOOKUP($B97,'Partie 3'!$B$27:$D$218,2,0),\"\")","v":2},{"$f":"IFERROR(VLOOKUP($B97,'Partie 3'!$B$27:$D$218,3,0),\"\")","v":13},{"$f":"IFERROR(VLOOKUP($B97,'Partie 4'!$B$27:$D$218,2,0),\"\")","v":10},{"$f":"IFERROR(VLOOKUP($B97,'Partie 4'!$B$27:$D$218,3,0),\"\")","v":13},"B31",38,34,2,null,{"$f":"IFERROR(INDEX(Liste!$G$7:$G$198,MATCH(B97,Liste!$I$7:$I$198,0)),\"\")","v":0},"B31",38,34,2]
[96,{"$f":"IFERROR(INDEX(Liste!$I$7:$I$198,MATCH(Recap!A98,Liste!$L$7:$L$198,0)),\"\")","v":"B32"},null,{"$f":"IFERROR(VLOOKUP($B98,'Partie 1'!$B$27:$D$218,2,0),\"\")","v":4},{"$f":"IFERROR(VLOOKUP($B98,'Partie 1'!$B$27:$D$218,3,0),\"\")","v":13},{"$f":"IFERROR(VLOOKUP($B98,'Partie 2'!$B$27:$D$218,2,0),\"\")","v":13},{"$f":"IFERROR(VLOOKUP($B98,'Partie 2'!$B$27:$D$218,3,0),\"\")","v":4},{"$f":"IFERROR(VLOOKUP($B98,'Partie 3'!$B$27:$D$218,2,0),\"\")","v":2},{"$f":"IFERROR(VLOOKUP($B98,'Partie 3'!$B$27:$D$218,3,0),\"\")","v":13},{"$f":"IFERROR(VLOOKUP($B98,'Partie 4'!$B$27:$D$218,2,0),\"\")","v":8},{"$f":"IFERROR(VLOOKUP($B98,'Partie 4'!$B$27:$D$218,3,0),\"\")","v":13},"B32",27,43,1,null,{"$f":"IFERROR(INDEX(Liste!$G$7:$G$198,MATCH(B98,Liste!$I$7:$I$198,0)),\"\")","v":0},"B32",27,43,1]
[97,{"$f":"IFERROR(INDEX(Liste!$I$7:$I$198,MATCH(Recap!A99,Liste!$L$7:$L$198,0)),\"\")","v":"B33"},null,{"$f":"IFERROR(VLOOKUP($B99,'Partie 1'!$B$27:$D$218,2,0),\"\")","v":2},{"$f":"IFERROR(VLOOKUP($B99,'Partie 1'!$B$27:$D$218,3,0),\"\")","v":13},{"$f":"IFERROR(VLOOKUP($B99,'Partie 2'!$B$27:$D$218,2,0),\"\")","v":2},{"$f":"IFERROR(VLOOKUP($B99,'Partie 2'!$B$27:$D$218,3,0),\"\")","v":13},{"$f":"IFERROR(VLOOKUP($B99,'Partie 3'!$B$27:$D$218,2,0),\"\")","v":5},{"$f":"IFERROR(VLOOKUP($B99,'Partie 3'!$B$27:$D$218,3,0),\"\")","v":13},{"$f":"IFERROR(VLOOKUP($B99,'Partie 4'!$B$27:$D$218,2,0),\"\")","v":13},{"$f":"IFERROR(VLOOKUP($B99,'Partie 4'!$B$27:$D$218,3,0),\"\")","v":7},"B33",22,46,1,null,{"$f":"IFERROR(INDEX(Liste!$G$7:$G$198,MATCH(B99,Liste!$I$7:$I$198,0)),\"\")","v":0},"B33",22,46,1]
[98,{"$f":"IFERROR(INDEX(Liste!$I$7:$I$198,MATCH(Recap!A100,Liste!$L$7:$L$198,0)),\"\")","v":"B34"},null,{"$f":"IFERROR(VLOOKUP($B100,'Partie 1'!$B$27:$D$218,2,0),\"\")","v":13},{"$f":"IFERROR(VLOOKUP($B100,'Partie 1'!$B$27:$D$218,3,0),\"\")","v":2},{"$f":"IFERROR(VLOOKUP($B100,'Partie 2'!$B$27:$D$218,2,0),\"\")","v":2},{"$f":"IFERROR(VLOOKUP($B100,'Partie 2'!$B$27:$D$218,3,0),\"\")","v":13},{"$f":"IFERROR(VLOOKUP($B100,'Partie 3'!$B$27:$D$218,2,0),\"\")","v":5},{"$f":"IFERROR(VLOOKUP($B100,'Partie 3'!$B$27:$D$218,3,0),\"\")","v":13},{"$f":"IFERROR(VLOOKUP($B100,'Partie 4'!$B$27:$D$218,2,0),\"\")","v":13},{"$f":"IFERROR(VLOOKUP($B100,'Partie 4'!$B$27:$D$218,3,0),\"\")","v":11},"B34",33,39,2,null,{"$f":"IFERROR(INDEX(Liste!$G$7:$G$198,MATCH(B100,Liste!$I$7:$I$198,0)),\"\")","v":0},"B34",33,39,2]
[99,{"$f":"IFERROR(INDEX(Liste!$I$7:$I$198,MATCH(Recap!A101,Liste!$L$7:$L$198,0)),\"\")","v":"B35"},null,{"$f":"IFERROR(VLOOKUP($B101,'Partie 1'!$B$27:$D$218,2,0),\"\")","v":13},{"$f":"IFERROR(VLOOKUP($B101,'Partie 1'!$B$27:$D$218,3,0),\"\")","v":10},{"$f":"IFERROR(VLOOKUP($B101,'Partie 2'!$B$27:$D$218,2,0),\"\")","v":13},{"$f":"IFERROR(VLOOKUP($B101,'Partie 2'!$B$27:$D$218,3,0),\"\")","v":2},{"$f":"IFERROR(VLOOKUP($B101,'Partie 3'!$B$27:$D$218,2,0),\"\")","v":5},{"$f":"IFERROR(VLOOKUP($B101,'Partie 3'!$B$27:$D$218,3,0),\"\")","v":13},{"$f":"IFERROR(VLOOKUP($B101,'Partie 4'!$B$27:$D$218,2,0),\"\")","v":13},{"$f":"IFERROR(VLOOKUP($B101,'Partie 4'!$B$27:$D$218,3,0),\"\")","v":11},"B35",44,36,3,null,{"$f":"IFERROR(INDEX(Liste!$G$7:$G$198,MATCH(B101,Liste!$I$7:$I$198,0)),\"\")","v":0},"B35",44,36,3]
[100,{"$f":"IFERROR(INDEX(Liste!$I$7:$I$198,MATCH(Recap!A102,Liste!$L$7:$L$198,0)),\"\")","v":"B36"},null,{"$f":"IFERROR(VLOOKUP($B102,'Partie 1'!$B$27:$D$218,2,0),\"\")","v":10},{"$f":"IFERROR(VLOOKUP($B102,'Partie 1'!$B$27:$D$218,3,0),\"\")","v":13},{"$f":"IFERROR(VLOOKUP($B102,'Partie 2'!$B$27:$D$218,2,0),\"\")","v":13},{"$f":"IFERROR(VLOOKUP($B102,'Partie 2'!$B$27:$D$218,3,0),\"\")","v":2},{"$f":"IFERROR(VLOOKUP($B102,'Partie 3'!$B$27:$D$218,2,0),\"\")","v":5},{"$f":"IFERROR(VLOOKUP($B102,'Partie 3'!$B$27:$D$218,3,0),\"\")","v":13},{"$f":"IFERROR(VLOOKUP($B102,'Partie 4'!$B$27:$D$218,2,0),\"\")","v":13},{"$f":"IFERROR(VLOOKUP($B102,'Partie 4'!$B$27:$D$218,3,0),\"\")","v":7},"B36",41,35,2,null,{"$f":"IFERROR(INDEX(Liste!$G$7:$G$198,MATCH(B102,Liste!$I$7:$I$198,0)),\"\")","v":0},"B36",41,35,2]
[101,{"$f":"IFERROR(INDEX(Liste!$I$7:$I$198,MATCH(Recap!A103,Liste!$L$7:$L$198,0)),\"\")","v":"B37"},null,{"$f":"IFERROR(VLOOKUP($B103,'Partie 1'!$B$27:$D$218,2,0),\"\")","v":13},{"$f":"IFERROR(VLOOKUP($B103,'Partie 1'!$B$27:$D$218,3,0),\"\")","v":11},{"$f":"IFERROR(VLOOKUP($B103,'Partie 2'!$B$27:$D$218,2,0),\"\")","v":13},{"$f":"IFERROR(VLOOKUP($B103,'Partie 2'!$B$27:$D$218,3,0),\"\")","v":10},{"$f":"IFERROR(VLOOKUP($B103,'Partie 3'!$B$27:$D$218,2,0),\"\")","v":13},{"$f":"IFERROR(VLOOKUP($B103,'Partie 3'!$B$27:$D$218,3,0),\"\")","v":5},{"$f":"IFERROR(VLOOKUP($B103,'Partie 4'!$B$27:$D$218,2,0),\"\")","v":13},{"$f":"IFERROR(VLOOKUP($B103,'Partie 4'!$B$27:$D$218,3,0),\"\")","v":11},"B37",52,37,4,null,{"$f":"IFERROR(INDEX(Liste!$G$7:$G$198,MATCH(B103,Liste!$I$7:$I$198,0)),\"\")","v":0},"B37",52,37,4]
[102,{"$f":"IFERROR(INDEX(Liste!$I$7:$I$198,MATCH(Recap!A104,Liste!$L$7:$L$198,0)),\"\")","v":"B38"},null,{"$f":"IFERROR(VLOOKUP($B104,'Partie 1'!$B$27:$D$218,2,0),\"\")","v":11},{"$f":"IFERROR(VLOOKUP($B104,'Partie 1'!$B$27:$D$218,3,0),\"\")","v":13},{"$f":"IFERROR(VLOOKUP($B104,'Partie 2'!$B$27:$D$218,2,0),\"\")","v":13},{"$f":"IFERROR(VLOOKUP($B104,'Partie 2'!$B$27:$D$218,3,0),\"\")","v":10},{"$f":"IFERROR(VLOOKUP($B104,'Partie 3'!$B$27:$D$218,2,0),\"\")","v":13},{"$f":"IFERROR(VLOOKUP($B104,'Partie 3'!$B$27:$D$218,3,0),\"\")","v":5},{"$f":"IFERROR(VLOOKUP($B104,'Partie 4'!$B$27:$D$218,2,0),\"\")","v":13},{"$f":"IFERROR(VLOOKUP($B104,'Partie 4'!$B$27:$D$218,3,0),\"\")","v":7},"B38",50,35,3,null,{"$f":"IFERROR(INDEX(Liste!$G$7:$G$198,MATCH(B104,Liste!$I$7:$I$198,0)),\"\")","v":0},"B38",50,35,3]
[103,{"$f":"IFERROR(INDEX(Liste!$I$7:$I$198,MATCH(Recap!A105,Liste!$L$7:$L$198,0)),\"\")","v":"B39"},null,{"$f":"IFERROR(VLOOKUP($B105,'Partie 1'!$B$27:$D$218,2,0),\"\")","v":13},{"$f":"IFERROR(VLOOKUP($B105,'Partie 1'!$B$27:$D$218,3,0),\"\")","v":2},{"$f":"IFERROR(VLOOKUP($B105,'Partie 2'!$B$27:$D$218,2,0),\"\")","v":10},{"$f":"IFERROR(VLOOKUP($B105,'Partie 2'!$B$27:$D$218,3,0),\"\")","v":13},{"$f":"IFERROR(VLOOKUP($B105,'Partie 3'!$B$27:$D$218,2,0),\"\")","v":13},{"$f":"IFERROR(VLOOKUP($B105,'Partie 3'!$B$27:$D$218,3,0),\"\")","v":5},{"$f":"IFERROR(VLOOKUP($B105,'Partie 4'!$B$27:$D$218,2,0),\"\")","v":13},{"$f":"IFERROR(VLOOKUP($B105,'Partie 4'!$B$27:$D$218,3,0),\"\")","v":11},"B39",49,31,3,null,{"$f":"IFERROR(INDEX(Liste!$G$7:$G$198,MATCH(B105,Liste!$I$7:$I$198,0)),\"\")","v":0},"B39",49,31,3]
[104,{"$f":"IFERROR(INDEX(Liste!$I$7:$I$198,MATCH(Recap!A106,Liste!$L$7:$L$198,0)),\"\")","v":"B40"},null,{"$f":"IFERROR(VLOOKUP($B106,'Partie 1'!$B$27:$D$218,2,0),\"\")","v":2},{"$f":"IFERROR(VLOOKUP($B106,'Partie 1'!$B$27:$D$218,3,0),\"\")","v":13},{"$f":"IFERROR(VLOOKUP($B106,'Partie 2'!$B$27:$D$218,2,0),\"\")","v":10},{"$f":"IFERROR(VLOOKUP($B106,'Partie 2'!$B$27:$D$218,3,0),\"\")","v":13},{"$f":"IFERROR(VLOOKUP($B106,'Partie 3'!$B$27:$D$218,2,0),\"\")","v":13},{"$f":"IFERROR(VLOOKUP($B106,'Partie 3'!$B$27:$D$218,3,0),\"\")","v":5},{"$f":"IFERROR(VLOOKUP($B106,'Partie 4'!$B$27:$D$218,2,0),\"\")","v":13},{"$f":"IFERROR(VLOOKUP($B106,'Partie 4'!$B$27:$D$218,3,0),\"\")","v":7},"B40",38,38,2,null,{"$f":"IFERROR(INDEX(Liste!$G$7:$G$198,MATCH(B106,Liste!$I$7:$I$198,0)),\"\")","v":0},"B40",38,38,2]
[105,{"$f":"IFERROR(INDEX(Liste!$I$7:$I$198,MATCH(Recap!A107,Liste!$L$7:$L$198,0)),\"\")","v":"B41"},null,{"$f":"IFERROR(VLOOKUP($B107,'Partie 1'!$B$27:$D$218,2,0),\"\")","v":5},{"$f":"IFERROR(VLOOKUP($B107,'Partie 1'!$B$27:$D$218,3,0),\"\")","v":13},{"$f":"IFERROR(VLOOKUP($B107,'Partie 2'!$B$27:$D$218,2,0),\"\")","v":13},{"$f":"IFERROR(VLOOKUP($B107,'Partie 2'!$B$27:$D$218,3,0),\"\")","v":11},{"$f":"IFERROR(VLOOKUP($B107,'Partie 3'!$B$27:$D$218,2,0),\"\")","v":13},{"$f":"IFERROR(VLOOKUP($B107,'Partie 3'!$B$27:$D$218,3,0),\"\")","v":8},{"$f":"IFERROR(VLOOKUP($B107,'Partie 4'!$B$27:$D$218,2,0),\"\")","v":7},{"$f":"IFERROR(VLOOKUP($B107,'Partie 4'!$B$27:$D$218,3,0),\"\")","v":13},"B41",38,45,2,null,{"$f":"IFERROR(INDEX(Liste!$G$7:$G$198,MATCH(B107,Liste!$I$7:$I$198,0)),\"\")","v":0},"B41",38,45,2]
[106,{"$f":"IFERROR(INDEX(Liste!$I$7:$I$198,MATCH(Recap!A108,Liste!$L$7:$L$198,0)),\"\")","v":"B42"},null,{"$f":"IFERROR(VLOOKUP($B108,'Partie 1'!$B$27:$D$218,2,0),\"\")","v":13},{"$f":"IFERROR(VLOOKUP($B108,'Partie 1'!$B$27:$D$218,3,0),\"\")","v":5},{"$f":"IFERROR(VLOOKUP($B108,'Partie 2'!$B$27:$D$218,2,0),\"\")","v":13},{"$f":"IFERROR(VLOOKUP($B108,'Partie 2'!$B$27:$D$218,3,0),\"\")","v":11},{"$f":"IFERROR(VLOOKUP($B108,'Partie 3'!$B$27:$D$218,2,0),\"\")","v":13},{"$f":"IFERROR(VLOOKUP($B108,'Partie 3'!$B$27:$D$218,3,0),\"\")","v":8},{"$f":"IFERROR(VLOOKUP($B108,'Partie 4'!$B$27:$D$218,2,0),\"\")","v":11},{"$f":"IFERROR(VLOOKUP($B108,'Partie 4'!$B$27:$D$218,3,0),\"\")","v":13},"B42",50,37,3,null,{"$f":"IFERROR(INDEX(Liste!$G$7:$G$198,MATCH(B108,Liste!$I$7:$I$198,0)),\"\")","v":0},"B42",50,37,3]
[107,{"$f":"IFERROR(INDEX(Liste!$I$7:$I$198,MATCH(Recap!A109,Liste!$L$7:$L$198,0)),\"\")","v":"B43"},null,{"$f":"IFERROR(VLOOKUP($B109,'Partie 1'!$B$27:$D$218,2,0),\"\")","v":13},{"$f":"IFERROR(VLOOKUP($B109,'Partie 1'!$B$27:$D$218,3,0),\"\")","v":8},{"$f":"IFERROR(VLOOKUP($B109,'Partie 2'!$B$27:$D$218,2,0),\"\")","v":11},{"$f":"IFERROR(VLOOKUP($B109,'Partie 2'!$B$27:$D$218,3,0),\"\")","v":13},{"$f":"IFERROR(VLOOKUP($B109,'Partie 3'!$B$27:$D$218,2,0),\"\")","v":13},{"$f":"IFERROR(VLOOKUP($B109,'Partie 3'!$B$27:$D$218,3,0),\"\")","v":8},{"$f":"IFERROR(VLOOKUP($B109,'Partie 4'!$B$27:$D$218,2,0),\"\")","v":11},{"$f":"IFERROR(VLOOKUP($B109,'Partie 4'!$B$27:$D$218,3,0),\"\")","v":13},"B43",48,42,2,null,{"$f":"IFERROR(INDEX(Liste!$G$7:$G$198,MATCH(B109,Liste!$I$7:$I$198,0)),\"\")","v":0},"B43",48,42,2]
[108,{"$f":"IFERROR(INDEX(Liste!$I$7:$I$198,MATCH(Recap!A110,Liste!$L$7:$L$198,0)),\"\")","v":"B44"},null,{"$f":"IFERROR(VLOOKUP($B110,'Partie 1'!$B$27:$D$218,2,0),\"\")","v":8},{"$f":"IFERROR(VLOOKUP($B110,'Partie 1'!$B$27:$D$218,3,0),\"\")","v":13},{"$f":"IFERROR(VLOOKUP($B110,'Partie 2'!$B$27:$D$218,2,0),\"\")","v":11},{"$f":"IFERROR(VLOOKUP($B110,'Partie 2'!$B$27:$D$218,3,0),\"\")","v":13},{"$f":"IFERROR(VLOOKUP($B110,'Partie 3'!$B$27:$D$218,2,0),\"\")","v":13},{"$f":"IFERROR(VLOOKUP($B110,'Partie 3'!$B$27:$D$218,3,0),\"\")","v":8},{"$f":"IFERROR(VLOOKUP($B110,'Partie 4'!$B$27:$D$218,2,0),\"\")","v":7},{"$f":"IFERROR(VLOOKUP($B110,'Partie 4'!$B$27:$D$218,3,0),\"\")","v":13},"B44",39,47,1,null,{"$f":"IFERROR(INDEX(Liste!$G$7:$G$198,MATCH(B110,Liste!$I$7:$I$198,0)),\"\")","v":0},"B44",39,47,1]
[109,{"$f":"IFERROR(INDEX(Liste!$I$7:$I$198,MATCH(Recap!A111,Liste!$L$7:$L$198,0)),\"\")","v":"B45"},null,{"$f":"IFERROR(VLOOKUP($B111,'Partie 1'!$B$27:$D$218,2,0),\"\")","v":13},{"$f":"IFERROR(VLOOKUP($B111,'Partie 1'!$B$27:$D$218,3,0),\"\")","v":7},{"$f":"IFERROR(VLOOKUP($B111,'Partie 2'!$B$27:$D$218,2,0),\"\")","v":13},{"$f":"IFERROR(VLOOKUP($B111,'Partie 2'!$B$27:$D$218,3,0),\"\")","v":2},{"$f":"IFERROR(VLOOKUP($B111,'Partie 3'!$B$27:$D$218,2,0),\"\")","v":8},{"$f":"IFERROR(VLOOKUP($B111,'Partie 3'!$B$27:$D$218,3,0),\"\")","v":13},{"$f":"IFERROR(VLOOKUP($B111,'Partie 4'!$B$27:$D$218,2,0),\"\")","v":11},{"$f":"IFERROR(VLOOKUP($B111,'Partie 4'!$B$27:$D$218,3,0),\"\")","v":13},"B45",45,35,2,null,{"$f":"IFERROR(INDEX(Liste!$G$7:$G$198,MATCH(B111,Liste!$I$7:$I$198,0)),\"\")","v":0},"B45",45,35,2]
[110,{"$f":"IFERROR(INDEX(Liste!$I$7:$I$198,MATCH(Recap!A112,Liste!$L$7:$L$198,0)),\"\")","v":"B46"},null,{"$f":"IFERROR(VLOOKUP($B112,'Partie 1'!$B$27:$D$218,2,0),\"\")","v":7},{"$f":"IFERROR(VLOOKUP($B112,'Partie 1'!$B$27:$D$218,3,0),\"\")","v":13},{"$f":"IFERROR(VLOOKUP($B112,'Partie 2'!$B$27:$D$218,2,0),\"\")","v":13},{"$f":"IFERROR(VLOOKUP($B112,'Partie 2'!$B$27:$D$218,3,0),\"\")","v":2},{"$f":"IFERROR(VLOOKUP($B112,'Partie 3'!$B$27:$D$218,2,0),\"\")","v":8},{"$f":"IFERROR(VLOOKUP($B112,'Partie 3'!$B$27:$D$218,3,0),\"\")","v":13},{"$f":"IFERROR(VLOOKUP($B112,'Partie 4'!$B$27:$D$218,2,0),\"\")","v":7},{"$f":"IFERROR(VLOOKUP($B112,'Partie 4'!$B$27:$D$218,3,0),\"\")","v":13},"B46",35,41,1,null,{"$f":"IFERROR(INDEX(Liste!$G$7:$G$198,MATCH(B112,Liste!$I$7:$I$198,0)),\"\")","v":0},"B46",35,41,1]
[111,{"$f":"IFERROR(INDEX(Liste!$I$7:$I$198,MATCH(Recap!A113,Liste!$L$7:$L$198,0)),\"\")","v":"B47"},null,{"$f":"IFERROR(VLOOKUP($B113,'Partie 1'!$B$27:$D$218,2,0),\"\")","v":4},{"$f":"IFERROR(VLOOKUP($B113,'Partie 1'!$B$27:$D$218,3,0),\"\")","v":13},{"$f":"IFERROR(VLOOKUP($B113,'Partie 2'!$B$27:$D$218,2,0),\"\")","v":2},{"$f":"IFERROR(VLOOKUP($B113,'Partie 2'!$B$27:$D$218,3,0),\"\")","v":13},{"$f":"IFERROR(VLOOKUP($B113,'Partie 3'!$B$27:$D$218,2,0),\"\")","v":8},{"$f":"IFERROR(VLOOKUP($B113,'Partie 3'!$B$27:$D$218,3,0),\"\")","v":13},{"$f":"IFERROR(VLOOKUP($B113,'Partie 4'!$B$27:$D$218,2,0),\"\")","v":7},{"$f":"IFERROR(VLOOKUP($B113,'Partie 4'!$B$27:$D$218,3,0),\"\")","v":13},"B47",21,52,0,null,{"$f":"IFERROR(INDEX(Liste!$G$7:$G$198,MATCH(B113,Liste!$I$7:$I$198,0)),\"\")","v":0},"B47",21,52,0]
[112,{"$f":"IFERROR(INDEX(Liste!$I$7:$I$198,MATCH(Recap!A114,Liste!$L$7:$L$198,0)),\"\")","v":"B48"},null,{"$f":"IFERROR(VLOOKUP($B114,'Partie 1'!$B$27:$D$218,2,0),\"\")","v":13},{"$f":"IFERROR(VLOOKUP($B114,'Partie 1'!$B$27:$D$218,3,0),\"\")","v":4},{"$f":"IFERROR(VLOOKUP($B114,'Partie 2'!$B$27:$D$218,2,0),\"\")","v":2},{"$f":"IFERROR(VLOOKUP($B114,'Partie 2'!$B$27:$D$218,3,0),\"\")","v":13},{"$f":"IFERROR(VLOOKUP($B114,'Partie 3'!$B$27:$D$218,2,0),\"\")","v":8},{"$f":"IFERROR(VLOOKUP($B114,'Partie 3'!$B$27:$D$218,3,0),\"\")","v":13},{"$f":"IFERROR(VLOOKUP($B114,'Partie 4'!$B$27:$D$218,2,0),\"\")","v":11},{"$f":"IFERROR(VLOOKUP($B114,'Partie 4'!$B$27:$D$218,3,0),\"\")","v":13},"B48",34,43,1,null,{"$f":"IFERROR(INDEX(Liste!$G$7:$G$198,MATCH(B114,Liste!$I$7:$I$198,0)),\"\")","v":0},"B48",34,43,1]
[113,{"$f":"IFERROR(INDEX(Liste!$I$7:$I$198,MATCH(Recap!A115,Liste!$L$7:$L$198,0)),\"\")","v":"B49"},null,{"$f":"IFERROR(VLOOKUP($B115,'Partie 1'!$B$27:$D$218,2,0),\"\")","v":13},{"$f":"IFERROR(VLOOKUP($B115,'Partie 1'!$B$27:$D$218,3,0),\"\")","v":2},{"$f":"IFERROR(VLOOKUP($B115,'Partie 2'!$B$27:$D$218,2,0),\"\")","v":5},{"$f":"IFERROR(VLOOKUP($B115,'Partie 2'!$B$27:$D$218,3,0),\"\")","v":13},{"$f":"IFERROR(VLOOKUP($B115,'Partie 3'!$B$27:$D$218,2,0),\"\")","v":13},{"$f":"IFERROR(VLOOKUP($B115,'Partie 3'!$B$27:$D$218,3,0),\"\")","v":7},{"$f":"IFERROR(VLOOKUP($B115,'Partie 4'!$B$27:$D$218,2,0),\"\")","v":13},{"$f":"IFERROR(VLOOKUP($B115,'Partie 4'!$B$27:$D$218,3,0),\"\")","v":2},"B49",44,24,3,null,{"$f":"IFERROR(INDEX(Liste!$G$7:$G$198,MATCH(B115,Liste!$I$7:$I$198,0)),\"\")","v":0},"B49",44,24,3]
[114,{"$f":"IFERROR(INDEX(Liste!$I$7:$I$198,MATCH(Recap!A116,Liste!$L$7:$L$198,0)),\"\")","v":"B50"},null,{"$f":"IFERROR(VLOOKUP($B116,'Partie 1'!$B$27:$D$218,2,0),\"\")","v":2},{"$f":"IFERROR(VLOOKUP($B116,'Partie 1'!$B$27:$D$218,3,0),\"\")","v":13},{"$f":"IFERROR(VLOOKUP($B116,'Partie 2'!$B$27:$D$218,2,0),\"\")","v":5},{"$f":"IFERROR(VLOOKUP($B116,'Partie 2'!$B$27:$D$218,3,0),\"\")","v":13},{"$f":"IFERROR(VLOOKUP($B116,'Partie 3'!$B$27:$D$218,2,0),\"\")","v":13},{"$f":"IFERROR(VLOOKUP($B116,'Partie 3'!$B$27:$D$218,3,0),\"\")","v":7},{"$f":"IFERROR(VLOOKUP($B116,'Partie 4'!$B$27:$D$218,2,0),\"\")","v":4},{"$f":"IFERROR(VLOOKUP($B116,'Partie 4'!$B$27:$D$218,3,0),\"\")","v":13},"B50",24,46,1,null,{"$f":"IFERROR(INDEX(Liste!$G$7:$G$198,MATCH(B116,Liste!$I$7:$I$198,0)),\"\")","v":0},"B50",24,46,1]
[115,{"$f":"IFERROR(INDEX(Liste!$I$7:$I$198,MATCH(Recap!A117,Liste!$L$7:$L$198,0)),\"\")","v":"B51"},null,{"$f":"IFERROR(VLOOKUP($B117,'Partie 1'!$B$27:$D$218,2,0),\"\")","v":10},{"$f":"IFERROR(VLOOKUP($B117,'Partie 1'!$B$27:$D$218,3,0),\"\")","v":13},{"$f":"IFERROR(VLOOKUP($B117,'Partie 2'!$B$27:$D$218,2,0),\"\")","v":13},{"$f":"IFERROR(VLOOKUP($B117,'Partie 2'!$B$27:$D$218,3,0),\"\")","v":5},{"$f":"IFERROR(VLOOKUP($B117,'Partie 3'!$B$27:$D$218,2,0),\"\")","v":13},{"$f":"IFERROR(VLOOKUP($B117,'Partie 3'!$B$27:$D$218,3,0),\"\")","v":7},{"$f":"IFERROR(VLOOKUP($B117,'Partie 4'!$B$27:$D$218,2,0),\"\")","v":4},{"$f":"IFERROR(VLOOKUP($B117,'Partie 4'!$B$27:$D$218,3,0),\"\")","v":13},"B51",40,38,2,null,{"$f":"IFERROR(INDEX(Liste!$G$7:$G$198,MATCH(B117,Liste!$I$7:$I$198,0)),\"\")","v":0},"B51",40,38,2]
[116,{"$f":"IFERROR(INDEX(Liste!$I$7:$I$198,MATCH(Recap!A118,Liste!$L$7:$L$198,0)),\"\")","v":"B52"},null,{"$f":"IFERROR(VLOOKUP($B118,'Partie 1'!$B$27:$D$218,2,0),\"\")","v":13},{"$f":"IFERROR(VLOOKUP($B118,'Partie 1'!$B$27:$D$218,3,0),\"\")","v":10},{"$f":"IFERROR(VLOOKUP($B118,'Partie 2'!$B$27:$D$218,2,0),\"\")","v":13},{"$f":"IFERROR(VLOOKUP($B118,'Partie 2'!$B$27:$D$218,3,0),\"\")","v":5},{"$f":"IFERROR(VLOOKUP($B118,'Partie 3'!$B$27:$D$218,2,0),\"\")","v":13},{"$f":"IFERROR(VLOOKUP($B118,'Partie 3'!$B$27:$D$218,3,0),\"\")","v":7},{"$f":"IFERROR(VLOOKUP($B118,'Partie 4'!$B$27:$D$218,2,0),\"\")","v":13},{"$f":"IFERROR(VLOOKUP($B118,'Partie 4'!$B$27:$D$218,3,0),\"\")","v":2},"B52",52,24,4,null,{"$f":"IFERROR(INDEX(Liste!$G$7:$G$198,MATCH(B118,Liste!$I$7:$I$198,0)),\"\")","v":0},"B52",52,24,4]
[117,{"$f":"IFERROR(INDEX(Liste!$I$7:$I$198,MATCH(Recap!A119,Liste!$L$7:$L$198,0)),\"\")","v":"B53"},null,{"$f":"IFERROR(VLOOKUP($B119,'Partie 1'!$B$27:$D$218,2,0),\"\")","v":11},{"$f":"IFERROR(VLOOKUP($B119,'Partie 1'!$B$27:$D$218,3,0),\"\")","v":13},{"$f":"IFERROR(VLOOKUP($B119,'Partie 2'!$B$27:$D$218,2,0),\"\")","v":13},{"$f":"IFERROR(VLOOKUP($B119,'Partie 2'!$B$27:$D$218,3,0),\"\")","v":8},{"$f":"IFERROR(VLOOKUP($B119,'Partie 3'!$B$27:$D$218,2,0),\"\")","v":7},{"$f":"IFERROR(VLOOKUP($B119,'Partie 3'!$B$27:$D$218,3,0),\"\")","v":13},{"$f":"IFERROR(VLOOKUP($B119,'Partie 4'!$B$27:$D$218,2,0),\"\")","v":4},{"$f":"IFERROR(VLOOKUP($B119,'Partie 4'!$B$27:$D$218,3,0),\"\")","v":13},"B53",35,47,1,null,{"$f":"IFERROR(INDEX(Liste!$G$7:$G$198,MATCH(B119,Liste!$I$7:$I$198,0)),\"\")","v":0},"B53",35,47,1]
[118,{"$f":"IFERROR(INDEX(Liste!$I$7:$I$198,MATCH(Recap!A120,Liste!$L$7:$L$198,0)),\"\")","v":"B54"},null,{"$f":"IFERROR(VLOOKUP($B120,'Partie 1'!$B$27:$D$218,2,0),\"\")","v":13},{"$f":"IFERROR(VLOOKUP($B120,'Partie 1'!$B$27:$D$218,3,0),\"\")","v":11},{"$f":"IFERROR(VLOOKUP($B120,'Partie 2'!$B$27:$D$218,2,0),\"\")","v":13},{"$f":"IFERROR(VLOOKUP($B120,'Partie 2'!$B$27:$D$218,3,0),\"\")","v":8},{"$f":"IFERROR(VLOOKUP($B120,'Partie 3'!$B$27:$D$218,2,0),\"\")","v":7},{"$f":"IFERROR(VLOOKUP($B120,'Partie 3'!$B$27:$D$218,3,0),\"\")","v":13},{"$f":"IFERROR(VLOOKUP($B120,'Partie 4'!$B$27:$D$218,2,0),\"\")","v":13},{"$f":"IFERROR(VLOOKUP($B120,'Partie 4'!$B$27:$D$218,3,0),\"\")","v":2},"B54",46,34,3,null,{"$f":"IFERROR(INDEX(Liste!$G$7:$G$198,MATCH(B120,Liste!$I$7:$I$198,0)),\"\")","v":0},"B54",46,34,3]
[119,{"$f":"IFERROR(INDEX(Liste!$I$7:$I$198,MATCH(Recap!A121,Liste!$L$7:$L$198,0)),\"\")","v":"B55"},null,{"$f":"IFERROR(VLOOKUP($B121,'Partie 1'!$B$27:$D$218,2,0),\"\")","v":2},{"$f":"IFERROR(VLOOKUP($B121,'Partie 1'!$B$27:$D$218,3,0),\"\")","v":13},{"$f":"IFERROR(VLOOKUP($B121,'Partie 2'!$B$27:$D$218,2,0),\"\")","v":8},{"$f":"IFERROR(VLOOKUP($B121,'Partie 2'!$B$27:$D$218,3,0),\"\")","v":13},{"$f":"IFERROR(VLOOKUP($B121,'Partie 3'!$B$27:$D$218,2,0),\"\")","v":7},{"$f":"IFERROR(VLOOKUP($B121,'Partie 3'!$B$27:$D$218,3,0),\"\")","v":13},{"$f":"IFERROR(VLOOKUP($B121,'Partie 4'!$B$27:$D$218,2,0),\"\")","v":4},{"$f":"IFERROR(VLOOKUP($B121,'Partie 4'!$B$27:$D$218,3,0),\"\")","v":13},"B55",21,52,0,null,{"$f":"IFERROR(INDEX(Liste!$G$7:$G$198,MATCH(B121,Liste!$I$7:$I$198,0)),\"\")","v":0},"B55",21,52,0]
[120,{"$f":"IFERROR(INDEX(Liste!$I$7:$I$198,MATCH(Recap!A122,Liste!$L$7:$L$198,0)),\"\")","v":"B56"},null,{"$f":"IFERROR(VLOOKUP($B122,'Partie 1'!$B$27:$D$218,2,0),\"\")","v":13},{"$f":"IFERROR(VLOOKUP($B122,'Partie 1'!$B$27:$D$218,3,0),\"\")","v":2},{"$f":"IFERROR(VLOOKUP($B122,'Partie 2'!$B$27:$D$218,2,0),\"\")","v":8},{"$f":"IFERROR(VLOOKUP($B122,'Partie 2'!$B$27:$D$218,3,0),\"\")","v":13},{"$f":"IFERROR(VLOOKUP($B122,'Partie 3'!$B$27:$D$218,2,0),\"\")","v":7},{"$f":"IFERROR(VLOOKUP($B122,'Partie 3'!$B$27:$D$218,3,0),\"\")","v":13},{"$f":"IFERROR(VLOOKUP($B122,'Partie 4'!$B$27:$D$218,2,0),\"\")","v":13},{"$f":"IFERROR(VLOOKUP($B122,'Partie 4'!$B$27:$D$218,3,0),\"\")","v":2},"B56",41,30,2,null,{"$f":"IFERROR(INDEX(Liste!$G$7:$G$198,MATCH(B122,Liste!$I$7:$I$198,0)),\"\")","v":0},"B56",41,30,2]
[121,{"$f":"IFERROR(INDEX(Liste!$I$7:$I$198,MATCH(Recap!A123,Liste!$L$7:$L$198,0)),\"\")","v":"B57"},null,{"$f":"IFERROR(VLOOKUP($B123,'Partie 1'!$B$27:$D$218,2,0),\"\")","v":13},{"$f":"IFERROR(VLOOKUP($B123,'Partie 1'!$B$27:$D$218,3,0),\"\")","v":5},{"$f":"IFERROR(VLOOKUP($B123,'Partie 2'!$B$27:$D$218,2,0),\"\")","v":13},{"$f":"IFERROR(VLOOKUP($B123,'Partie 2'!$B$27:$D$218,3,0),\"\")","v":7},{"$f":"IFERROR(VLOOKUP($B123,'Partie 3'!$B$27:$D$218,2,0),\"\")","v":4},{"$f":"IFERROR(VLOOKUP($B123,'Partie 3'!$B$27:$D$218,3,0),\"\")","v":13},{"$f":"IFERROR(VLOOKUP($B123,'Partie 4'!$B$27:$D$218,2,0),\"\")","v":2},{"$f":"IFERROR(VLOOKUP($B123,'Partie 4'!$B$27:$D$218,3,0),\"\")","v":13},"B57",32,38,2,null,{"$f":"IFERROR(INDEX(Liste!$G$7:$G$198,MATCH(B123,Liste!$I$7:$I$198,0)),\"\")","v":0},"B57",32,38,2]
[122,{"$f":"IFERROR(INDEX(Liste!$I$7:$I$198,MATCH(Recap!A124,Liste!$L$7:$L$198,0)),\"\")","v":"B58"},null,{"$f":"IFERROR(VLOOKUP($B124,'Partie 1'!$B$27:$D$218,2,0),\"\")","v":5},{"$f":"IFERROR(VLOOKUP($B124,'Partie 1'!$B$27:$D$218,3,0),\"\")","v":13},{"$f":"IFERROR(VLOOKUP($B124,'Partie 2'!$B$27:$D$218,2,0),\"\")","v":13},{"$f":"IFERROR(VLOOKUP($B124,'Partie 2'!$B$27:$D$218,3,0),\"\")","v":7},{"$f":"IFERROR(VLOOKUP($B124,'Partie 3'!$B$27:$D$218,2,0),\"\")","v":4},{"$f":"IFERROR(VLOOKUP($B124,'Partie 3'!$B$27:$D$218,3,0),\"\")","v":13},{"$f":"IFERROR(VLOOKUP($B124,'Partie 4'!$B$27:$D$218,2,0),\"\")","v":13},{"$f":"IFERROR(VLOOKUP($B124,'Partie 4'!$B$27:$D$218,3,0),\"\")","v":4},"B58",35,37,2,null,{"$f":"IFERROR(INDEX(Liste!$G$7:$G$198,MATCH(B124,Liste!$I$7:$I$198,0)),\"\")","v":0},"B58",35,37,2]
[123,{"$f":"IFERROR(INDEX(Liste!$I$7:$I$198,MATCH(Recap!A125,Liste!$L$7:$L$198,0)),\"\")","v":"B59"},null,{"$f":"IFERROR(VLOOKUP($B125,'Partie 1'!$B$27:$D$218,2,0),\"\")","v":8},{"$f":"IFERROR(VLOOKUP($B125,'Partie 1'!$B$27:$D$218,3,0),\"\")","v":13},{"$f":"IFERROR(VLOOKUP($B125,'Partie 2'!$B$27:$D$218,2,0),\"\")","v":7},{"$f":"IFERROR(VLOOKUP($B125,'Partie 2'!$B$27:$D$218,3,0),\"\")","v":13},{"$f":"IFERROR(VLOOKUP($B125,'Partie 3'!$B$27:$D$218,2,0),\"\")","v":4},{"$f":"IFERROR(VLOOKUP($B125,'Partie 3'!$B$27:$D$218,3,0),\"\")","v":13},{"$f":"IFERROR(VLOOKUP($B125,'Partie 4'!$B$27:$D$218,2,0),\"\")","v":13},{"$f":"IFERROR(VLOOKUP($B125,'Partie 4'!$B$27:$D$218,3,0),\"\")","v":4},"B59",32,43,1,null,{"$f":"IFERROR(INDEX(Liste!$G$7:$G$198,MATCH(B125,Liste!$I$7:$I$198,0)),\"\")","v":0},"B59",32,43,1]
[124,{"$f":"IFERROR(INDEX(Liste!$I$7:$I$198,MATCH(Recap!A126,Liste!$L$7:$L$198,0)),\"\")","v":"B60"},null,{"$f":"IFERROR(VLOOKUP($B126,'Partie 1'!$B$27:$D$218,2,0),\"\")","v":13},{"$f":"IFERROR(VLOOKUP($B126,'Partie 1'!$B$27:$D$218,3,0),\"\")","v":8},{"$f":"IFERROR(VLOOKUP($B126,'Partie 2'!$B$27:$D$218,2,0),\"\")","v":7},{"$f":"IFERROR(VLOOKUP($B126,'Partie 2'!$B$27:$D$218,3,0),\"\")","v":13},{"$f":"IFERROR(VLOOKUP($B126,'Partie 3'!$B$27:$D$218,2,0),\"\")","v":4},{"$f":"IFERROR(VLOOKUP($B126,'Partie 3'!$B$27:$D$218,3,0),\"\")","v":13},{"$f":"IFERROR(VLOOKUP($B126,'Partie 4'!$B$27:$D$218,2,0),\"\")","v":2},{"$f":"IFERROR(VLOOKUP($B126,'Partie 4'!$B$27:$D$218,3,0),\"\")","v":13},"B60",26,47,1,null,{"$f":"IFERROR(INDEX(Liste!$G$7:$G$198,MATCH(B126,Liste!$I$7:$I$198,0)),\"\")","v":0},"B60",26,47,1]
[125,{"$f":"IFERROR(INDEX(Liste!$I$7:$I$198,MATCH(Recap!A127,Liste!$L$7:$L$198,0)),\"\")","v":"B61"},null,{"$f":"IFERROR(VLOOKUP($B127,'Partie 1'!$B$27:$D$218,2,0),\"\")","v":7},{"$f":"IFERROR(VLOOKUP($B127,'Partie 1'!$B$27:$D$218,3,0),\"\")","v":13},{"$f":"IFERROR(VLOOKUP($B127,'Partie 2'!$B$27:$D$218,2,0),\"\")","v":4},{"$f":"IFERROR(VLOOKUP($B127,'Partie 2'!$B$27:$D$218,3,0),\"\")","v":13},{"$f":"IFERROR(VLOOKUP($B127,'Partie 3'!$B$27:$D$218,2,0),\"\")","v":13},{"$f":"IFERROR(VLOOKUP($B127,'Partie 3'!$B$27:$D$218,3,0),\"\")","v":4},{"$f":"IFERROR(VLOOKUP($B127,'Partie 4'!$B$27:$D$218,2,0),\"\")","v":13},{"$f":"IFERROR(VLOOKUP($B127,'Partie 4'!$B$27:$D$218,3,0),\"\")","v":4},"B61",37,34,2,null,{"$f":"IFERROR(INDEX(Liste!$G$7:$G$198,MATCH(B127,Liste!$I$7:$I$198,0)),\"\")","v":0},"B61",37,34,2]
[126,{"$f":"IFERROR(INDEX(Liste!$I$7:$I$198,MATCH(Recap!A128,Liste!$L$7:$L$198,0)),\"\")","v":"B62"},null,{"$f":"IFERROR(VLOOKUP($B128,'Partie 1'!$B$27:$D$218,2,0),\"\")","v":13},{"$f":"IFERROR(VLOOKUP($B128,'Partie 1'!$B$27:$D$218,3,0),\"\")","v":7},{"$f":"IFERROR(VLOOKUP($B128,'Partie 2'!$B$27:$D$218,2,0),\"\")","v":4},{"$f":"IFERROR(VLOOKUP($B128,'Partie 2'!$B$27:$D$218,3,0),\"\")","v":13},{"$f":"IFERROR(VLOOKUP($B128,'Partie 3'!$B$27:$D$218,2,0),\"\")","v":13},{"$f":"IFERROR(VLOOKUP($B128,'Partie 3'!$B$27:$D$218,3,0),\"\")","v":4},{"$f":"IFERROR(VLOOKUP($B128,'Partie 4'!$B$27:$D$218,2,0),\"\")","v":2},{"$f":"IFERROR(VLOOKUP($B128,'Partie 4'!$B$27:$D$218,3,0),\"\")","v":13},"B62",32,37,2,null,{"$f":"IFERROR(INDEX(Liste!$G$7:$G$198,MATCH(B128,Liste!$I$7:$I$198,0)),\"\")","v":0},"B62",32,37,2]
[127,{"$f":"IFERROR(INDEX(Liste!$I$7:$I$198,MATCH(Recap!A129,Liste!$L$7:$L$198,0)),\"\")","v":"B63"},null,{"$f":"IFERROR(VLOOKUP($B129,'Partie 1'!$B$27:$D$218,2,0),\"\")","v":13},{"$f":"IFERROR(VLOOKUP($B129,'Partie 1'!$B$27:$D$218,3,0),\"\")","v":4},{"$f":"IFERROR(VLOOKUP($B129,'Partie 2'!$B$27:$D$218,2,0),\"\")","v":13},{"$f":"IFERROR(VLOOKUP($B129,'Partie 2'!$B$27:$D$218,3,0),\"\")","v":4},{"$f":"IFERROR(VLOOKUP($B129,'Partie 3'!$B$27:$D$218,2,0),\"\")","v":13},{"$f":"IFERROR(VLOOKUP($B129,'Partie 3'!$B$27:$D$218,3,0),\"\")","v":4},{"$f":"IFERROR(VLOOKUP($B129,'Partie 4'!$B$27:$D$218,2,0),\"\")","v":2},{"$f":"IFERROR(VLOOKUP($B129,'Partie 4'!$B$27:$D$218,3,0),\"\")","v":13},"B63",41,25,3,null,{"$f":"IFERROR(INDEX(Liste!$G$7:$G$198,MATCH(B129,Liste!$I$7:$I$198,0)),\"\")","v":0},"B63",41,25,3]
[128,{"$f":"IFERROR(INDEX(Liste!$I$7:$I$198,MATCH(Recap!A130,Liste!$L$7:$L$198,0)),\"\")","v":"B64"},null,{"$f":"IFERROR(VLOOKUP($B130,'Partie 1'!$B$27:$D$218,2,0),\"\")","v":4},{"$f":"IFERROR(VLOOKUP($B130,'Partie 1'!$B$27:$D$218,3,0),\"\")","v":13},{"$f":"IFERROR(VLOOKUP($B130,'Partie 2'!$B$27:$D$218,2,0),\"\")","v":13},{"$f":"IFERROR(VLOOKUP($B130,'Partie 2'!$B$27:$D$218,3,0),\"\")","v":4},{"$f":"IFERROR(VLOOKUP($B130,'Partie 3'!$B$27:$D$218,2,0),\"\")","v":13},{"$f":"IFERROR(VLOOKUP($B130,'Partie 3'!$B$27:$D$218,3,0),\"\")","v":4},{"$f":"IFERROR(VLOOKUP($B130,'Partie 4'!$B$27:$D$218,2,0),\"\")","v":13},{"$f":"IFERROR(VLOOKUP($B130,'Partie 4'!$B$27:$D$218,3,0),\"\")","v":4},"B64",43,25,3,null,{"$f":"IFERROR(INDEX(Liste!$G$7:$G$198,MATCH(B130,Liste!$I$7:$I$198,0)),\"\")","v":0},"B64",43,25,3]
[129,{"$f":"IFERROR(INDEX(Liste!$I$7:$I$198,MATCH(Recap!A131,Liste!$L$7:$L$198,0)),\"\")","v":"C1"},null,{"$f":"IFERROR(VLOOKUP($B131,'Partie 1'!$B$27:$D$218,2,0),\"\")","v":13},{"$f":"IFERROR(VLOOKUP($B131,'Partie 1'!$B$27:$D$218,3,0),\"\")","v":2},{"$f":"IFERROR(VLOOKUP($B131,'Partie 2'!$B$27:$D$218,2,0),\"\")","v":2},{"$f":"IFERROR(VLOOKUP($B131,'Partie 2'!$B$27:$D$218,3,0),\"\")","v":13},{"$f":"IFERROR(VLOOKUP($B131,'Partie 3'!$B$27:$D$218,2,0),\"\")","v":2},{"$f":"IFERROR(VLOOKUP($B131,'Partie 3'!$B$27:$D$218,3,0),\"\")","v":13},{"$f":"IFERROR(VLOOKUP($B131,'Partie 4'!$B$27:$D$218,2,0),\"\")","v":2},{"$f":"IFERROR(VLOOKUP($B131,'Partie 4'!$B$27:$D$218,3,0),\"\")","v":13},{"$f":"IF(ISBLANK(B131),\"\",B131)","v":"C1"},{"$f":"SUMIF($D$2:$K$2,\"P*\",D131:K131)","v":19},{"$f":"SUMIF($D$2:$K$2,\"\",D131:K131)","v":41},{"$f":"COUNTIFS($D$2:$K$2,\"P*\",D131:K131,13)","v":1},null,{"$f":"IFERROR(INDEX(Liste!$G$7:$G$198,MATCH(B131,Liste!$I$7:$I$198,0)),\"\")","v":0},"C1",19,41,1]
[{"$f":"ROW()-2","v":130},{"$f":"IFERROR(INDEX(Liste!$I$7:$I$198,MATCH(Recap!A132,Liste!$L$7:$L$198,0)),\"\")","v":"C2"},null,{"$f":"IFERROR(VLOOKUP($B132,'Partie 1'!$B$27:$D$218,2,0),\"\")","v":2},{"$f":"IFERROR(VLOOKUP($B132,'Partie 1'!$B$27:$D$218,3,0),\"\")","v":13},{"$f":"IFERROR(VLOOKUP($B132,'Partie 2'!$B$27:$D$218,2,0),\"\")","v":2},{"$f":"IFERROR(VLOOKUP($B132,'Partie 2'!$B$27:$D$218,3,0),\"\")","v":13},{"$f":"IFERROR(VLOOKUP($B132,'Partie 3'!$B$27:$D$218,2,0),\"\")","v":2},{"$f":"IFERROR(VLOOKUP($B132,'Partie 3'!$B$27:$D$218,3,0),\"\")","v":13},{"$f":"IFERROR(VLOOKUP($B132,'Partie 4'!$B$27:$D$218,2,0),\"\")","v":5},{"$f":"IFERROR(VLOOKUP($B132,'Partie 4'!$B$27:$D$218,3,0),\"\")","v":13},"C2",11,52,0,null,{"$f":"IFERROR(INDEX(Liste!$G$7:$G$198,MATCH(B132,Liste!$I$7:$I$198,0)),\"\")","v":0},{"$f":"B132","v":"C2"},{"$f":"M132","v":11},{"$f":"N132","v":52},{"$f":"O132","v":0}]
[131,{"$f":"IFERROR(INDEX(Liste!$I$7:$I$198,MATCH(Recap!A133,Liste!$L$7:$L$198,0)),\"\")","v":"C3"},null,{"$f":"IFERROR(VLOOKUP($B133,'Partie 1'!$B$27:$D$218,2,0),\"\")","v":10},{"$f":"IFERROR(VLOOKUP($B133,'Partie 1'!$B$27:$D$218,3,0),\"\")","v":13},{"$f":"IFERROR(VLOOKUP($B133,'Partie 2'!$B$27:$D$218,2,0),\"\")","v":13},{"$f":"IFERROR(VLOOKUP($B133,'Partie 2'!$B$27:$D$218,3,0),\"\")","v":2},{"$f":"IFERROR(VLOOKUP($B133,'Partie 3'!$B$27:$D$218,2,0),\"\")","v":2},{"$f":"IFERROR(VLOOKUP($B133,'Partie 3'!$B$27:$D$218,3,0),\"\")","v":13},{"$f":"IFERROR(VLOOKUP($B133,'Partie 4'!$B$27:$D$218,2,0),\"\")","v":5},{"$f":"IFERROR(VLOOKUP($B133,'Partie 4'!$B$27:$D$218,3,0),\"\")","v":13},"C3",30,41,1,null,{"$f":"IFERROR(INDEX(Liste!$G$7:$G$198,MATCH(B133,Liste!$I$7:$I$198,0)),\"\")","v":0},"C3",30,41,1]
[132,{"$f":"IFERROR(INDEX(Liste!$I$7:$I$198,MATCH(Recap!A134,Liste!$L$7:$L$198,0)),\"\")","v":"C4"},null,{"$f":"IFERROR(VLOOKUP($B134,'Partie 1'!$B$27:$D$218,2,0),\"\")","v":13},{"$f":"IFERROR(VLOOKUP($B134,'Partie 1'!$B$27:$D$218,3,0),\"\")","v":10},{"$f":"IFERROR(VLOOKUP($B134,'Partie 2'!$B$27:$D$218,2,0),\"\")","v":13},{"$f":"IFERROR(VLOOKUP($B134,'Partie 2'!$B$27:$D$218,3,0),\"\")","v":2},{"$f":"IFERROR(VLOOKUP($B134,'Partie 3'!$B$27:$D$218,2,0),\"\")","v":2},{"$f":"IFERROR(VLOOKUP($B134,'Partie 3'!$B$27:$D$218,3,0),\"\")","v":13},{"$f":"IFERROR(VLOOKUP($B134,'Partie 4'!$B$27:$D$218,2,0),\"\")","v":2},{"$f":"IFERROR(VLOOKUP($B134,'Partie 4'!$B$27:$D$218,3,0),\"\")","v":13},"C4",30,38,2,null,{"$f":"IFERROR(INDEX(Liste!$G$7:$G$198,MATCH(B134,Liste!$I$7:$I$198,0)),\"\")","v":0},"C4",30,38,2]
[133,{"$f":"IFERROR(INDEX(Liste!$I$7:$I$198,MATCH(Recap!A135,Liste!$L$7:$L$198,0)),\"\")","v":"C5"},null,{"$f":"IFERROR(VLOOKUP($B135,'Partie 1'!$B$27:$D$218,2,0),\"\")","v":11},{"$f":"IFERROR(VLOOKUP($B135,'Partie 1'!$B$27:$D$218,3,0),\"\")","v":13},{"$f":"IFERROR(VLOOKUP($B135,'Partie 2'!$B$27:$D$218,2,0),\"\")","v":13},{"$f":"IFERROR(VLOOKUP($B135,'Partie 2'!$B$27:$D$218,3,0),\"\")","v":10},{"$f":"IFERROR(VLOOKUP($B135,'Partie 3'!$B$27:$D$218,2,0),\"\")","v":13},{"$f":"IFERROR(VLOOKUP($B135,'Partie 3'!$B$27:$D$218,3,0),\"\")","v":2},{"$f":"IFERROR(VLOOKUP($B135,'Partie 4'!$B$27:$D$218,2,0),\"\")","v":5},{"$f":"IFERROR(VLOOKUP($B135,'Partie 4'!$B$27:$D$218,3,0),\"\")","v":13},"C5",42,38,2,null,{"$f":"IFERROR(INDEX(Liste!$G$7:$G$198,MATCH(B135,Liste!$I$7:$I$198,0)),\"\")","v":0},"C5",42,38,2]
[134,{"$f":"IFERROR(INDEX(Liste!$I$7:$I$198,MATCH(Recap!A136,Liste!$L$7:$L$198,0)),\"\")","v":"C6"},null,{"$f":"IFERROR(VLOOKUP($B136,'Partie 1'!$B$27:$D$218,2,0),\"\")","v":13},{"$f":"IFERROR(VLOOKUP($B136,'Partie 1'!$B$27:$D$218,3,0),\"\")","v":11},{"$f":"IFERROR(VLOOKUP($B136,'Partie 2'!$B$27:$D$218,2,0),\"\")","v":13},{"$f":"IFERROR(VLOOKUP($B136,'Partie 2'!$B$27:$D$218,3,0),\"\")","v":10},{"$f":"IFERROR(VLOOKUP($B136,'Partie 3'!$B$27:$D$218,2,0),\"\")","v":13},{"$f":"IFERROR(VLOOKUP($B136,'Partie 3'!$B$27:$D$218,3,0),\"\")","v":2},{"$f":"IFERROR(VLOOKUP($B136,'Partie 4'!$B$27:$D$218,2,0),\"\")","v":2},{"$f":"IFERROR(VLOOKUP($B136,'Partie 4'!$B$27:$D$218,3,0),\"\")","v":13},"C6",41,36,3,null,{"$f":"IFERROR(INDEX(Liste!$G$7:$G$198,MATCH(B136,Liste!$I$7:$I$198,0)),\"\")","v":0},"C6",41,36,3]
[135,{"$f":"IFERROR(INDEX(Liste!$I$7:$I$198,MATCH(Recap!A137,Liste!$L$7:$L$198,0)),\"\")","v":"C7"},null,{"$f":"IFERROR(VLOOKUP($B137,'Partie 1'!$B$27:$D$218,2,0),\"\")","v":2},{"$f":"IFERROR(VLOOKUP($B137,'Partie 1'!$B$27:$D$218,3,0),\"\")","v":13},{"$f":"IFERROR(VLOOKUP($B137,'Partie 2'!$B$27:$D$218,2,0),\"\")","v":10},{"$f":"IFERROR(VLOOKUP($B137,'Partie 2'!$B$27:$D$218,3,0),\"\")","v":13},{"$f":"IFERROR(VLOOKUP($B137,'Partie 3'!$B$27:$D$218,2,0),\"\")","v":13},{"$f":"IFERROR(VLOOKUP($B137,'Partie 3'!$B$27:$D$218,3,0),\"\")","v":2},{"$f":"IFERROR(VLOOKUP($B137,'Partie 4'!$B$27:$D$218,2,0),\"\")","v":5},{"$f":"IFERROR(VLOOKUP($B137,'Partie 4'!$B$27:$D$218,3,0),\"\")","v":13},"C7",30,41,1,null,{"$f":"IFERROR(INDEX(Liste!$G$7:$G$198,MATCH(B137,Liste!$I$7:$I$198,0)),\"\")","v":0},"C7",30,41,1]
[136,{"$f":"IFERROR(INDEX(Liste!$I$7:$I$198,MATCH(Recap!A138,Liste!$L$7:$L$198,0)),\"\")","v":"C8"},null,{"$f":"IFERROR(VLOOKUP($B138,'Partie 1'!$B$27:$D$218,2,0),\"\")","v":13},{"$f":"IFERROR(VLOOKUP($B138,'Partie 1'!$B$27:$D$218,3,0),\"\")","v":2},{"$f":"IFERROR(VLOOKUP($B138,'Partie 2'!$B$27:$D$218,2,0),\"\")","v":10},{"$f":"IFERROR(VLOOKUP($B138,'Partie 2'!$B$27:$D$218,3,0),\"\")","v":13},{"$f":"IFERROR(VLOOKUP($B138,'Partie 3'!$B$27:$D$218,2,0),\"\")","v":13},{"$f":"IFERROR(VLOOKUP($B138,'Partie 3'!$B$27:$D$218,3,0),\"\")","v":2},{"$f":"IFERROR(VLOOKUP($B138,'Partie 4'!$B$27:$D$218,2,0),\"\")","v":2},{"$f":"IFERROR(VLOOKUP($B138,'Partie 4'!$B$27:$D$218,3,0),\"\")","v":13},"C8",38,30,2,null,{"$f":"IFERROR(INDEX(Liste!$G$7:$G$198,MATCH(B138,Liste!$I$7:$I$198,0)),\"\")","v":0},"C8",38,30,2]
[137,{"$f":"IFERROR(INDEX(Liste!$I$7:$I$198,MATCH(Recap!A139,Liste!$L$7:$L$198,0)),\"\")","v":"C9"},null,{"$f":"IFERROR(VLOOKUP($B139,'Partie 1'!$B$27:$D$218,2,0),\"\")","v":13},{"$f":"IFERROR(VLOOKUP($B139,'Partie 1'!$B$27:$D$218,3,0),\"\")","v":1},{"$f":"IFERROR(VLOOKUP($B139,'Partie 2'!$B$27:$D$218,2,0),\"\")","v":13},{"$f":"IFERROR(VLOOKUP($B139,'Partie 2'!$B$27:$D$218,3,0),\"\")","v":11},{"$f":"IFERROR(VLOOKUP($B139,'Partie 3'!$B$27:$D$218,2,0),\"\")","v":13},{"$f":"IFERROR(VLOOKUP($B139,'Partie 3'!$B$27:$D$218,3,0),\"\")","v":10},{"$f":"IFERROR(VLOOKUP($B139,'Partie 4'!$B$27:$D$218,2,0),\"\")","v":13},{"$f":"IFERROR(VLOOKUP($B139,'Partie 4'!$B$27:$D$218,3,0),\"\")","v":2},"C9",52,24,4,null,{"$f":"IFERROR(INDEX(Liste!$G$7:$G$198,MATCH(B139,Liste!$I$7:$I$198,0)),\"\")","v":0},"C9",52,24,4]
[138,{"$f":"IFERROR(INDEX(Liste!$I$7:$I$198,MATCH(Recap!A140,Liste!$L$7:$L$198,0)),\"\")","v":"C10"},null,{"$f":"IFERROR(VLOOKUP($B140,'Partie 1'!$B$27:$D$218,2,0),\"\")","v":1},{"$f":"IFERROR(VLOOKUP($B140,'Partie 1'!$B$27:$D$218,3,0),\"\")","v":13},{"$f":"IFERROR(VLOOKUP($B140,'Partie 2'!$B$27:$D$218,2,0),\"\")","v":13},{"$f":"IFERROR(VLOOKUP($B140,'Partie 2'!$B$27:$D$218,3,0),\"\")","v":11},{"$f":"IFERROR(VLOOKUP($B140,'Partie 3'!$B$27:$D$218,2,0),\"\")","v":13},{"$f":"IFERROR(VLOOKUP($B140,'Partie 3'!$B$27:$D$218,3,0),\"\")","v":10},{"$f":"IFERROR(VLOOKUP($B140,'Partie 4'!$B$27:$D$218,2,0),\"\")","v":13},{"$f":"IFERROR(VLOOKUP($B140,'Partie 4'!$B$27:$D$218,3,0),\"\")","v":5},"C10",40,39,3,null,{"$f":"IFERROR(INDEX(Liste!$G$7:$G$198,MATCH(B140,Liste!$I$7:$I$198,0)),\"\")","v":0},"C10",40,39,3]
[139,{"$f":"IFERROR(INDEX(Liste!$I$7:$I$198,MATCH(Recap!A141,Liste!$L$7:$L$198,0)),\"\")","v":"C11"},null,{"$f":"IFERROR(VLOOKUP($B141,'Partie 1'!$B$27:$D$218,2,0),\"\")","v":8},{"$f":"IFERROR(VLOOKUP($B141,'Partie 1'!$B$27:$D$218,3,0),\"\")","v":13},{"$f":"IFERROR(VLOOKUP($B141,'Partie 2'!$B$27:$D$218,2,0),\"\")","v":11},{"$f":"IFERROR(VLOOKUP($B141,'Partie 2'!$B$27:$D$218,3,0),\"\")","v":13},{"$f":"IFERROR(VLOOKUP($B141,'Partie 3'!$B$27:$D$218,2,0),\"\")","v":13},{"$f":"IFERROR(VLOOKUP($B141,'Partie 3'!$B$27:$D$218,3,0),\"\")","v":10},{"$f":"IFERROR(VLOOKUP($B141,'Partie 4'!$B$27:$D$218,2,0),\"\")","v":13},{"$f":"IFERROR(VLOOKUP($B141,'Partie 4'!$B$27:$D$218,3,0),\"\")","v":5},"C11",45,41,2,null,{"$f":"IFERROR(INDEX(Liste!$G$7:$G$198,MATCH(B141,Liste!$I$7:$I$198,0)),\"\")","v":0},"C11",45,41,2]
[140,{"$f":"IFERROR(INDEX(Liste!$I$7:$I$198,MATCH(Recap!A142,Liste!$L$7:$L$198,0)),\"\")","v":"C12"},null,{"$f":"IFERROR(VLOOKUP($B142,'Partie 1'!$B$27:$D$218,2,0),\"\")","v":13},{"$f":"IFERROR(VLOOKUP($B142,'Partie 1'!$B$27:$D$218,3,0),\"\")","v":8},{"$f":"IFERROR(VLOOKUP($B142,'Partie 2'!$B$27:$D$218,2,0),\"\")","v":11},{"$f":"IFERROR(VLOOKUP($B142,'Partie 2'!$B$27:$D$218,3,0),\"\")","v":13},{"$f":"IFERROR(VLOOKUP($B142,'Partie 3'!$B$27:$D$218,2,0),\"\")","v":13},{"$f":"IFERROR(VLOOKUP($B142,'Partie 3'!$B$27:$D$218,3,0),\"\")","v":10},{"$f":"IFERROR(VLOOKUP($B142,'Partie 4'!$B$27:$D$218,2,0),\"\")","v":13},{"$f":"IFERROR(VLOOKUP($B142,'Partie 4'!$B$27:$D$218,3,0),\"\")","v":2},"C12",50,33,3,null,{"$f":"IFERROR(INDEX(Liste!$G$7:$G$198,MATCH(B142,Liste!$I$7:$I$198,0)),\"\")","v":0},"C12",50,33,3]
[141,{"$f":"IFERROR(INDEX(Liste!$I$7:$I$198,MATCH(Recap!A143,Liste!$L$7:$L$198,0)),\"\")","v":"C13"},null,{"$f":"IFERROR(VLOOKUP($B143,'Partie 1'!$B$27:$D$218,2,0),\"\")","v":7},{"$f":"IFERROR(VLOOKUP($B143,'Partie 1'!$B$27:$D$218,3,0),\"\")","v":13},{"$f":"IFERROR(VLOOKUP($B143,'Partie 2'!$B$27:$D$218,2,0),\"\")","v":13},{"$f":"IFERROR(VLOOKUP($B143,'Partie 2'!$B$27:$D$218,3,0),\"\")","v":2},{"$f":"IFERROR(VLOOKUP($B143,'Partie 3'!$B$27:$D$218,2,0),\"\")","v":10},{"$f":"IFERROR(VLOOKUP($B143,'Partie 3'!$B$27:$D$218,3,0),\"\")","v":13},{"$f":"IFERROR(VLOOKUP($B143,'Partie 4'!$B$27:$D$218,2,0),\"\")","v":13},{"$f":"IFERROR(VLOOKUP($B143,'Partie 4'!$B$27:$D$218,3,0),\"\")","v":5},"C13",43,33,2,null,{"$f":"IFERROR(INDEX(Liste!$G$7:$G$198,MATCH(B143,Liste!$I$7:$I$198,0)),\"\")","v":0},"C13",43,33,2]
[142,{"$f":"IFERROR(INDEX(Liste!$I$7:$I$198,MATCH(Recap!A144,Liste!$L$7:$L$198,0)),\"\")","v":"C14"},null,{"$f":"IFERROR(VLOOKUP($B144,'Partie 1'!$B$27:$D$218,2,0),\"\")","v":13},{"$f":"IFERROR(VLOOKUP($B144,'Partie 1'!$B$27:$D$218,3,0),\"\")","v":7},{"$f":"IFERROR(VLOOKUP($B144,'Partie 2'!$B$27:$D$218,2,0),\"\")","v":13},{"$f":"IFERROR(VLOOKUP($B144,'Partie 2'!$B$27:$D$218,3,0),\"\")","v":2},{"$f":"IFERROR(VLOOKUP($B144,'Partie 3'!$B$27:$D$218,2,0),\"\")","v":10},{"$f":"IFERROR(VLOOKUP($B144,'Partie 3'!$B$27:$D$218,3,0),\"\")","v":13},{"$f":"IFERROR(VLOOKUP($B144,'Partie 4'!$B$27:$D$218,2,0),\"\")","v":13},{"$f":"IFERROR(VLOOKUP($B144,'Partie 4'!$B$27:$D$218,3,0),\"\")","v":2},"C14",49,24,3,null,{"$f":"IFERROR(INDEX(Liste!$G$7:$G$198,MATCH(B144,Liste!$I$7:$I$198,0)),\"\")","v":0},"C14",49,24,3]
[143,{"$f":"IFERROR(INDEX(Liste!$I$7:$I$198,MATCH(Recap!A145,Liste!$L$7:$L$198,0)),\"\")","v":"C15"},null,{"$f":"IFERROR(VLOOKUP($B145,'Partie 1'!$B$27:$D$218,2,0),\"\")","v":13},{"$f":"IFERROR(VLOOKUP($B145,'Partie 1'!$B$27:$D$218,3,0),\"\")","v":4},{"$f":"IFERROR(VLOOKUP($B145,'Partie 2'!$B$27:$D$218,2,0),\"\")","v":2},{"$f":"IFERROR(VLOOKUP($B145,'Partie 2'!$B$27:$D$218,3,0),\"\")","v":13},{"$f":"IFERROR(VLOOKUP($B145,'Partie 3'!$B$27:$D$218,2,0),\"\")","v":10},{"$f":"IFERROR(VLOOKUP($B145,'Partie 3'!$B$27:$D$218,3,0),\"\")","v":13},{"$f":"IFERROR(VLOOKUP($B145,'Partie 4'!$B$27:$D$218,2,0),\"\")","v":13},{"$f":"IFERROR(VLOOKUP($B145,'Partie 4'!$B$27:$D$218,3,0),\"\")","v":2},"C15",38,32,2,null,{"$f":"IFERROR(INDEX(Liste!$G$7:$G$198,MATCH(B145,Liste!$I$7:$I$198,0)),\"\")","v":0},"C15",38,32,2]
[144,{"$f":"IFERROR(INDEX(Liste!$I$7:$I$198,MATCH(Recap!A146,Liste!$L$7:$L$198,0)),\"\")","v":"C16"},null,{"$f":"IFERROR(VLOOKUP($B146,'Partie 1'!$B$27:$D$218,2,0),\"\")","v":4},{"$f":"IFERROR(VLOOKUP($B146,'Partie 1'!$B$27:$D$218,3,0),\"\")","v":13},{"$f":"IFERROR(VLOOKUP($B146,'Partie 2'!$B$27:$D$218,2,0),\"\")","v":2},{"$f":"IFERROR(VLOOKUP($B146,'Partie 2'!$B$27:$D$218,3,0),\"\")","v":13},{"$f":"IFERROR(VLOOKUP($B146,'Partie 3'!$B$27:$D$218,2,0),\"\")","v":10},{"$f":"IFERROR(VLOOKUP($B146,'Partie 3'!$B$27:$D$218,3,0),\"\")","v":13},{"$f":"IFERROR(VLOOKUP($B146,'Partie 4'!$B$27:$D$218,2,0),\"\")","v":13},{"$f":"IFERROR(VLOOKUP($B146,'Partie 4'!$B$27:$D$218,3,0),\"\")","v":5},"C16",29,44,1,null,{"$f":"IFERROR(INDEX(Liste!$G$7:$G$198,MATCH(B146,Liste!$I$7:$I$198,0)),\"\")","v":0},"C16",29,44,1]
[145,{"$f":"IFERROR(INDEX(Liste!$I$7:$I$198,MATCH(Recap!A147,Liste!$L$7:$L$198,0)),\"\")","v":"C17"},null,{"$f":"IFERROR(VLOOKUP($B147,'Partie 1'!$B$27:$D$218,2,0),\"\")","v":13},{"$f":"IFERROR(VLOOKUP($B147,'Partie 1'!$B$27:$D$218,3,0),\"\")","v":2},{"$f":"IFERROR(VLOOKUP($B147,'Partie 2'!$B$27:$D$218,2,0),\"\")","v":5},{"$f":"IFERROR(VLOOKUP($B147,'Partie 2'!$B$27:$D$218,3,0),\"\")","v":13},{"$f":"IFERROR(VLOOKUP($B147,'Partie 3'!$B$27:$D$218,2,0),\"\")","v":13},{"$f":"IFERROR(VLOOKUP($B147,'Partie 3'!$B$27:$D$218,3,0),\"\")","v":11},{"$f":"IFERROR(VLOOKUP($B147,'Partie 4'!$B$27:$D$218,2,0),\"\")","v":13},{"$f":"IFERROR(VLOOKUP($B147,'Partie 4'!$B$27:$D$218,3,0),\"\")","v":10},"C17",44,36,3,null,{"$f":"IFERROR(INDEX(Liste!$G$7:$G$198,MATCH(B147,Liste!$I$7:$I$198,0)),\"\")","v":0},"C17",44,36,3]
[146,{"$f":"IFERROR(INDEX(Liste!$I$7:$I$198,MATCH(Recap!A148,Liste!$L$7:$L$198,0)),\"\")","v":"C18"},null,{"$f":"IFERROR(VLOOKUP($B148,'Partie 1'!$B$27:$D$218,2,0),\"\")","v":2},{"$f":"IFERROR(VLOOKUP($B148,'Partie 1'!$B$27:$D$218,3,0),\"\")","v":13},{"$f":"IFERROR(VLOOKUP($B148,'Partie 2'!$B$27:$D$218,2,0),\"\")","v":5},{"$f":"IFERROR(VLOOKUP($B148,'Partie 2'!$B$27:$D$218,3,0),\"\")","v":13},{"$f":"IFERROR(VLOOKUP($B148,'Partie 3'!$B$27:$D$218,2,0),\"\")","v":13},{"$f":"IFERROR(VLOOKUP($B148,'Partie 3'!$B$27:$D$218,3,0),\"\")","v":11},{"$f":"IFERROR(VLOOKUP($B148,'Partie 4'!$B$27:$D$218,2,0),\"\")","v":13},{"$f":"IFERROR(VLOOKUP($B148,'Partie 4'!$B$27:$D$218,3,0),\"\")","v":8},"C18",33,45,2,null,{"$f":"IFERROR(INDEX(Liste!$G$7:$G$198,MATCH(B148,Liste!$I$7:$I$198,0)),\"\")","v":0},"C18",33,45,2]
[147,{"$f":"IFERROR(INDEX(Liste!$I$7:$I$198,MATCH(Recap!A149,Liste!$L$7:$L$198,0)),\"\")","v":"C19"},null,{"$f":"IFERROR(VLOOKUP($B149,'Partie 1'!$B$27:$D$218,2,0),\"\")","v":10},{"$f":"IFERROR(VLOOKUP($B149,'Partie 1'!$B$27:$D$218,3,0),\"\")","v":13},{"$f":"IFERROR(VLOOKUP($B149,'Partie 2'!$B$27:$D$218,2,0),\"\")","v":13},{"$f":"IFERROR(VLOOKUP($B149,'Partie 2'!$B$27:$D$218,3,0),\"\")","v":5},{"$f":"IFERROR(VLOOKUP($B149,'Partie 3'!$B$27:$D$218,2,0),\"\")","v":13},{"$f":"IFERROR(VLOOKUP($B149,'Partie 3'!$B$27:$D$218,3,0),\"\")","v":11},{"$f":"IFERROR(VLOOKUP($B149,'Partie 4'!$B$27:$D$218,2,0),\"\")","v":13},{"$f":"IFERROR(VLOOKUP($B149,'Partie 4'!$B$27:$D$218,3,0),\"\")","v":8},"C19",49,37,3,null,{"$f":"IFERROR(INDEX(Liste!$G$7:$G$198,MATCH(B149,Liste!$I$7:$I$198,0)),\"\")","v":0},"C19",49,37,3]
[148,{"$f":"IFERROR(INDEX(Liste!$I$7:$I$198,MATCH(Recap!A150,Liste!$L$7:$L$198,0)),\"\")","v":"C20"},null,{"$f":"IFERROR(VLOOKUP($B150,'Partie 1'!$B$27:$D$218,2,0),\"\")","v":13},{"$f":"IFERROR(VLOOKUP($B150,'Partie 1'!$B$27:$D$218,3,0),\"\")","v":10},{"$f":"IFERROR(VLOOKUP($B150,'Partie 2'!$B$27:$D$218,2,0),\"\")","v":13},{"$f":"IFERROR(VLOOKUP($B150,'Partie 2'!$B$27:$D$218,3,0),\"\")","v":5},{"$f":"IFERROR(VLOOKUP($B150,'Partie 3'!$B$27:$D$218,2,0),\"\")","v":13},{"$f":"IFERROR(VLOOKUP($B150,'Partie 3'!$B$27:$D$218,3,0),\"\")","v":11},{"$f":"IFERROR(VLOOKUP($B150,'Partie 4'!$B$27:$D$218,2,0),\"\")","v":13},{"$f":"IFERROR(VLOOKUP($B150,'Partie 4'!$B$27:$D$218,3,0),\"\")","v":10},"C20",52,36,4,null,{"$f":"IFERROR(INDEX(Liste!$G$7:$G$198,MATCH(B150,Liste!$I$7:$I$198,0)),\"\")","v":0},"C20",52,36,4]
[149,{"$f":"IFERROR(INDEX(Liste!$I$7:$I$198,MATCH(Recap!A151,Liste!$L$7:$L$198,0)),\"\")","v":"C21"},null,{"$f":"IFERROR(VLOOKUP($B151,'Partie 1'!$B$27:$D$218,2,0),\"\")","v":11},{"$f":"IFERROR(VLOOKUP($B151,'Partie 1'!$B$27:$D$218,3,0),\"\")","v":13},{"$f":"IFERROR(VLOOKUP($B151,'Partie 2'!$B$27:$D$218,2,0),\"\")","v":13},{"$f":"IFERROR(VLOOKUP($B151,'Partie 2'!$B$27:$D$218,3,0),\"\")","v":8},{"$f":"IFERROR(VLOOKUP($B151,'Partie 3'!$B$27:$D$218,2,0),\"\")","v":11},{"$f":"IFERROR(VLOOKUP($B151,'Partie 3'!$B$27:$D$218,3,0),\"\")","v":13},{"$f":"IFERROR(VLOOKUP($B151,'Partie 4'!$B$27:$D$218,2,0),\"\")","v":13},{"$f":"IFERROR(VLOOKUP($B151,'Partie 4'!$B$27:$D$218,3,0),\"\")","v":8},"C21",48,42,2,null,{"$f":"IFERROR(INDEX(Liste!$G$7:$G$198,MATCH(B151,Liste!$I$7:$I$198,0)),\"\")","v":0},"C21",48,42,2]
[150,{"$f":"IFERROR(INDEX(Liste!$I$7:$I$198,MATCH(Recap!A152,Liste!$L$7:$L$198,0)),\"\")","v":"C22"},null,{"$f":"IFERROR(VLOOKUP($B152,'Partie 1'!$B$27:$D$218,2,0),\"\")","v":13},{"$f":"IFERROR(VLOOKUP($B152,'Partie 1'!$B$27:$D$218,3,0),\"\")","v":11},{"$f":"IFERROR(VLOOKUP($B152,'Partie 2'!$B$27:$D$218,2,0),\"\")","v":13},{"$f":"IFERROR(VLOOKUP($B152,'Partie 2'!$B$27:$D$218,3,0),\"\")","v":8},{"$f":"IFERROR(VLOOKUP($B152,'Partie 3'!$B$27:$D$218,2,0),\"\")","v":11},{"$f":"IFERROR(VLOOKUP($B152,'Partie 3'!$B$27:$D$218,3,0),\"\")","v":13},{"$f":"IFERROR(VLOOKUP($B152,'Partie 4'!$B$27:$D$218,2,0),\"\")","v":13},{"$f":"IFERROR(VLOOKUP($B152,'Partie 4'!$B$27:$D$218,3,0),\"\")","v":10},"C22",50,42,3,null,{"$f":"IFERROR(INDEX(Liste!$G$7:$G$198,MATCH(B152,Liste!$I$7:$I$198,0)),\"\")","v":0},"C22",50,42,3]
[151,{"$f":"IFERROR(INDEX(Liste!$I$7:$I$198,MATCH(Recap!A153,Liste!$L$7:$L$198,0)),\"\")","v":"C23"},null,{"$f":"IFERROR(VLOOKUP($B153,'Partie 1'!$B$27:$D$218,2,0),\"\")","v":2},{"$f":"IFERROR(VLOOKUP($B153,'Partie 1'!$B$27:$D$218,3,0),\"\")","v":13},{"$f":"IFERROR(VLOOKUP($B153,'Partie 2'!$B$27:$D$218,2,0),\"\")","v":8},{"$f":"IFERROR(VLOOKUP($B153,'Partie 2'!$B$27:$D$218,3,0),\"\")","v":13},{"$f":"IFERROR(VLOOKUP($B153,'Partie 3'!$B$27:$D$218,2,0),\"\")","v":11},{"$f":"IFERROR(VLOOKUP($B153,'Partie 3'!$B$27:$D$218,3,0),\"\")","v":13},{"$f":"IFERROR(VLOOKUP($B153,'Partie 4'!$B$27:$D$218,2,0),\"\")","v":13},{"$f":"IFERROR(VLOOKUP($B153,'Partie 4'!$B$27:$D$218,3,0),\"\")","v":8},"C23",34,47,1,null,{"$f":"IFERROR(INDEX(Liste!$G$7:$G$198,MATCH(B153,Liste!$I$7:$I$198,0)),\"\")","v":0},"C23",34,47,1]
[152,{"$f":"IFERROR(INDEX(Liste!$I$7:$I$198,MATCH(Recap!A154,Liste!$L$7:$L$198,0)),\"\")","v":"C24"},null,{"$f":"IFERROR(VLOOKUP($B154,'Partie 1'!$B$27:$D$218,2,0),\"\")","v":13},{"$f":"IFERROR(VLOOKUP($B154,'Partie 1'!$B$27:$D$218,3,0),\"\")","v":2},{"$f":"IFERROR(VLOOKUP($B154,'Partie 2'!$B$27:$D$218,2,0),\"\")","v":8},{"$f":"IFERROR(VLOOKUP($B154,'Partie 2'!$B$27:$D$218,3,0),\"\")","v":13},{"$f":"IFERROR(VLOOKUP($B154,'Partie 3'!$B$27:$D$218,2,0),\"\")","v":11},{"$f":"IFERROR(VLOOKUP($B154,'Partie 3'!$B$27:$D$218,3,0),\"\")","v":13},{"$f":"IFERROR(VLOOKUP($B154,'Partie 4'!$B$27:$D$218,2,0),\"\")","v":13},{"$f":"IFERROR(VLOOKUP($B154,'Partie 4'!$B$27:$D$218,3,0),\"\")","v":10},"C24",45,38,2,null,{"$f":"IFERROR(INDEX(Liste!$G$7:$G$198,MATCH(B154,Liste!$I$7:$I$198,0)),\"\")","v":0},"C24",45,38,2]
[153,{"$f":"IFERROR(INDEX(Liste!$I$7:$I$198,MATCH(Recap!A155,Liste!$L$7:$L$198,0)),\"\")","v":"C25"},null,{"$f":"IFERROR(VLOOKUP($B155,'Partie 1'!$B$27:$D$218,2,0),\"\")","v":13},{"$f":"IFERROR(VLOOKUP($B155,'Partie 1'!$B$27:$D$218,3,0),\"\")","v":5},{"$f":"IFERROR(VLOOKUP($B155,'Partie 2'!$B$27:$D$218,2,0),\"\")","v":13},{"$f":"IFERROR(VLOOKUP($B155,'Partie 2'!$B$27:$D$218,3,0),\"\")","v":7},{"$f":"IFERROR(VLOOKUP($B155,'Partie 3'!$B$27:$D$218,2,0),\"\")","v":13},{"$f":"IFERROR(VLOOKUP($B155,'Partie 3'!$B$27:$D$218,3,0),\"\")","v":2},{"$f":"IFERROR(VLOOKUP($B155,'Partie 4'!$B$27:$D$218,2,0),\"\")","v":10},{"$f":"IFERROR(VLOOKUP($B155,'Partie 4'!$B$27:$D$218,3,0),\"\")","v":13},"C25",49,27,3,null,{"$f":"IFERROR(INDEX(Liste!$G$7:$G$198,MATCH(B155,Liste!$I$7:$I$198,0)),\"\")","v":0},"C25",49,27,3]
[154,{"$f":"IFERROR(INDEX(Liste!$I$7:$I$198,MATCH(Recap!A156,Liste!$L$7:$L$198,0)),\"\")","v":"C26"},null,{"$f":"IFERROR(VLOOKUP($B156,'Partie 1'!$B$27:$D$218,2,0),\"\")","v":5},{"$f":"IFERROR(VLOOKUP($B156,'Partie 1'!$B$27:$D$218,3,0),\"\")","v":13},{"$f":"IFERROR(VLOOKUP($B156,'Partie 2'!$B$27:$D$218,2,0),\"\")","v":13},{"$f":"IFERROR(VLOOKUP($B156,'Partie 2'!$B$27:$D$218,3,0),\"\")","v":7},{"$f":"IFERROR(VLOOKUP($B156,'Partie 3'!$B$27:$D$218,2,0),\"\")","v":13},{"$f":"IFERROR(VLOOKUP($B156,'Partie 3'!$B$27:$D$218,3,0),\"\")","v":2},{"$f":"IFERROR(VLOOKUP($B156,'Partie 4'!$B$27:$D$218,2,0),\"\")","v":8},{"$f":"IFERROR(VLOOKUP($B156,'Partie 4'!$B$27:$D$218,3,0),\"\")","v":13},"C26",39,35,2,null,{"$f":"IFERROR(INDEX(Liste!$G$7:$G$198,MATCH(B156,Liste!$I$7:$I$198,0)),\"\")","v":0},"C26",39,35,2]
[155,{"$f":"IFERROR(INDEX(Liste!$I$7:$I$198,MATCH(Recap!A157,Liste!$L$7:$L$198,0)),\"\")","v":"C27"},null,{"$f":"IFERROR(VLOOKUP($B157,'Partie 1'!$B$27:$D$218,2,0),\"\")","v":8},{"$f":"IFERROR(VLOOKUP($B157,'Partie 1'!$B$27:$D$218,3,0),\"\")","v":13},{"$f":"IFERROR(VLOOKUP($B157,'Partie 2'!$B$27:$D$218,2,0),\"\")","v":7},{"$f":"IFERROR(VLOOKUP($B157,'Partie 2'!$B$27:$D$218,3,0),\"\")","v":13},{"$f":"IFERROR(VLOOKUP($B157,'Partie 3'!$B$27:$D$218,2,0),\"\")","v":13},{"$f":"IFERROR(VLOOKUP($B157,'Partie 3'!$B$27:$D$218,3,0),\"\")","v":2},{"$f":"IFERROR(VLOOKUP($B157,'Partie 4'!$B$27:$D$218,2,0),\"\")","v":8},{"$f":"IFERROR(VLOOKUP($B157,'Partie 4'!$B$27:$D$218,3,0),\"\")","v":13},"C27",36,41,1,null,{"$f":"IFERROR(INDEX(Liste!$G$7:$G$198,MATCH(B157,Liste!$I$7:$I$198,0)),\"\")","v":0},"C27",36,41,1]
[156,{"$f":"IFERROR(INDEX(Liste!$I$7:$I$198,MATCH(Recap!A158,Liste!$L$7:$L$198,0)),\"\")","v":"C28"},null,{"$f":"IFERROR(VLOOKUP($B158,'Partie 1'!$B$27:$D$218,2,0),\"\")","v":13},{"$f":"IFERROR(VLOOKUP($B158,'Partie 1'!$B$27:$D$218,3,0),\"\")","v":8},{"$f":"IFERROR(VLOOKUP($B158,'Partie 2'!$B$27:$D$218,2,0),\"\")","v":7},{"$f":"IFERROR(VLOOKUP($B158,'Partie 2'!$B$27:$D$218,3,0),\"\")","v":13},{"$f":"IFERROR(VLOOKUP($B158,'Partie 3'!$B$27:$D$218,2,0),\"\")","v":13},{"$f":"IFERROR(VLOOKUP($B158,'Partie 3'!$B$27:$D$218,3,0),\"\")","v":2},{"$f":"IFERROR(VLOOKUP($B158,'Partie 4'!$B$27:$D$218,2,0),\"\")","v":10},{"$f":"IFERROR(VLOOKUP($B158,'Partie 4'!$B$27:$D$218,3,0),\"\")","v":13},"C28",43,36,2,null,{"$f":"IFERROR(INDEX(Liste!$G$7:$G$198,MATCH(B158,Liste!$I$7:$I$198,0)),\"\")","v":0},"C28",43,36,2]
[157,{"$f":"IFERROR(INDEX(Liste!$I$7:$I$198,MATCH(Recap!A159,Liste!$L$7:$L$198,0)),\"\")","v":"C29"},null,{"$f":"IFERROR(VLOOKUP($B159,'Partie 1'!$B$27:$D$218,2,0),\"\")","v":7},{"$f":"IFERROR(VLOOKUP($B159,'Partie 1'!$B$27:$D$218,3,0),\"\")","v":13},{"$f":"IFERROR(VLOOKUP($B159,'Partie 2'!$B$27:$D$218,2,0),\"\")","v":4},{"$f":"IFERROR(VLOOKUP($B159,'Partie 2'!$B$27:$D$218,3,0),\"\")","v":13},{"$f":"IFERROR(VLOOKUP($B159,'Partie 3'!$B$27:$D$218,2,0),\"\")","v":2},{"$f":"IFERROR(VLOOKUP($B159,'Partie 3'!$B$27:$D$218,3,0),\"\")","v":13},{"$f":"IFERROR(VLOOKUP($B159,'Partie 4'!$B$27:$D$218,2,0),\"\")","v":8},{"$f":"IFERROR(VLOOKUP($B159,'Partie 4'!$B$27:$D$218,3,0),\"\")","v":13},"C29",21,52,0,null,{"$f":"IFERROR(INDEX(Liste!$G$7:$G$198,MATCH(B159,Liste!$I$7:$I$198,0)),\"\")","v":0},"C29",21,52,0]
[158,{"$f":"IFERROR(INDEX(Liste!$I$7:$I$198,MATCH(Recap!A160,Liste!$L$7:$L$198,0)),\"\")","v":"C30"},null,{"$f":"IFERROR(VLOOKUP($B160,'Partie 1'!$B$27:$D$218,2,0),\"\")","v":13},{"$f":"IFERROR(VLOOKUP($B160,'Partie 1'!$B$27:$D$218,3,0),\"\")","v":7},{"$f":"IFERROR(VLOOKUP($B160,'Partie 2'!$B$27:$D$218,2,0),\"\")","v":4},{"$f":"IFERROR(VLOOKUP($B160,'Partie 2'!$B$27:$D$218,3,0),\"\")","v":13},{"$f":"IFERROR(VLOOKUP($B160,'Partie 3'!$B$27:$D$218,2,0),\"\")","v":2},{"$f":"IFERROR(VLOOKUP($B160,'Partie 3'!$B$27:$D$218,3,0),\"\")","v":13},{"$f":"IFERROR(VLOOKUP($B160,'Partie 4'!$B$27:$D$218,2,0),\"\")","v":10},{"$f":"IFERROR(VLOOKUP($B160,'Partie 4'!$B$27:$D$218,3,0),\"\")","v":13},"C30",29,46,1,null,{"$f":"IFERROR(INDEX(Liste!$G$7:$G$198,MATCH(B160,Liste!$I$7:$I$198,0)),\"\")","v":0},"C30",29,46,1]
[159,{"$f":"IFERROR(INDEX(Liste!$I$7:$I$198,MATCH(Recap!A161,Liste!$L$7:$L$198,0)),\"\")","v":"C31"},null,{"$f":"IFERROR(VLOOKUP($B161,'Partie 1'!$B$27:$D$218,2,0),\"\")","v":13},{"$f":"IFERROR(VLOOKUP($B161,'Partie 1'!$B$27:$D$218,3,0),\"\")","v":4},{"$f":"IFERROR(VLOOKUP($B161,'Partie 2'!$B$27:$D$218,2,0),\"\")","v":13},{"$f":"IFERROR(VLOOKUP($B161,'Partie 2'!$B$27:$D$218,3,0),\"\")","v":4},{"$f":"IFERROR(VLOOKUP($B161,'Partie 3'!$B$27:$D$218,2,0),\"\")","v":2},{"$f":"IFERROR(VLOOKUP($B161,'Partie 3'!$B$27:$D$218,3,0),\"\")","v":13},{"$f":"IFERROR(VLOOKUP($B161,'Partie 4'!$B$27:$D$218,2,0),\"\")","v":10},{"$f":"IFERROR(VLOOKUP($B161,'Partie 4'!$B$27:$D$218,3,0),\"\")","v":13},"C31",38,34,2,null,{"$f":"IFERROR(INDEX(Liste!$G$7:$G$198,MATCH(B161,Liste!$I$7:$I$198,0)),\"\")","v":0},"C31",38,34,2]
[160,{"$f":"IFERROR(INDEX(Liste!$I$7:$I$198,MATCH(Recap!A162,Liste!$L$7:$L$198,0)),\"\")","v":"C32"},null,{"$f":"IFERROR(VLOOKUP($B162,'Partie 1'!$B$27:$D$218,2,0),\"\")","v":4},{"$f":"IFERROR(VLOOKUP($B162,'Partie 1'!$B$27:$D$218,3,0),\"\")","v":13},{"$f":"IFERROR(VLOOKUP($B162,'Partie 2'!$B$27:$D$218,2,0),\"\")","v":13},{"$f":"IFERROR(VLOOKUP($B162,'Partie 2'!$B$27:$D$218,3,0),\"\")","v":4},{"$f":"IFERROR(VLOOKUP($B162,'Partie 3'!$B$27:$D$218,2,0),\"\")","v":2},{"$f":"IFERROR(VLOOKUP($B162,'Partie 3'!$B$27:$D$218,3,0),\"\")","v":13},{"$f":"IFERROR(VLOOKUP($B162,'Partie 4'!$B$27:$D$218,2,0),\"\")","v":8},{"$f":"IFERROR(VLOOKUP($B162,'Partie 4'!$B$27:$D$218,3,0),\"\")","v":13},"C32",27,43,1,null,{"$f":"IFERROR(INDEX(Liste!$G$7:$G$198,MATCH(B162,Liste!$I$7:$I$198,0)),\"\")","v":0},"C32",27,43,1]
[161,{"$f":"IFERROR(INDEX(Liste!$I$7:$I$198,MATCH(Recap!A163,Liste!$L$7:$L$198,0)),\"\")","v":"C33"},null,{"$f":"IFERROR(VLOOKUP($B163,'Partie 1'!$B$27:$D$218,2,0),\"\")","v":2},{"$f":"IFERROR(VLOOKUP($B163,'Partie 1'!$B$27:$D$218,3,0),\"\")","v":13},{"$f":"IFERROR(VLOOKUP($B163,'Partie 2'!$B$27:$D$218,2,0),\"\")","v":2},{"$f":"IFERROR(VLOOKUP($B163,'Partie 2'!$B$27:$D$218,3,0),\"\")","v":13},{"$f":"IFERROR(VLOOKUP($B163,'Partie 3'!$B$27:$D$218,2,0),\"\")","v":5},{"$f":"IFERROR(VLOOKUP($B163,'Partie 3'!$B$27:$D$218,3,0),\"\")","v":13},{"$f":"IFERROR(VLOOKUP($B163,'Partie 4'!$B$27:$D$218,2,0),\"\")","v":13},{"$f":"IFERROR(VLOOKUP($B163,'Partie 4'!$B$27:$D$218,3,0),\"\")","v":7},"C33",22,46,1,null,{"$f":"IFERROR(INDEX(Liste!$G$7:$G$198,MATCH(B163,Liste!$I$7:$I$198,0)),\"\")","v":0},"C33",22,46,1]
[162,{"$f":"IFERROR(INDEX(Liste!$I$7:$I$198,MATCH(Recap!A164,Liste!$L$7:$L$198,0)),\"\")","v":"C34"},null,{"$f":"IFERROR(VLOOKUP($B164,'Partie 1'!$B$27:$D$218,2,0),\"\")","v":13},{"$f":"IFERROR(VLOOKUP($B164,'Partie 1'!$B$27:$D$218,3,0),\"\")","v":2},{"$f":"IFERROR(VLOOKUP($B164,'Partie 2'!$B$27:$D$218,2,0),\"\")","v":2},{"$f":"IFERROR(VLOOKUP($B164,'Partie 2'!$B$27:$D$218,3,0),\"\")","v":13},{"$f":"IFERROR(VLOOKUP($B164,'Partie 3'!$B$27:$D$218,2,0),\"\")","v":5},{"$f":"IFERROR(VLOOKUP($B164,'Partie 3'!$B$27:$D$218,3,0),\"\")","v":13},{"$f":"IFERROR(VLOOKUP($B164,'Partie 4'!$B$27:$D$218,2,0),\"\")","v":13},{"$f":"IFERROR(VLOOKUP($B164,'Partie 4'!$B$27:$D$218,3,0),\"\")","v":11},"C34",33,39,2,null,{"$f":"IFERROR(INDEX(Liste!$G$7:$G$198,MATCH(B164,Liste!$I$7:$I$198,0)),\"\")","v":0},"C34",33,39,2]
[163,{"$f":"IFERROR(INDEX(Liste!$I$7:$I$198,MATCH(Recap!A165,Liste!$L$7:$L$198,0)),\"\")","v":"C35"},null,{"$f":"IFERROR(VLOOKUP($B165,'Partie 1'!$B$27:$D$218,2,0),\"\")","v":13},{"$f":"IFERROR(VLOOKUP($B165,'Partie 1'!$B$27:$D$218,3,0),\"\")","v":10},{"$f":"IFERROR(VLOOKUP($B165,'Partie 2'!$B$27:$D$218,2,0),\"\")","v":13},{"$f":"IFERROR(VLOOKUP($B165,'Partie 2'!$B$27:$D$218,3,0),\"\")","v":2},{"$f":"IFERROR(VLOOKUP($B165,'Partie 3'!$B$27:$D$218,2,0),\"\")","v":5},{"$f":"IFERROR(VLOOKUP($B165,'Partie 3'!$B$27:$D$218,3,0),\"\")","v":13},{"$f":"IFERROR(VLOOKUP($B165,'Partie 4'!$B$27:$D$218,2,0),\"\")","v":13},{"$f":"IFERROR(VLOOKUP($B165,'Partie 4'!$B$27:$D$218,3,0),\"\")","v":11},"C35",44,36,3,null,{"$f":"IFERROR(INDEX(Liste!$G$7:$G$198,MATCH(B165,Liste!$I$7:$I$198,0)),\"\")","v":0},"C35",44,36,3]
[164,{"$f":"IFERROR(INDEX(Liste!$I$7:$I$198,MATCH(Recap!A166,Liste!$L$7:$L$198,0)),\"\")","v":"C36"},null,{"$f":"IFERROR(VLOOKUP($B166,'Partie 1'!$B$27:$D$218,2,0),\"\")","v":10},{"$f":"IFERROR(VLOOKUP($B166,'Partie 1'!$B$27:$D$218,3,0),\"\")","v":13},{"$f":"IFERROR(VLOOKUP($B166,'Partie 2'!$B$27:$D$218,2,0),\"\")","v":13},{"$f":"IFERROR(VLOOKUP($B166,'Partie 2'!$B$27:$D$218,3,0),\"\")","v":2},{"$f":"IFERROR(VLOOKUP($B166,'Partie 3'!$B$27:$D$218,2,0),\"\")","v":5},{"$f":"IFERROR(VLOOKUP($B166,'Partie 3'!$B$27:$D$218,3,0),\"\")","v":13},{"$f":"IFERROR(VLOOKUP($B166,'Partie 4'!$B$27:$D$218,2,0),\"\")","v":13},{"$f":"IFERROR(VLOOKUP($B166,'Partie 4'!$B$27:$D$218,3,0),\"\")","v":7},"C36",41,35,2,null,{"$f":"IFERROR(INDEX(Liste!$G$7:$G$198,MATCH(B166,Liste!$I$7:$I$198,0)),\"\")","v":0},"C36",41,35,2]
[165,{"$f":"IFERROR(INDEX(Liste!$I$7:$I$198,MATCH(Recap!A167,Liste!$L$7:$L$198,0)),\"\")","v":"C37"},null,{"$f":"IFERROR(VLOOKUP($B167,'Partie 1'!$B$27:$D$218,2,0),\"\")","v":13},{"$f":"IFERROR(VLOOKUP($B167,'Partie 1'!$B$27:$D$218,3,0),\"\")","v":11},{"$f":"IFERROR(VLOOKUP($B167,'Partie 2'!$B$27:$D$218,2,0),\"\")","v":13},{"$f":"IFERROR(VLOOKUP($B167,'Partie 2'!$B$27:$D$218,3,0),\"\")","v":10},{"$f":"IFERROR(VLOOKUP($B167,'Partie 3'!$B$27:$D$218,2,0),\"\")","v":13},{"$f":"IFERROR(VLOOKUP($B167,'Partie 3'!$B$27:$D$218,3,0),\"\")","v":5},{"$f":"IFERROR(VLOOKUP($B167,'Partie 4'!$B$27:$D$218,2,0),\"\")","v":13},{"$f":"IFERROR(VLOOKUP($B167,'Partie 4'!$B$27:$D$218,3,0),\"\")","v":11},"C37",52,37,4,null,{"$f":"IFERROR(INDEX(Liste!$G$7:$G$198,MATCH(B167,Liste!$I$7:$I$198,0)),\"\")","v":0},"C37",52,37,4]
[166,{"$f":"IFERROR(INDEX(Liste!$I$7:$I$198,MATCH(Recap!A168,Liste!$L$7:$L$198,0)),\"\")","v":"C38"},null,{"$f":"IFERROR(VLOOKUP($B168,'Partie 1'!$B$27:$D$218,2,0),\"\")","v":11},{"$f":"IFERROR(VLOOKUP($B168,'Partie 1'!$B$27:$D$218,3,0),\"\")","v":13},{"$f":"IFERROR(VLOOKUP($B168,'Partie 2'!$B$27:$D$218,2,0),\"\")","v":13},{"$f":"IFERROR(VLOOKUP($B168,'Partie 2'!$B$27:$D$218,3,0),\"\")","v":10},{"$f":"IFERROR(VLOOKUP($B168,'Partie 3'!$B$27:$D$218,2,0),\"\")","v":13},{"$f":"IFERROR(VLOOKUP($B168,'Partie 3'!$B$27:$D$218,3,0),\"\")","v":5},{"$f":"IFERROR(VLOOKUP($B168,'Partie 4'!$B$27:$D$218,2,0),\"\")","v":13},{"$f":"IFERROR(VLOOKUP($B168,'Partie 4'!$B$27:$D$218,3,0),\"\")","v":7},"C38",50,35,3,null,{"$f":"IFERROR(INDEX(Liste!$G$7:$G$198,MATCH(B168,Liste!$I$7:$I$198,0)),\"\")","v":0},"C38",50,35,3]
[167,{"$f":"IFERROR(INDEX(Liste!$I$7:$I$198,MATCH(Recap!A169,Liste!$L$7:$L$198,0)),\"\")","v":"C39"},null,{"$f":"IFERROR(VLOOKUP($B169,'Partie 1'!$B$27:$D$218,2,0),\"\")","v":13},{"$f":"IFERROR(VLOOKUP($B169,'Partie 1'!$B$27:$D$218,3,0),\"\")","v":2},{"$f":"IFERROR(VLOOKUP($B169,'Partie 2'!$B$27:$D$218,2,0),\"\")","v":10},{"$f":"IFERROR(VLOOKUP($B169,'Partie 2'!$B$27:$D$218,3,0),\"\")","v":13},{"$f":"IFERROR(VLOOKUP($B169,'Partie 3'!$B$27:$D$218,2,0),\"\")","v":13},{"$f":"IFERROR(VLOOKUP($B169,'Partie 3'!$B$27:$D$218,3,0),\"\")","v":5},{"$f":"IFERROR(VLOOKUP($B169,'Partie 4'!$B$27:$D$218,2,0),\"\")","v":13},{"$f":"IFERROR(VLOOKUP($B169,'Partie 4'!$B$27:$D$218,3,0),\"\")","v":11},"C39",49,31,3,null,{"$f":"IFERROR(INDEX(Liste!$G$7:$G$198,MATCH(B169,Liste!$I$7:$I$198,0)),\"\")","v":0},"C39",49,31,3]
[168,{"$f":"IFERROR(INDEX(Liste!$I$7:$I$198,MATCH(Recap!A170,Liste!$L$7:$L$198,0)),\"\")","v":"C40"},null,{"$f":"IFERROR(VLOOKUP($B170,'Partie 1'!$B$27:$D$218,2,0),\"\")","v":2},{"$f":"IFERROR(VLOOKUP($B170,'Partie 1'!$B$27:$D$218,3,0),\"\")","v":13},{"$f":"IFERROR(VLOOKUP($B170,'Partie 2'!$B$27:$D$218,2,0),\"\")","v":10},{"$f":"IFERROR(VLOOKUP($B170,'Partie 2'!$B$27:$D$218,3,0),\"\")","v":13},{"$f":"IFERROR(VLOOKUP($B170,'Partie 3'!$B$27:$D$218,2,0),\"\")","v":13},{"$f":"IFERROR(VLOOKUP($B170,'Partie 3'!$B$27:$D$218,3,0),\"\")","v":5},{"$f":"IFERROR(VLOOKUP($B170,'Partie 4'!$B$27:$D$218,2,0),\"\")","v":13},{"$f":"IFERROR(VLOOKUP($B170,'Partie 4'!$B$27:$D$218,3,0),\"\")","v":7},"C40",38,38,2,null,{"$f":"IFERROR(INDEX(Liste!$G$7:$G$198,MATCH(B170,Liste!$I$7:$I$198,0)),\"\")","v":0},"C40",38,38,2]
[169,{"$f":"IFERROR(INDEX(Liste!$I$7:$I$198,MATCH(Recap!A171,Liste!$L$7:$L$198,0)),\"\")","v":"C41"},null,{"$f":"IFERROR(VLOOKUP($B171,'Partie 1'!$B$27:$D$218,2,0),\"\")","v":5},{"$f":"IFERROR(VLOOKUP($B171,'Partie 1'!$B$27:$D$218,3,0),\"\")","v":13},{"$f":"IFERROR(VLOOKUP($B171,'Partie 2'!$B$27:$D$218,2,0),\"\")","v":13},{"$f":"IFERROR(VLOOKUP($B171,'Partie 2'!$B$27:$D$218,3,0),\"\")","v":11},{"$f":"IFERROR(VLOOKUP($B171,'Partie 3'!$B$27:$D$218,2,0),\"\")","v":13},{"$f":"IFERROR(VLOOKUP($B171,'Partie 3'!$B$27:$D$218,3,0),\"\")","v":8},{"$f":"IFERROR(VLOOKUP($B171,'Partie 4'!$B$27:$D$218,2,0),\"\")","v":7},{"$f":"IFERROR(VLOOKUP($B171,'Partie 4'!$B$27:$D$218,3,0),\"\")","v":13},"C41",38,45,2,null,{"$f":"IFERROR(INDEX(Liste!$G$7:$G$198,MATCH(B171,Liste!$I$7:$I$198,0)),\"\")","v":0},"C41",38,45,2]
[170,{"$f":"IFERROR(INDEX(Liste!$I$7:$I$198,MATCH(Recap!A172,Liste!$L$7:$L$198,0)),\"\")","v":"C42"},null,{"$f":"IFERROR(VLOOKUP($B172,'Partie 1'!$B$27:$D$218,2,0),\"\")","v":13},{"$f":"IFERROR(VLOOKUP($B172,'Partie 1'!$B$27:$D$218,3,0),\"\")","v":5},{"$f":"IFERROR(VLOOKUP($B172,'Partie 2'!$B$27:$D$218,2,0),\"\")","v":13},{"$f":"IFERROR(VLOOKUP($B172,'Partie 2'!$B$27:$D$218,3,0),\"\")","v":11},{"$f":"IFERROR(VLOOKUP($B172,'Partie 3'!$B$27:$D$218,2,0),\"\")","v":13},{"$f":"IFERROR(VLOOKUP($B172,'Partie 3'!$B$27:$D$218,3,0),\"\")","v":8},{"$f":"IFERROR(VLOOKUP($B172,'Partie 4'!$B$27:$D$218,2,0),\"\")","v":11},{"$f":"IFERROR(VLOOKUP($B172,'Partie 4'!$B$27:$D$218,3,0),\"\")","v":13},"C42",50,37,3,null,{"$f":"IFERROR(INDEX(Liste!$G$7:$G$198,MATCH(B172,Liste!$I$7:$I$198,0)),\"\")","v":0},"C42",50,37,3]
[171,{"$f":"IFERROR(INDEX(Liste!$I$7:$I$198,MATCH(Recap!A173,Liste!$L$7:$L$198,0)),\"\")","v":"C43"},null,{"$f":"IFERROR(VLOOKUP($B173,'Partie 1'!$B$27:$D$218,2,0),\"\")","v":13},{"$f":"IFERROR(VLOOKUP($B173,'Partie 1'!$B$27:$D$218,3,0),\"\")","v":8},{"$f":"IFERROR(VLOOKUP($B173,'Partie 2'!$B$27:$D$218,2,0),\"\")","v":11},{"$f":"IFERROR(VLOOKUP($B173,'Partie 2'!$B$27:$D$218,3,0),\"\")","v":13},{"$f":"IFERROR(VLOOKUP($B173,'Partie 3'!$B$27:$D$218,2,0),\"\")","v":13},{"$f":"IFERROR(VLOOKUP($B173,'Partie 3'!$B$27:$D$218,3,0),\"\")","v":8},{"$f":"IFERROR(VLOOKUP($B173,'Partie 4'!$B$27:$D$218,2,0),\"\")","v":11},{"$f":"IFERROR(VLOOKUP($B173,'Partie 4'!$B$27:$D$218,3,0),\"\")","v":13},"C43",48,42,2,null,{"$f":"IFERROR(INDEX(Liste!$G$7:$G$198,MATCH(B173,Liste!$I$7:$I$198,0)),\"\")","v":0},"C43",48,42,2]
[172,{"$f":"IFERROR(INDEX(Liste!$I$7:$I$198,MATCH(Recap!A174,Liste!$L$7:$L$198,0)),\"\")","v":"C44"},null,{"$f":"IFERROR(VLOOKUP($B174,'Partie 1'!$B$27:$D$218,2,0),\"\")","v":8},{"$f":"IFERROR(VLOOKUP($B174,'Partie 1'!$B$27:$D$218,3,0),\"\")","v":13},{"$f":"IFERROR(VLOOKUP($B174,'Partie 2'!$B$27:$D$218,2,0),\"\")","v":11},{"$f":"IFERROR(VLOOKUP($B174,'Partie 2'!$B$27:$D$218,3,0),\"\")","v":13},{"$f":"IFERROR(VLOOKUP($B174,'Partie 3'!$B$27:$D$218,2,0),\"\")","v":13},{"$f":"IFERROR(VLOOKUP($B174,'Partie 3'!$B$27:$D$218,3,0),\"\")","v":8},{"$f":"IFERROR(VLOOKUP($B174,'Partie 4'!$B$27:$D$218,2,0),\"\")","v":7},{"$f":"IFERROR(VLOOKUP($B174,'Partie 4'!$B$27:$D$218,3,0),\"\")","v":13},"C44",39,47,1,null,{"$f":"IFERROR(INDEX(Liste!$G$7:$G$198,MATCH(B174,Liste!$I$7:$I$198,0)),\"\")","v":0},"C44",39,47,1]
[173,{"$f":"IFERROR(INDEX(Liste!$I$7:$I$198,MATCH(Recap!A175,Liste!$L$7:$L$198,0)),\"\")","v":"C45"},null,{"$f":"IFERROR(VLOOKUP($B175,'Partie 1'!$B$27:$D$218,2,0),\"\")","v":13},{"$f":"IFERROR(VLOOKUP($B175,'Partie 1'!$B$27:$D$218,3,0),\"\")","v":7},{"$f":"IFERROR(VLOOKUP($B175,'Partie 2'!$B$27:$D$218,2,0),\"\")","v":13},{"$f":"IFERROR(VLOOKUP($B175,'Partie 2'!$B$27:$D$218,3,0),\"\")","v":2},{"$f":"IFERROR(VLOOKUP($B175,'Partie 3'!$B$27:$D$218,2,0),\"\")","v":8},{"$f":"IFERROR(VLOOKUP($B175,'Partie 3'!$B$27:$D$218,3,0),\"\")","v":13},{"$f":"IFERROR(VLOOKUP($B175,'Partie 4'!$B$27:$D$218,2,0),\"\")","v":11},{"$f":"IFERROR(VLOOKUP($B175,'Partie 4'!$B$27:$D$218,3,0),\"\")","v":13},"C45",45,35,2,null,{"$f":"IFERROR(INDEX(Liste!$G$7:$G$198,MATCH(B175,Liste!$I$7:$I$198,0)),\"\")","v":0},"C45",45,35,2]
[174,{"$f":"IFERROR(INDEX(Liste!$I$7:$I$198,MATCH(Recap!A176,Liste!$L$7:$L$198,0)),\"\")","v":"C46"},null,{"$f":"IFERROR(VLOOKUP($B176,'Partie 1'!$B$27:$D$218,2,0),\"\")","v":7},{"$f":"IFERROR(VLOOKUP($B176,'Partie 1'!$B$27:$D$218,3,0),\"\")","v":13},{"$f":"IFERROR(VLOOKUP($B176,'Partie 2'!$B$27:$D$218,2,0),\"\")","v":13},{"$f":"IFERROR(VLOOKUP($B176,'Partie 2'!$B$27:$D$218,3,0),\"\")","v":2},{"$f":"IFERROR(VLOOKUP($B176,'Partie 3'!$B$27:$D$218,2,0),\"\")","v":8},{"$f":"IFERROR(VLOOKUP($B176,'Partie 3'!$B$27:$D$218,3,0),\"\")","v":13},{"$f":"IFERROR(VLOOKUP($B176,'Partie 4'!$B$27:$D$218,2,0),\"\")","v":7},{"$f":"IFERROR(VLOOKUP($B176,'Partie 4'!$B$27:$D$218,3,0),\"\")","v":13},"C46",35,41,1,null,{"$f":"IFERROR(INDEX(Liste!$G$7:$G$198,MATCH(B176,Liste!$I$7:$I$198,0)),\"\")","v":0},"C46",35,41,1]
[175,{"$f":"IFERROR(INDEX(Liste!$I$7:$I$198,MATCH(Recap!A177,Liste!$L$7:$L$198,0)),\"\")","v":"C47"},null,{"$f":"IFERROR(VLOOKUP($B177,'Partie 1'!$B$27:$D$218,2,0),\"\")","v":4},{"$f":"IFERROR(VLOOKUP($B177,'Partie 1'!$B$27:$D$218,3,0),\"\")","v":13},{"$f":"IFERROR(VLOOKUP($B177,'Partie 2'!$B$27:$D$218,2,0),\"\")","v":2},{"$f":"IFERROR(VLOOKUP($B177,'Partie 2'!$B$27:$D$218,3,0),\"\")","v":13},{"$f":"IFERROR(VLOOKUP($B177,'Partie 3'!$B$27:$D$218,2,0),\"\")","v":8},{"$f":"IFERROR(VLOOKUP($B177,'Partie 3'!$B$27:$D$218,3,0),\"\")","v":13},{"$f":"IFERROR(VLOOKUP($B177,'Partie 4'!$B$27:$D$218,2,0),\"\")","v":7},{"$f":"IFERROR(VLOOKUP($B177,'Partie 4'!$B$27:$D$218,3,0),\"\")","v":13},"C47",21,52,0,null,{"$f":"IFERROR(INDEX(Liste!$G$7:$G$198,MATCH(B177,Liste!$I$7:$I$198,0)),\"\")","v":0},"C47",21,52,0]
[176,{"$f":"IFERROR(INDEX(Liste!$I$7:$I$198,MATCH(Recap!A178,Liste!$L$7:$L$198,0)),\"\")","v":"C48"},null,{"$f":"IFERROR(VLOOKUP($B178,'Partie 1'!$B$27:$D$218,2,0),\"\")","v":13},{"$f":"IFERROR(VLOOKUP($B178,'Partie 1'!$B$27:$D$218,3,0),\"\")","v":4},{"$f":"IFERROR(VLOOKUP($B178,'Partie 2'!$B$27:$D$218,2,0),\"\")","v":2},{"$f":"IFERROR(VLOOKUP($B178,'Partie 2'!$B$27:$D$218,3,0),\"\")","v":13},{"$f":"IFERROR(VLOOKUP($B178,'Partie 3'!$B$27:$D$218,2,0),\"\")","v":8},{"$f":"IFERROR(VLOOKUP($B178,'Partie 3'!$B$27:$D$218,3,0),\"\")","v":13},{"$f":"IFERROR(VLOOKUP($B178,'Partie 4'!$B$27:$D$218,2,0),\"\")","v":11},{"$f":"IFERROR(VLOOKUP($B178,'Partie 4'!$B$27:$D$218,3,0),\"\")","v":13},"C48",34,43,1,null,{"$f":"IFERROR(INDEX(Liste!$G$7:$G$198,MATCH(B178,Liste!$I$7:$I$198,0)),\"\")","v":0},"C48",34,43,1]
[177,{"$f":"IFERROR(INDEX(Liste!$I$7:$I$198,MATCH(Recap!A179,Liste!$L$7:$L$198,0)),\"\")","v":"C49"},null,{"$f":"IFERROR(VLOOKUP($B179,'Partie 1'!$B$27:$D$218,2,0),\"\")","v":13},{"$f":"IFERROR(VLOOKUP($B179,'Partie 1'!$B$27:$D$218,3,0),\"\")","v":2},{"$f":"IFERROR(VLOOKUP($B179,'Partie 2'!$B$27:$D$218,2,0),\"\")","v":5},{"$f":"IFERROR(VLOOKUP($B179,'Partie 2'!$B$27:$D$218,3,0),\"\")","v":13},{"$f":"IFERROR(VLOOKUP($B179,'Partie 3'!$B$27:$D$218,2,0),\"\")","v":13},{"$f":"IFERROR(VLOOKUP($B179,'Partie 3'!$B$27:$D$218,3,0),\"\")","v":7},{"$f":"IFERROR(VLOOKUP($B179,'Partie 4'!$B$27:$D$218,2,0),\"\")","v":13},{"$f":"IFERROR(VLOOKUP($B179,'Partie 4'!$B$27:$D$218,3,0),\"\")","v":2},"C49",44,24,3,null,{"$f":"IFERROR(INDEX(Liste!$G$7:$G$198,MATCH(B179,Liste!$I$7:$I$198,0)),\"\")","v":0},"C49",44,24,3]
[178,{"$f":"IFERROR(INDEX(Liste!$I$7:$I$198,MATCH(Recap!A180,Liste!$L$7:$L$198,0)),\"\")","v":"C50"},null,{"$f":"IFERROR(VLOOKUP($B180,'Partie 1'!$B$27:$D$218,2,0),\"\")","v":2},{"$f":"IFERROR(VLOOKUP($B180,'Partie 1'!$B$27:$D$218,3,0),\"\")","v":13},{"$f":"IFERROR(VLOOKUP($B180,'Partie 2'!$B$27:$D$218,2,0),\"\")","v":5},{"$f":"IFERROR(VLOOKUP($B180,'Partie 2'!$B$27:$D$218,3,0),\"\")","v":13},{"$f":"IFERROR(VLOOKUP($B180,'Partie 3'!$B$27:$D$218,2,0),\"\")","v":13},{"$f":"IFERROR(VLOOKUP($B180,'Partie 3'!$B$27:$D$218,3,0),\"\")","v":7},{"$f":"IFERROR(VLOOKUP($B180,'Partie 4'!$B$27:$D$218,2,0),\"\")","v":4},{"$f":"IFERROR(VLOOKUP($B180,'Partie 4'!$B$27:$D$218,3,0),\"\")","v":13},"C50",24,46,1,null,{"$f":"IFERROR(INDEX(Liste!$G$7:$G$198,MATCH(B180,Liste!$I$7:$I$198,0)),\"\")","v":0},"C50",24,46,1]
[179,{"$f":"IFERROR(INDEX(Liste!$I$7:$I$198,MATCH(Recap!A181,Liste!$L$7:$L$198,0)),\"\")","v":"C51"},null,{"$f":"IFERROR(VLOOKUP($B181,'Partie 1'!$B$27:$D$218,2,0),\"\")","v":10},{"$f":"IFERROR(VLOOKUP($B181,'Partie 1'!$B$27:$D$218,3,0),\"\")","v":13},{"$f":"IFERROR(VLOOKUP($B181,'Partie 2'!$B$27:$D$218,2,0),\"\")","v":13},{"$f":"IFERROR(VLOOKUP($B181,'Partie 2'!$B$27:$D$218,3,0),\"\")","v":5},{"$f":"IFERROR(VLOOKUP($B181,'Partie 3'!$B$27:$D$218,2,0),\"\")","v":13},{"$f":"IFERROR(VLOOKUP($B181,'Partie 3'!$B$27:$D$218,3,0),\"\")","v":7},{"$f":"IFERROR(VLOOKUP($B181,'Partie 4'!$B$27:$D$218,2,0),\"\")","v":4},{"$f":"IFERROR(VLOOKUP($B181,'Partie 4'!$B$27:$D$218,3,0),\"\")","v":13},"C51",40,38,2,null,{"$f":"IFERROR(INDEX(Liste!$G$7:$G$198,MATCH(B181,Liste!$I$7:$I$198,0)),\"\")","v":0},"C51",40,38,2]
[180,{"$f":"IFERROR(INDEX(Liste!$I$7:$I$198,MATCH(Recap!A182,Liste!$L$7:$L$198,0)),\"\")","v":"C52"},null,{"$f":"IFERROR(VLOOKUP($B182,'Partie 1'!$B$27:$D$218,2,0),\"\")","v":13},{"$f":"IFERROR(VLOOKUP($B182,'Partie 1'!$B$27:$D$218,3,0),\"\")","v":10},{"$f":"IFERROR(VLOOKUP($B182,'Partie 2'!$B$27:$D$218,2,0),\"\")","v":13},{"$f":"IFERROR(VLOOKUP($B182,'Partie 2'!$B$27:$D$218,3,0),\"\")","v":5},{"$f":"IFERROR(VLOOKUP($B182,'Partie 3'!$B$27:$D$218,2,0),\"\")","v":13},{"$f":"IFERROR(VLOOKUP($B182,'Partie 3'!$B$27:$D$218,3,0),\"\")","v":7},{"$f":"IFERROR(VLOOKUP($B182,'Partie 4'!$B$27:$D$218,2,0),\"\")","v":13},{"$f":"IFERROR(VLOOKUP($B182,'Partie 4'!$B$27:$D$218,3,0),\"\")","v":2},"C52",52,24,4,null,{"$f":"IFERROR(INDEX(Liste!$G$7:$G$198,MATCH(B182,Liste!$I$7:$I$198,0)),\"\")","v":0},"C52",52,24,4]
[181,{"$f":"IFERROR(INDEX(Liste!$I$7:$I$198,MATCH(Recap!A183,Liste!$L$7:$L$198,0)),\"\")","v":"C53"},null,{"$f":"IFERROR(VLOOKUP($B183,'Partie 1'!$B$27:$D$218,2,0),\"\")","v":11},{"$f":"IFERROR(VLOOKUP($B183,'Partie 1'!$B$27:$D$218,3,0),\"\")","v":13},{"$f":"IFERROR(VLOOKUP($B183,'Partie 2'!$B$27:$D$218,2,0),\"\")","v":13},{"$f":"IFERROR(VLOOKUP($B183,'Partie 2'!$B$27:$D$218,3,0),\"\")","v":8},{"$f":"IFERROR(VLOOKUP($B183,'Partie 3'!$B$27:$D$218,2,0),\"\")","v":7},{"$f":"IFERROR(VLOOKUP($B183,'Partie 3'!$B$27:$D$218,3,0),\"\")","v":13},{"$f":"IFERROR(VLOOKUP($B183,'Partie 4'!$B$27:$D$218,2,0),\"\")","v":4},{"$f":"IFERROR(VLOOKUP($B183,'Partie 4'!$B$27:$D$218,3,0),\"\")","v":13},"C53",35,47,1,null,{"$f":"IFERROR(INDEX(Liste!$G$7:$G$198,MATCH(B183,Liste!$I$7:$I$198,0)),\"\")","v":0},"C53",35,47,1]
[182,{"$f":"IFERROR(INDEX(Liste!$I$7:$I$198,MATCH(Recap!A184,Liste!$L$7:$L$198,0)),\"\")","v":"C54"},null,{"$f":"IFERROR(VLOOKUP($B184,'Partie 1'!$B$27:$D$218,2,0),\"\")","v":13},{"$f":"IFERROR(VLOOKUP($B184,'Partie 1'!$B$27:$D$218,3,0),\"\")","v":11},{"$f":"IFERROR(VLOOKUP($B184,'Partie 2'!$B$27:$D$218,2,0),\"\")","v":13},{"$f":"IFERROR(VLOOKUP($B184,'Partie 2'!$B$27:$D$218,3,0),\"\")","v":8},{"$f":"IFERROR(VLOOKUP($B184,'Partie 3'!$B$27:$D$218,2,0),\"\")","v":7},{"$f":"IFERROR(VLOOKUP($B184,'Partie 3'!$B$27:$D$218,3,0),\"\")","v":13},{"$f":"IFERROR(VLOOKUP($B184,'Partie 4'!$B$27:$D$218,2,0),\"\")","v":13},{"$f":"IFERROR(VLOOKUP($B184,'Partie 4'!$B$27:$D$218,3,0),\"\")","v":2},"C54",46,34,3,null,{"$f":"IFERROR(INDEX(Liste!$G$7:$G$198,MATCH(B184,Liste!$I$7:$I$198,0)),\"\")","v":0},"C54",46,34,3]
[183,{"$f":"IFERROR(INDEX(Liste!$I$7:$I$198,MATCH(Recap!A185,Liste!$L$7:$L$198,0)),\"\")","v":"C55"},null,{"$f":"IFERROR(VLOOKUP($B185,'Partie 1'!$B$27:$D$218,2,0),\"\")","v":2},{"$f":"IFERROR(VLOOKUP($B185,'Partie 1'!$B$27:$D$218,3,0),\"\")","v":13},{"$f":"IFERROR(VLOOKUP($B185,'Partie 2'!$B$27:$D$218,2,0),\"\")","v":8},{"$f":"IFERROR(VLOOKUP($B185,'Partie 2'!$B$27:$D$218,3,0),\"\")","v":13},{"$f":"IFERROR(VLOOKUP($B185,'Partie 3'!$B$27:$D$218,2,0),\"\")","v":7},{"$f":"IFERROR(VLOOKUP($B185,'Partie 3'!$B$27:$D$218,3,0),\"\")","v":13},{"$f":"IFERROR(VLOOKUP($B185,'Partie 4'!$B$27:$D$218,2,0),\"\")","v":4},{"$f":"IFERROR(VLOOKUP($B185,'Partie 4'!$B$27:$D$218,3,0),\"\")","v":13},"C55",21,52,0,null,{"$f":"IFERROR(INDEX(Liste!$G$7:$G$198,MATCH(B185,Liste!$I$7:$I$198,0)),\"\")","v":0},"C55",21,52,0]
[184,{"$f":"IFERROR(INDEX(Liste!$I$7:$I$198,MATCH(Recap!A186,Liste!$L$7:$L$198,0)),\"\")","v":"C56"},null,{"$f":"IFERROR(VLOOKUP($B186,'Partie 1'!$B$27:$D$218,2,0),\"\")","v":13},{"$f":"IFERROR(VLOOKUP($B186,'Partie 1'!$B$27:$D$218,3,0),\"\")","v":2},{"$f":"IFERROR(VLOOKUP($B186,'Partie 2'!$B$27:$D$218,2,0),\"\")","v":8},{"$f":"IFERROR(VLOOKUP($B186,'Partie 2'!$B$27:$D$218,3,0),\"\")","v":13},{"$f":"IFERROR(VLOOKUP($B186,'Partie 3'!$B$27:$D$218,2,0),\"\")","v":7},{"$f":"IFERROR(VLOOKUP($B186,'Partie 3'!$B$27:$D$218,3,0),\"\")","v":13},{"$f":"IFERROR(VLOOKUP($B186,'Partie 4'!$B$27:$D$218,2,0),\"\")","v":13},{"$f":"IFERROR(VLOOKUP($B186,'Partie 4'!$B$27:$D$218,3,0),\"\")","v":2},"C56",41,30,2,null,{"$f":"IFERROR(INDEX(Liste!$G$7:$G$198,MATCH(B186,Liste!$I$7:$I$198,0)),\"\")","v":0},"C56",41,30,2]
[185,{"$f":"IFERROR(INDEX(Liste!$I$7:$I$198,MATCH(Recap!A187,Liste!$L$7:$L$198,0)),\"\")","v":"C57"},null,{"$f":"IFERROR(VLOOKUP($B187,'Partie 1'!$B$27:$D$218,2,0),\"\")","v":13},{"$f":"IFERROR(VLOOKUP($B187,'Partie 1'!$B$27:$D$218,3,0),\"\")","v":5},{"$f":"IFERROR(VLOOKUP($B187,'Partie 2'!$B$27:$D$218,2,0),\"\")","v":13},{"$f":"IFERROR(VLOOKUP($B187,'Partie 2'!$B$27:$D$218,3,0),\"\")","v":7},{"$f":"IFERROR(VLOOKUP($B187,'Partie 3'!$B$27:$D$218,2,0),\"\")","v":4},{"$f":"IFERROR(VLOOKUP($B187,'Partie 3'!$B$27:$D$218,3,0),\"\")","v":13},{"$f":"IFERROR(VLOOKUP($B187,'Partie 4'!$B$27:$D$218,2,0),\"\")","v":2},{"$f":"IFERROR(VLOOKUP($B187,'Partie 4'!$B$27:$D$218,3,0),\"\")","v":13},"C57",32,38,2,null,{"$f":"IFERROR(INDEX(Liste!$G$7:$G$198,MATCH(B187,Liste!$I$7:$I$198,0)),\"\")","v":0},"C57",32,38,2]
[186,{"$f":"IFERROR(INDEX(Liste!$I$7:$I$198,MATCH(Recap!A188,Liste!$L$7:$L$198,0)),\"\")","v":"C58"},null,{"$f":"IFERROR(VLOOKUP($B188,'Partie 1'!$B$27:$D$218,2,0),\"\")","v":5},{"$f":"IFERROR(VLOOKUP($B188,'Partie 1'!$B$27:$D$218,3,0),\"\")","v":13},{"$f":"IFERROR(VLOOKUP($B188,'Partie 2'!$B$27:$D$218,2,0),\"\")","v":13},{"$f":"IFERROR(VLOOKUP($B188,'Partie 2'!$B$27:$D$218,3,0),\"\")","v":7},{"$f":"IFERROR(VLOOKUP($B188,'Partie 3'!$B$27:$D$218,2,0),\"\")","v":4},{"$f":"IFERROR(VLOOKUP($B188,'Partie 3'!$B$27:$D$218,3,0),\"\")","v":13},{"$f":"IFERROR(VLOOKUP($B188,'Partie 4'!$B$27:$D$218,2,0),\"\")","v":13},{"$f":"IFERROR(VLOOKUP($B188,'Partie 4'!$B$27:$D$218,3,0),\"\")","v":4},"C58",35,37,2,null,{"$f":"IFERROR(INDEX(Liste!$G$7:$G$198,MATCH(B188,Liste!$I$7:$I$198,0)),\"\")","v":0},"C58",35,37,2]
[187,{"$f":"IFERROR(INDEX(Liste!$I$7:$I$198,MATCH(Recap!A189,Liste!$L$7:$L$198,0)),\"\")","v":"C59"},null,{"$f":"IFERROR(VLOOKUP($B189,'Partie 1'!$B$27:$D$218,2,0),\"\")","v":8},{"$f":"IFERROR(VLOOKUP($B189,'Partie 1'!$B$27:$D$218,3,0),\"\")","v":13},{"$f":"IFERROR(VLOOKUP($B189,'Partie 2'!$B$27:$D$218,2,0),\"\")","v":7},{"$f":"IFERROR(VLOOKUP($B189,'Partie 2'!$B$27:$D$218,3,0),\"\")","v":13},{"$f":"IFERROR(VLOOKUP($B189,'Partie 3'!$B$27:$D$218,2,0),\"\")","v":4},{"$f":"IFERROR(VLOOKUP($B189,'Partie 3'!$B$27:$D$218,3,0),\"\")","v":13},{"$f":"IFERROR(VLOOKUP($B189,'Partie 4'!$B$27:$D$218,2,0),\"\")","v":13},{"$f":"IFERROR(VLOOKUP($B189,'Partie 4'!$B$27:$D$218,3,0),\"\")","v":4},"C59",32,43,1,null,{"$f":"IFERROR(INDEX(Liste!$G$7:$G$198,MATCH(B189,Liste!$I$7:$I$198,0)),\"\")","v":0},"C59",32,43,1]
[188,{"$f":"IFERROR(INDEX(Liste!$I$7:$I$198,MATCH(Recap!A190,Liste!$L$7:$L$198,0)),\"\")","v":"C60"},null,{"$f":"IFERROR(VLOOKUP($B190,'Partie 1'!$B$27:$D$218,2,0),\"\")","v":13},{"$f":"IFERROR(VLOOKUP($B190,'Partie 1'!$B$27:$D$218,3,0),\"\")","v":8},{"$f":"IFERROR(VLOOKUP($B190,'Partie 2'!$B$27:$D$218,2,0),\"\")","v":7},{"$f":"IFERROR(VLOOKUP($B190,'Partie 2'!$B$27:$D$218,3,0),\"\")","v":13},{"$f":"IFERROR(VLOOKUP($B190,'Partie 3'!$B$27:$D$218,2,0),\"\")","v":4},{"$f":"IFERROR(VLOOKUP($B190,'Partie 3'!$B$27:$D$218,3,0),\"\")","v":13},{"$f":"IFERROR(VLOOKUP($B190,'Partie 4'!$B$27:$D$218,2,0),\"\")","v":2},{"$f":"IFERROR(VLOOKUP($B190,'Partie 4'!$B$27:$D$218,3,0),\"\")","v":13},"C60",26,47,1,null,{"$f":"IFERROR(INDEX(Liste!$G$7:$G$198,MATCH(B190,Liste!$I$7:$I$198,0)),\"\")","v":0},"C60",26,47,1]
[189,{"$f":"IFERROR(INDEX(Liste!$I$7:$I$198,MATCH(Recap!A191,Liste!$L$7:$L$198,0)),\"\")","v":"C61"},null,{"$f":"IFERROR(VLOOKUP($B191,'Partie 1'!$B$27:$D$218,2,0),\"\")","v":7},{"$f":"IFERROR(VLOOKUP($B191,'Partie 1'!$B$27:$D$218,3,0),\"\")","v":13},{"$f":"IFERROR(VLOOKUP($B191,'Partie 2'!$B$27:$D$218,2,0),\"\")","v":4},{"$f":"IFERROR(VLOOKUP($B191,'Partie 2'!$B$27:$D$218,3,0),\"\")","v":13},{"$f":"IFERROR(VLOOKUP($B191,'Partie 3'!$B$27:$D$218,2,0),\"\")","v":13},{"$f":"IFERROR(VLOOKUP($B191,'Partie 3'!$B$27:$D$218,3,0),\"\")","v":4},{"$f":"IFERROR(VLOOKUP($B191,'Partie 4'!$B$27:$D$218,2,0),\"\")","v":13},{"$f":"IFERROR(VLOOKUP($B191,'Partie 4'!$B$27:$D$218,3,0),\"\")","v":4},"C61",37,34,2,null,{"$f":"IFERROR(INDEX(Liste!$G$7:$G$198,MATCH(B191,Liste!$I$7:$I$198,0)),\"\")","v":0},"C61",37,34,2]
[190,{"$f":"IFERROR(INDEX(Liste!$I$7:$I$198,MATCH(Recap!A192,Liste!$L$7:$L$198,0)),\"\")","v":"C62"},null,{"$f":"IFERROR(VLOOKUP($B192,'Partie 1'!$B$27:$D$218,2,0),\"\")","v":13},{"$f":"IFERROR(VLOOKUP($B192,'Partie 1'!$B$27:$D$218,3,0),\"\")","v":7},{"$f":"IFERROR(VLOOKUP($B192,'Partie 2'!$B$27:$D$218,2,0),\"\")","v":4},{"$f":"IFERROR(VLOOKUP($B192,'Partie 2'!$B$27:$D$218,3,0),\"\")","v":13},{"$f":"IFERROR(VLOOKUP($B192,'Partie 3'!$B$27:$D$218,2,0),\"\")","v":13},{"$f":"IFERROR(VLOOKUP($B192,'Partie 3'!$B$27:$D$218,3,0),\"\")","v":4},{"$f":"IFERROR(VLOOKUP($B192,'Partie 4'!$B$27:$D$218,2,0),\"\")","v":2},{"$f":"IFERROR(VLOOKUP($B192,'Partie 4'!$B$27:$D$218,3,0),\"\")","v":13},"C62",32,37,2,null,{"$f":"IFERROR(INDEX(Liste!$G$7:$G$198,MATCH(B192,Liste!$I$7:$I$198,0)),\"\")","v":0},"C62",32,37,2]
[191,{"$f":"IFERROR(INDEX(Liste!$I$7:$I$198,MATCH(Recap!A193,Liste!$L$7:$L$198,0)),\"\")","v":"C63"},null,{"$f":"IFERROR(VLOOKUP($B193,'Partie 1'!$B$27:$D$218,2,0),\"\")","v":13},{"$f":"IFERROR(VLOOKUP($B193,'Partie 1'!$B$27:$D$218,3,0),\"\")","v":4},{"$f":"IFERROR(VLOOKUP($B193,'Partie 2'!$B$27:$D$218,2,0),\"\")","v":13},{"$f":"IFERROR(VLOOKUP($B193,'Partie 2'!$B$27:$D$218,3,0),\"\")","v":4},{"$f":"IFERROR(VLOOKUP($B193,'Partie 3'!$B$27:$D$218,2,0),\"\")","v":13},{"$f":"IFERROR(VLOOKUP($B193,'Partie 3'!$B$27:$D$218,3,0),\"\")","v":4},{"$f":"IFERROR(VLOOKUP($B193,'Partie 4'!$B$27:$D$218,2,0),\"\")","v":2},{"$f":"IFERROR(VLOOKUP($B193,'Partie 4'!$B$27:$D$218,3,0),\"\")","v":13},"C63",41,25,3,null,{"$f":"IFERROR(INDEX(Liste!$G$7:$G$198,MATCH(B193,Liste!$I$7:$I$198,0)),\"\")","v":0},"C63",41,25,3]
[192,{"$f":"IFERROR(INDEX(Liste!$I$7:$I$198,MATCH(Recap!A194,Liste!$L$7:$L$198,0)),\"\")","v":"C64"},null,{"$f":"IFERROR(VLOOKUP($B194,'Partie 1'!$B$27:$D$218,2,0),\"\")","v":4},{"$f":"IFERROR(VLOOKUP($B194,'Partie 1'!$B$27:$D$218,3,0),\"\")","v":13},{"$f":"IFERROR(VLOOKUP($B194,'Partie 2'!$B$27:$D$218,2,0),\"\")","v":13},{"$f":"IFERROR(VLOOKUP($B194,'Partie 2'!$B$27:$D$218,3,0),\"\")","v":4},{"$f":"IFERROR(VLOOKUP($B194,'Partie 3'!$B$27:$D$218,2,0),\"\")","v":13},{"$f":"IFERROR(VLOOKUP($B194,'Partie 3'!$B$27:$D$218,3,0),\"\")","v":4},{"$f":"IFERROR(VLOOKUP($B194,'Partie 4'!$B$27:$D$218,2,0),\"\")","v":13},{"$f":"IFERROR(VLOOKUP($B194,'Partie 4'!$B$27:$D$218,3,0),\"\")","v":4},"C64",43,25,3,null,{"$f":"IFERROR(INDEX(Liste!$G$7:$G$198,MATCH(B194,Liste!$I$7:$I$198,0)),\"\")","v":0},"C64",43,25,3]

{"sheet":"Classement Joueurs","index":6,"n_rows":194,"n_cols":37,"rows_kept":194,"cut":false,"hidden":false,"merged":[[44,17,46,17],[62,17,64,17],[65,17,67,17],[68,17,70,17],[71,17,73,17],[47,17,49,17],[50,17,52,17],[53,17,55,17],[56,17,58,17],[59,17,61,17],[29,17,31,17],[32,17,34,17],[35,17,37,17],[38,17,40,17],[41,17,43,17],[74,17,76,17],[77,17,79,17],[0,0,0,4],[0,32,0,36],[0,8,0,10],[0,18,0,20],[0,27,1,27],[2,17,4,17],[5,17,7,17],[8,17,10,17],[11,17,13,17],[14,17,16,17],[17,17,19,17],[20,17,22,17],[23,17,25,17],[26,17,28,17],[80,17,82,17],[83,17,85,17],[86,17,88,17],[89,17,91,17],[92,17,94,17],[95,17,97,17],[98,17,100,17],[101,17,103,17],[104,17,106,17],[107,17,109,17],[110,17,112,17],[113,17,115,17],[116,17,118,17],[119,17,121,17],[122,17,124,17],[125,17,127,17],[128,17,130,17],[131,17,133,17],[134,17,136,17],[137,17,139,17],[140,17,142,17],[143,17,145,17],[146,17,148,17],[149,17,151,17],[152,17,154,17],[155,17,157,17],[158,17,160,17],[161,17,163,17],[164,17,166,17],[167,17,169,17],[185,17,187,17],[188,17,190,17],[191,17,193,17],[170,17,172,17],[173,17,175,17],[176,17,178,17],[179,17,181,17],[182,17,184,17]]}
["Classement du tournoi",null,null,null,null,null,null,null,"Classement joueurs 1",null,null,"CRITERE 2","CRITERE 1","CRITERE 3",null,null,null,null,"Classement joueurs",null,null,"CRITERE 3","CRITERE 1","CRITERE 4","JOUEUR   N°",null,"CRITERE  2","Gagné * 10 000 + (goal + val absolue goal mini) * 100 +  points+ (100-concédés)/100",null,null,"2024-01-31",null,"CLASSEMENT CLUBS"]
["Prénoms/Noms","Points","Parties Gagnées","Concédés","Ordre","Gagné * 100 + points+ (100-concédés)/100","Rang","Rang sans exaequo","Club","Classt","Prénoms/Noms","Points","Parties Gagnées","Points concédés","N° ",null,"GOAL AVERAGE",null,"Club","Classt","Prénoms/Noms","Points","Parties Gagnées","Points concédés","N° ",null,"GOAL AVERAGE",null,"Rang","Rang sans exaequo",null,null,"A","B","C","D","E"]
[{"$f":" Recap!B3","v":"A1"},{"$f":"Recap!M3","v":19},{"$f":"Recap!O3","v":1},{"$f":"Recap!N3","v":41},{"$f":"ROW()-2","v":1},{"$f":"100*C3+B3+(100-D3)/100","v":119.59},{"$f":"RANK(F3,$F$3:$F$194,0)","v":178},{"$f":"RANK(G3,$G$3:$G$194,1)+COUNTIF(G$3:G3,G3)-1","v":178},{"$f":"IFERROR(INDEX(Liste!$G$7:$G$198,MATCH(K3,Liste!$I$7:$I$198,0)),\"\")","v":0},{"$f":"INDEX(G:G,MATCH(ROW()-2,H:H,0))","v":1},{"$f":"INDEX(A:A,MATCH(ROW()-2,H:H,0))","v":"A9"},{"$f":"INDEX(B:B,MATCH(ROW()-2,H:H,0))","v":52},{"$f":"INDEX(C:C,MATCH(K3,A:A,0))","v":4},{"$f":"INDEX(D:D,MATCH(ROW()-2,H:H,0))","v":24},{"$f":"INDEX(E:E,MATCH(ROW()-2,H:H,0))","v":9},null,{"$f":"IF(SUM(M3:N3)=0,-1000,L3-N3)","v":28},1,{"$f":"INDEX(I:I,MATCH(U3,K:K,0))","v":0},{"$f":"INDEX(AC:AC,MATCH(ROW()-2,AD:AD,0))","v":1},{"$f":"INDEX(K:K,MATCH(ROW()-2,$AD:$AD,0))","v":"A9"},{"$f":"INDEX(L:L,MATCH(ROW()-2,$AD:$AD,0))","v":52},{"$f":"INDEX(M:M,MATCH(ROW()-2,$AD:$AD,0))","v":4},{"$f":"INDEX(N:N,MATCH(ROW()-2,$AD:$AD,0))","v":24},{"$f":"INDEX(O:O,MATCH(ROW()-2,$AD:$AD,0))","v":9},null,{"$f":"V3-X3","v":28},{"$f":"$M3*10000+($Q3+ABS(MIN($Q:$Q)))*100+$L3+(100-$N3)/100","v":46952.76},{"$f":"RANK(AB3,$AB$3:$AB$194,0)","v":1},{"$f":"RANK(AC3,$AC$3:$AC$194,1)+COUNTIF(AC$3:AC3,AC3)-1","v":1},null,{"$f":"S3&COUNTIF(S$3:S3,S3)","v":"01"},{"$f":"IFERROR(INDEX($T$3:$T$194,MATCH(AG$2&ROW()-2,$AF$3:$AF$194,0)),\"\")","v":""},"","","",""]
[{"$f":" Recap!B4","v":"A2"},{"$f":"Recap!M4","v":11},{"$f":"Recap!O4","v":0},{"$f":"Recap!N4","v":52},2,{"$f":"100*C4+B4+(100-D4)/100","v":11.48},{"$f":"RANK(F4,$F$3:$F$194,0)","v":190},{"$f":"RANK(G4,$G$3:$G$194,1)+COUNTIF(G$3:G4,G4)-1","v":190},{"$f":"IFERROR(INDEX(Liste!$G$7:$G$198,MATCH(K4,Liste!$I$7:$I$198,0)),\"\")","v":0},1,"A52",52,{"$f":"INDEX(C:C,MATCH(K4,A:A,0))","v":4},24,52,null,28,null,0,{"$f":"INDEX(AC:AC,MATCH(ROW()-2,AD:AD,0))","v":1},"A52",52,4,24,52,null,{"$f":"V4-X4","v":28},{"$f":"$M4*10000+($Q4+ABS(MIN($Q:$Q)))*100+$L4+(100-$N4)/100","v":46952.76},{"$f":"RANK(AB4,$AB$3:$AB$194,0)","v":1},{"$f":"RANK(AC4,$AC$3:$AC$194,1)+COUNTIF(AC$3:AC4,AC4)-1","v":2},null,{"$f":"S4&COUNTIF(S$3:S4,S4)","v":"02"},"","","","",""]
[{"$f":" Recap!B5","v":"A3"},{"$f":"Recap!M5","v":30},{"$f":"Recap!O5","v":1},{"$f":"Recap!N5","v":41},3,130.59,154,{"$f":"RANK(G5,$G$3:$G$194,1)+COUNTIF(G$3:G5,G5)-1","v":154},{"$f":"IFERROR(INDEX(Liste!$G$7:$G$198,MATCH(K5,Liste!$I$7:$I$198,0)),\"\")","v":0},1,"B9",52,4,24,73,null,28,null,0,1,"B9",52,4,24,73,null,28,46952.76,1,{"$f":"RANK(AC5,$AC$3:$AC$194,1)+COUNTIF(AC$3:AC5,AC5)-1","v":3},null,{"$f":"S5&COUNTIF(S$3:S5,S5)","v":"03"},"","","","",""]
[{"$f":" Recap!B6","v":"A4"},{"$f":"Recap!M6","v":30},{"$f":"Recap!O6","v":2},{"$f":"Recap!N6","v":38},4,230.62,130,{"$f":"RANK(G6,$G$3:$G$194,1)+COUNTIF(G$3:G6,G6)-1","v":130},{"$f":"IFERROR(INDEX(Liste!$G$7:$G$198,MATCH(K6,Liste!$I$7:$I$198,0)),\"\")","v":0},1,"B52",52,4,24,116,null,28,2,0,1,"B52",52,4,24,116,null,28,46952.76,1,{"$f":"RANK(AC6,$AC$3:$AC$194,1)+COUNTIF(AC$3:AC6,AC6)-1","v":4},null,{"$f":"S6&COUNTIF(S$3:S6,S6)","v":"04"},"","","","",""]
[{"$f":" Recap!B7","v":"A5"},{"$f":"Recap!M7","v":42},{"$f":"Recap!O7","v":2},{"$f":"Recap!N7","v":38},5,242.62,82,{"$f":"RANK(G7,$G$3:$G$194,1)+COUNTIF(G$3:G7,G7)-1","v":82},{"$f":"IFERROR(INDEX(Liste!$G$7:$G$198,MATCH(K7,Liste!$I$7:$I$198,0)),\"\")","v":0},1,"C9",52,4,24,137,null,28,null,0,1,"C9",52,4,24,137,null,28,46952.76,1,{"$f":"RANK(AC7,$AC$3:$AC$194,1)+COUNTIF(AC$3:AC7,AC7)-1","v":5},null,{"$f":"S7&COUNTIF(S$3:S7,S7)","v":"05"}]
[{"$f":" Recap!B8","v":"A6"},{"$f":"Recap!M8","v":41},{"$f":"Recap!O8","v":3},{"$f":"Recap!N8","v":36},6,341.64,55,{"$f":"RANK(G8,$G$3:$G$194,1)+COUNTIF(G$3:G8,G8)-1","v":55},{"$f":"IFERROR(INDEX(Liste!$G$7:$G$198,MATCH(K8,Liste!$I$7:$I$198,0)),\"\")","v":0},1,"C52",52,4,24,180,null,28,null,0,1,"C52",52,4,24,180,null,28,46952.76,1,{"$f":"RANK(AC8,$AC$3:$AC$194,1)+COUNTIF(AC$3:AC8,AC8)-1","v":6},null,{"$f":"S8&COUNTIF(S$3:S8,S8)","v":"06"},{"$f":"SUM(AG3:AG6)","v":0},{"$f":"SUM(AH3:AH6)","v":0},{"$f":"SUM(AI3:AI6)","v":0},{"$f":"SUM(AJ3:AJ6)","v":0},{"$f":"SUM(AK3:AK6)","v":0}]
[{"$f":" Recap!B9","v":"A7"},{"$f":"Recap!M9","v":30},{"$f":"Recap!O9","v":1},{"$f":"Recap!N9","v":41},7,130.59,154,{"$f":"RANK(G9,$G$3:$G$194,1)+COUNTIF(G$3:G9,G9)-1","v":155},{"$f":"IFERROR(INDEX(Liste!$G$7:$G$198,MATCH(K9,Liste!$I$7:$I$198,0)),\"\")","v":0},7,"A20",52,4,36,20,null,16,3,0,7,"A20",52,4,36,20,null,16,45752.639999999999,7,{"$f":"RANK(AC9,$AC$3:$AC$194,1)+COUNTIF(AC$3:AC9,AC9)-1","v":7},null,{"$f":"S9&COUNTIF(S$3:S9,S9)","v":"07"},{"$f":"RANK(AG8,$AG$8:$AK$8,1)","v":1},{"$f":"RANK(AH8,$AG$8:$AK$8,1)","v":1},1,1,1]
[{"$f":" Recap!B10","v":"A8"},{"$f":"Recap!M10","v":38},{"$f":"Recap!O10","v":2},{"$f":"Recap!N10","v":30},8,238.7,97,{"$f":"RANK(G10,$G$3:$G$194,1)+COUNTIF(G$3:G10,G10)-1","v":97},{"$f":"IFERROR(INDEX(Liste!$G$7:$G$198,MATCH(K10,Liste!$I$7:$I$198,0)),\"\")","v":0},7,"B20",52,4,36,84,null,16,null,0,7,"B20",52,4,36,84,null,16,45752.639999999999,7,{"$f":"RANK(AC10,$AC$3:$AC$194,1)+COUNTIF(AC$3:AC10,AC10)-1","v":8},null,{"$f":"S10&COUNTIF(S$3:S10,S10)","v":"08"}]
[{"$f":" Recap!B11","v":"A9"},{"$f":"Recap!M11","v":52},{"$f":"Recap!O11","v":4},{"$f":"Recap!N11","v":24},9,452.76,1,{"$f":"RANK(G11,$G$3:$G$194,1)+COUNTIF(G$3:G11,G11)-1","v":1},{"$f":"IFERROR(INDEX(Liste!$G$7:$G$198,MATCH(K11,Liste!$I$7:$I$198,0)),\"\")","v":0},7,"C20",52,4,36,148,null,16,null,0,7,"C20",52,4,36,148,null,16,45752.639999999999,7,{"$f":"RANK(AC11,$AC$3:$AC$194,1)+COUNTIF(AC$3:AC11,AC11)-1","v":9},null,{"$f":"S11&COUNTIF(S$3:S11,S11)","v":"09"}]
[{"$f":" Recap!B12","v":"A10"},{"$f":"Recap!M12","v":40},{"$f":"Recap!O12","v":3},{"$f":"Recap!N12","v":39},10,340.61,58,{"$f":"RANK(G12,$G$3:$G$194,1)+COUNTIF(G$3:G12,G12)-1","v":58},{"$f":"IFERROR(INDEX(Liste!$G$7:$G$198,MATCH(K12,Liste!$I$7:$I$198,0)),\"\")","v":0},10,"A37",52,4,37,37,null,15,4,0,10,"A37",52,4,37,37,null,15,45652.63,10,{"$f":"RANK(AC12,$AC$3:$AC$194,1)+COUNTIF(AC$3:AC12,AC12)-1","v":10},null,{"$f":"S12&COUNTIF(S$3:S12,S12)","v":"010"}]
[{"$f":" Recap!B13","v":"A11"},{"$f":"Recap!M13","v":45},{"$f":"Recap!O13","v":2},{"$f":"Recap!N13","v":41},11,245.59,73,{"$f":"RANK(G13,$G$3:$G$194,1)+COUNTIF(G$3:G13,G13)-1","v":73},{"$f":"IFERROR(INDEX(Liste!$G$7:$G$198,MATCH(K13,Liste!$I$7:$I$198,0)),\"\")","v":0},10,"B37",52,4,37,101,null,15,null,0,10,"B37",52,4,37,101,null,15,45652.63,10,{"$f":"RANK(AC13,$AC$3:$AC$194,1)+COUNTIF(AC$3:AC13,AC13)-1","v":11},null,{"$f":"S13&COUNTIF(S$3:S13,S13)","v":"011"}]
[{"$f":" Recap!B14","v":"A12"},{"$f":"Recap!M14","v":50},{"$f":"Recap!O14","v":3},{"$f":"Recap!N14","v":33},12,350.67,13,{"$f":"RANK(G14,$G$3:$G$194,1)+COUNTIF(G$3:G14,G14)-1","v":13},{"$f":"IFERROR(INDEX(Liste!$G$7:$G$198,MATCH(K14,Liste!$I$7:$I$198,0)),\"\")","v":0},10,"C37",52,4,37,165,null,15,null,0,10,"C37",52,4,37,165,null,15,45652.63,10,{"$f":"RANK(AC14,$AC$3:$AC$194,1)+COUNTIF(AC$3:AC14,AC14)-1","v":12},null,{"$f":"S14&COUNTIF(S$3:S14,S14)","v":"012"}]
[{"$f":" Recap!B15","v":"A13"},{"$f":"Recap!M15","v":43},{"$f":"Recap!O15","v":2},{"$f":"Recap!N15","v":33},13,243.67,76,{"$f":"RANK(G15,$G$3:$G$194,1)+COUNTIF(G$3:G15,G15)-1","v":76},{"$f":"IFERROR(INDEX(Liste!$G$7:$G$198,MATCH(K15,Liste!$I$7:$I$198,0)),\"\")","v":0},13,"A12",50,3,33,12,null,17,5,0,13,"A14",49,3,24,14,null,25,35850.67,28,{"$f":"RANK(AC15,$AC$3:$AC$194,1)+COUNTIF(AC$3:AC15,AC15)-1","v":28},null,{"$f":"S15&COUNTIF(S$3:S15,S15)","v":"013"}]
[{"$f":" Recap!B16","v":"A14"},{"$f":"Recap!M16","v":49},{"$f":"Recap!O16","v":3},{"$f":"Recap!N16","v":24},14,349.76,25,{"$f":"RANK(G16,$G$3:$G$194,1)+COUNTIF(G$3:G16,G16)-1","v":25},{"$f":"IFERROR(INDEX(Liste!$G$7:$G$198,MATCH(K16,Liste!$I$7:$I$198,0)),\"\")","v":0},13,"B12",50,3,33,76,null,17,null,0,13,"B14",49,3,24,78,null,25,35850.67,28,{"$f":"RANK(AC16,$AC$3:$AC$194,1)+COUNTIF(AC$3:AC16,AC16)-1","v":29},null,{"$f":"S16&COUNTIF(S$3:S16,S16)","v":"014"}]
[{"$f":" Recap!B17","v":"A15"},{"$f":"Recap!M17","v":38},{"$f":"Recap!O17","v":2},{"$f":"Recap!N17","v":32},15,238.68,100,{"$f":"RANK(G17,$G$3:$G$194,1)+COUNTIF(G$3:G17,G17)-1","v":100},{"$f":"IFERROR(INDEX(Liste!$G$7:$G$198,MATCH(K17,Liste!$I$7:$I$198,0)),\"\")","v":0},13,"C12",50,3,33,140,null,17,null,0,13,"C14",49,3,24,142,null,25,35850.67,28,{"$f":"RANK(AC17,$AC$3:$AC$194,1)+COUNTIF(AC$3:AC17,AC17)-1","v":30},null,{"$f":"S17&COUNTIF(S$3:S17,S17)","v":"015"}]
[{"$f":" Recap!B18","v":"A16"},{"$f":"Recap!M18","v":29},{"$f":"Recap!O18","v":1},{"$f":"Recap!N18","v":44},16,129.56,160,{"$f":"RANK(G18,$G$3:$G$194,1)+COUNTIF(G$3:G18,G18)-1","v":160},{"$f":"IFERROR(INDEX(Liste!$G$7:$G$198,MATCH(K18,Liste!$I$7:$I$198,0)),\"\")","v":0},16,"A38",50,3,35,38,null,15,6,0,16,"A25",49,3,27,25,null,22,35650.65,34,{"$f":"RANK(AC18,$AC$3:$AC$194,1)+COUNTIF(AC$3:AC18,AC18)-1","v":34},null,{"$f":"S18&COUNTIF(S$3:S18,S18)","v":"016"}]
[{"$f":" Recap!B19","v":"A17"},{"$f":"Recap!M19","v":44},{"$f":"Recap!O19","v":3},{"$f":"Recap!N19","v":36},17,344.64,43,{"$f":"RANK(G19,$G$3:$G$194,1)+COUNTIF(G$3:G19,G19)-1","v":43},{"$f":"IFERROR(INDEX(Liste!$G$7:$G$198,MATCH(K19,Liste!$I$7:$I$198,0)),\"\")","v":0},16,"B38",50,3,35,102,null,15,null,0,16,"B25",49,3,27,89,null,22,35650.65,34,{"$f":"RANK(AC19,$AC$3:$AC$194,1)+COUNTIF(AC$3:AC19,AC19)-1","v":35},null,{"$f":"S19&COUNTIF(S$3:S19,S19)","v":"017"}]
[{"$f":" Recap!B20","v":"A18"},{"$f":"Recap!M20","v":33},{"$f":"Recap!O20","v":2},{"$f":"Recap!N20","v":45},18,233.55,121,{"$f":"RANK(G20,$G$3:$G$194,1)+COUNTIF(G$3:G20,G20)-1","v":121},{"$f":"IFERROR(INDEX(Liste!$G$7:$G$198,MATCH(K20,Liste!$I$7:$I$198,0)),\"\")","v":0},16,"C38",50,3,35,166,null,15,null,0,16,"C25",49,3,27,153,null,22,35650.65,34,{"$f":"RANK(AC20,$AC$3:$AC$194,1)+COUNTIF(AC$3:AC20,AC20)-1","v":36},null,{"$f":"S20&COUNTIF(S$3:S20,S20)","v":"018"}]
[{"$f":" Recap!B21","v":"A19"},{"$f":"Recap!M21","v":49},{"$f":"Recap!O21","v":3},{"$f":"Recap!N21","v":37},19,349.63,34,{"$f":"RANK(G21,$G$3:$G$194,1)+COUNTIF(G$3:G21,G21)-1","v":34},{"$f":"IFERROR(INDEX(Liste!$G$7:$G$198,MATCH(K21,Liste!$I$7:$I$198,0)),\"\")","v":0},19,"A42",50,3,37,42,null,13,7,0,19,"A49",44,3,24,49,null,20,35450.629999999997,37,{"$f":"RANK(AC21,$AC$3:$AC$194,1)+COUNTIF(AC$3:AC21,AC21)-1","v":37},null,{"$f":"S21&COUNTIF(S$3:S21,S21)","v":"019"}]
[{"$f":" Recap!B22","v":"A20"},{"$f":"Recap!M22","v":52},{"$f":"Recap!O22","v":4},{"$f":"Recap!N22","v":36},20,452.64,7,{"$f":"RANK(G22,$G$3:$G$194,1)+COUNTIF(G$3:G22,G22)-1","v":7},{"$f":"IFERROR(INDEX(Liste!$G$7:$G$198,MATCH(K22,Liste!$I$7:$I$198,0)),\"\")","v":0},19,"B42",50,3,37,106,null,13,null,0,19,"B49",44,3,24,113,null,20,35450.629999999997,37,{"$f":"RANK(AC22,$AC$3:$AC$194,1)+COUNTIF(AC$3:AC22,AC22)-1","v":38},null,{"$f":"S22&COUNTIF(S$3:S22,S22)","v":"020"}]
[{"$f":" Recap!B23","v":"A21"},{"$f":"Recap!M23","v":48},{"$f":"Recap!O23","v":2},{"$f":"Recap!N23","v":42},21,248.58,61,{"$f":"RANK(G23,$G$3:$G$194,1)+COUNTIF(G$3:G23,G23)-1","v":61},{"$f":"IFERROR(INDEX(Liste!$G$7:$G$198,MATCH(K23,Liste!$I$7:$I$198,0)),\"\")","v":0},19,"C42",50,3,37,170,null,13,null,0,19,"C49",44,3,24,177,null,20,35450.629999999997,37,{"$f":"RANK(AC23,$AC$3:$AC$194,1)+COUNTIF(AC$3:AC23,AC23)-1","v":39},null,{"$f":"S23&COUNTIF(S$3:S23,S23)","v":"021"}]
[{"$f":" Recap!B24","v":"A22"},{"$f":"Recap!M24","v":50},{"$f":"Recap!O24","v":3},{"$f":"Recap!N24","v":42},22,350.58,22,{"$f":"RANK(G24,$G$3:$G$194,1)+COUNTIF(G$3:G24,G24)-1","v":22},{"$f":"IFERROR(INDEX(Liste!$G$7:$G$198,MATCH(K24,Liste!$I$7:$I$198,0)),\"\")","v":0},22,"A22",50,3,42,22,null,8,8,0,22,"A39",49,3,31,39,null,18,34950.58,46,{"$f":"RANK(AC24,$AC$3:$AC$194,1)+COUNTIF(AC$3:AC24,AC24)-1","v":46},null,{"$f":"S24&COUNTIF(S$3:S24,S24)","v":"022"}]
[{"$f":" Recap!B25","v":"A23"},{"$f":"Recap!M25","v":34},{"$f":"Recap!O25","v":1},{"$f":"Recap!N25","v":47},23,134.53,148,{"$f":"RANK(G25,$G$3:$G$194,1)+COUNTIF(G$3:G25,G25)-1","v":148},{"$f":"IFERROR(INDEX(Liste!$G$7:$G$198,MATCH(K25,Liste!$I$7:$I$198,0)),\"\")","v":0},22,"B22",50,3,42,86,null,8,null,0,22,"B39",49,3,31,103,null,18,34950.58,46,{"$f":"RANK(AC25,$AC$3:$AC$194,1)+COUNTIF(AC$3:AC25,AC25)-1","v":47},null,{"$f":"S25&COUNTIF(S$3:S25,S25)","v":"023"}]
[{"$f":" Recap!B26","v":"A24"},{"$f":"Recap!M26","v":45},{"$f":"Recap!O26","v":2},{"$f":"Recap!N26","v":38},24,245.62,70,{"$f":"RANK(G26,$G$3:$G$194,1)+COUNTIF(G$3:G26,G26)-1","v":70},{"$f":"IFERROR(INDEX(Liste!$G$7:$G$198,MATCH(K26,Liste!$I$7:$I$198,0)),\"\")","v":0},22,"C22",50,3,42,150,null,8,null,0,22,"C39",49,3,31,167,null,18,34950.58,46,{"$f":"RANK(AC26,$AC$3:$AC$194,1)+COUNTIF(AC$3:AC26,AC26)-1","v":48},null,{"$f":"S26&COUNTIF(S$3:S26,S26)","v":"024"}]
[{"$f":" Recap!B27","v":"A25"},{"$f":"Recap!M27","v":49},{"$f":"Recap!O27","v":3},{"$f":"Recap!N27","v":27},25,349.73,28,{"$f":"RANK(G27,$G$3:$G$194,1)+COUNTIF(G$3:G27,G27)-1","v":28},{"$f":"IFERROR(INDEX(Liste!$G$7:$G$198,MATCH(K27,Liste!$I$7:$I$198,0)),\"\")","v":0},25,"A14",49,3,24,14,null,25,9,0,25,"A64",43,3,25,64,null,18,36649.760000000002,13,{"$f":"RANK(AC27,$AC$3:$AC$194,1)+COUNTIF(AC$3:AC27,AC27)-1","v":13},null,{"$f":"S27&COUNTIF(S$3:S27,S27)","v":"025"}]
[{"$f":" Recap!B28","v":"A26"},{"$f":"Recap!M28","v":39},{"$f":"Recap!O28","v":2},{"$f":"Recap!N28","v":35},26,239.65,94,{"$f":"RANK(G28,$G$3:$G$194,1)+COUNTIF(G$3:G28,G28)-1","v":94},{"$f":"IFERROR(INDEX(Liste!$G$7:$G$198,MATCH(K28,Liste!$I$7:$I$198,0)),\"\")","v":0},25,"B14",49,3,24,78,null,25,null,0,25,"B64",43,3,25,128,null,18,36649.760000000002,13,{"$f":"RANK(AC28,$AC$3:$AC$194,1)+COUNTIF(AC$3:AC28,AC28)-1","v":14},null,{"$f":"S28&COUNTIF(S$3:S28,S28)","v":"026"}]
[{"$f":" Recap!B29","v":"A27"},{"$f":"Recap!M29","v":36},{"$f":"Recap!O29","v":1},{"$f":"Recap!N29","v":41},27,136.59,136,{"$f":"RANK(G29,$G$3:$G$194,1)+COUNTIF(G$3:G29,G29)-1","v":136},{"$f":"IFERROR(INDEX(Liste!$G$7:$G$198,MATCH(K29,Liste!$I$7:$I$198,0)),\"\")","v":0},25,"C14",49,3,24,142,null,25,null,0,25,"C64",43,3,25,192,null,18,36649.760000000002,13,{"$f":"RANK(AC29,$AC$3:$AC$194,1)+COUNTIF(AC$3:AC29,AC29)-1","v":15},null,{"$f":"S29&COUNTIF(S$3:S29,S29)","v":"027"}]
[{"$f":" Recap!B30","v":"A28"},{"$f":"Recap!M30","v":43},{"$f":"Recap!O30","v":2},{"$f":"Recap!N30","v":36},28,243.64,79,{"$f":"RANK(G30,$G$3:$G$194,1)+COUNTIF(G$3:G30,G30)-1","v":79},{"$f":"IFERROR(INDEX(Liste!$G$7:$G$198,MATCH(K30,Liste!$I$7:$I$198,0)),\"\")","v":0},28,"A25",49,3,27,25,null,22,10,0,28,"A12",50,3,33,12,null,17,36349.730000000003,16,{"$f":"RANK(AC30,$AC$3:$AC$194,1)+COUNTIF(AC$3:AC30,AC30)-1","v":16},null,{"$f":"S30&COUNTIF(S$3:S30,S30)","v":"028"}]
[{"$f":" Recap!B31","v":"A29"},{"$f":"Recap!M31","v":21},{"$f":"Recap!O31","v":0},{"$f":"Recap!N31","v":52},29,21.48,181,{"$f":"RANK(G31,$G$3:$G$194,1)+COUNTIF(G$3:G31,G31)-1","v":181},{"$f":"IFERROR(INDEX(Liste!$G$7:$G$198,MATCH(K31,Liste!$I$7:$I$198,0)),\"\")","v":0},28,"B25",49,3,27,89,null,22,null,0,28,"B12",50,3,33,76,null,17,36349.730000000003,16,{"$f":"RANK(AC31,$AC$3:$AC$194,1)+COUNTIF(AC$3:AC31,AC31)-1","v":17},null,{"$f":"S31&COUNTIF(S$3:S31,S31)","v":"029"}]
[{"$f":" Recap!B32","v":"A30"},{"$f":"Recap!M32","v":29},{"$f":"Recap!O32","v":1},{"$f":"Recap!N32","v":46},30,129.54,163,{"$f":"RANK(G32,$G$3:$G$194,1)+COUNTIF(G$3:G32,G32)-1","v":163},{"$f":"IFERROR(INDEX(Liste!$G$7:$G$198,MATCH(K32,Liste!$I$7:$I$198,0)),\"\")","v":0},28,"C25",49,3,27,153,null,22,null,0,28,"C12",50,3,33,140,null,17,36349.730000000003,16,{"$f":"RANK(AC32,$AC$3:$AC$194,1)+COUNTIF(AC$3:AC32,AC32)-1","v":18},null,{"$f":"S32&COUNTIF(S$3:S32,S32)","v":"030"}]
[{"$f":" Recap!B33","v":"A31"},{"$f":"Recap!M33","v":38},{"$f":"Recap!O33","v":2},{"$f":"Recap!N33","v":34},31,238.66,103,{"$f":"RANK(G33,$G$3:$G$194,1)+COUNTIF(G$3:G33,G33)-1","v":103},{"$f":"IFERROR(INDEX(Liste!$G$7:$G$198,MATCH(K33,Liste!$I$7:$I$198,0)),\"\")","v":0},31,"A39",49,3,31,39,null,18,11,0,31,"A63",41,3,25,63,null,16,35949.69,22,{"$f":"RANK(AC33,$AC$3:$AC$194,1)+COUNTIF(AC$3:AC33,AC33)-1","v":22},null,{"$f":"S33&COUNTIF(S$3:S33,S33)","v":"031"}]
[{"$f":" Recap!B34","v":"A32"},{"$f":"Recap!M34","v":27},{"$f":"Recap!O34","v":1},{"$f":"Recap!N34","v":43},32,127.57,166,{"$f":"RANK(G34,$G$3:$G$194,1)+COUNTIF(G$3:G34,G34)-1","v":166},{"$f":"IFERROR(INDEX(Liste!$G$7:$G$198,MATCH(K34,Liste!$I$7:$I$198,0)),\"\")","v":0},31,"B39",49,3,31,103,null,18,null,0,31,"B63",41,3,25,127,null,16,35949.69,22,{"$f":"RANK(AC34,$AC$3:$AC$194,1)+COUNTIF(AC$3:AC34,AC34)-1","v":23},null,{"$f":"S34&COUNTIF(S$3:S34,S34)","v":"032"}]
[{"$f":" Recap!B35","v":"A33"},{"$f":"Recap!M35","v":22},{"$f":"Recap!O35","v":1},{"$f":"Recap!N35","v":46},33,122.54,175,{"$f":"RANK(G35,$G$3:$G$194,1)+COUNTIF(G$3:G35,G35)-1","v":175},{"$f":"IFERROR(INDEX(Liste!$G$7:$G$198,MATCH(K35,Liste!$I$7:$I$198,0)),\"\")","v":0},{"$f":"INDEX(G:G,MATCH(ROW()-2,H:H,0))","v":31},{"$f":"INDEX(A:A,MATCH(ROW()-2,H:H,0))","v":"C39"},{"$f":"INDEX(B:B,MATCH(ROW()-2,H:H,0))","v":49},3,{"$f":"INDEX(D:D,MATCH(ROW()-2,H:H,0))","v":31},{"$f":"INDEX(E:E,MATCH(ROW()-2,H:H,0))","v":167},null,{"$f":"IF(SUM(M35:N35)=0,-1000,L35-N35)","v":18},null,{"$f":"INDEX(I:I,MATCH(U35,K:K,0))","v":0},31,{"$f":"INDEX(K:K,MATCH(ROW()-2,$AD:$AD,0))","v":"C63"},{"$f":"INDEX(L:L,MATCH(ROW()-2,$AD:$AD,0))","v":41},{"$f":"INDEX(M:M,MATCH(ROW()-2,$AD:$AD,0))","v":3},{"$f":"INDEX(N:N,MATCH(ROW()-2,$AD:$AD,0))","v":25},{"$f":"INDEX(O:O,MATCH(ROW()-2,$AD:$AD,0))","v":191},null,16,35949.69,22,{"$f":"RANK(AC35,$AC$3:$AC$194,1)+COUNTIF(AC$3:AC35,AC35)-1","v":24},null,{"$f":"S35&COUNTIF(S$3:S35,S35)","v":"033"}]
[{"$f":" Recap!B36","v":"A34"},{"$f":"Recap!M36","v":33},{"$f":"Recap!O36","v":2},{"$f":"Recap!N36","v":39},34,233.61,118,{"$f":"RANK(G36,$G$3:$G$194,1)+COUNTIF(G$3:G36,G36)-1","v":118},{"$f":"IFERROR(INDEX(Liste!$G$7:$G$198,MATCH(K36,Liste!$I$7:$I$198,0)),\"\")","v":0},34,"A19",49,3,37,19,null,12,12,0,34,"A38",50,3,35,38,null,15,35349.629999999997,40,{"$f":"RANK(AC36,$AC$3:$AC$194,1)+COUNTIF(AC$3:AC36,AC36)-1","v":40},null,{"$f":"S36&COUNTIF(S$3:S36,S36)","v":"034"}]
[{"$f":" Recap!B37","v":"A35"},{"$f":"Recap!M37","v":44},{"$f":"Recap!O37","v":3},{"$f":"Recap!N37","v":36},35,344.64,43,{"$f":"RANK(G37,$G$3:$G$194,1)+COUNTIF(G$3:G37,G37)-1","v":44},{"$f":"IFERROR(INDEX(Liste!$G$7:$G$198,MATCH(K37,Liste!$I$7:$I$198,0)),\"\")","v":0},34,"B19",49,3,37,83,null,12,null,0,34,"B38",50,3,35,102,null,15,35349.629999999997,40,{"$f":"RANK(AC37,$AC$3:$AC$194,1)+COUNTIF(AC$3:AC37,AC37)-1","v":41},null,{"$f":"S37&COUNTIF(S$3:S37,S37)","v":"035"}]
[{"$f":" Recap!B38","v":"A36"},{"$f":"Recap!M38","v":41},{"$f":"Recap!O38","v":2},{"$f":"Recap!N38","v":35},36,241.65,88,{"$f":"RANK(G38,$G$3:$G$194,1)+COUNTIF(G$3:G38,G38)-1","v":88},{"$f":"IFERROR(INDEX(Liste!$G$7:$G$198,MATCH(K38,Liste!$I$7:$I$198,0)),\"\")","v":0},34,"C19",49,3,37,147,null,12,null,0,34,"C38",50,3,35,166,null,15,35349.629999999997,40,{"$f":"RANK(AC38,$AC$3:$AC$194,1)+COUNTIF(AC$3:AC38,AC38)-1","v":42},null,{"$f":"S38&COUNTIF(S$3:S38,S38)","v":"036"}]
[{"$f":" Recap!B39","v":"A37"},{"$f":"Recap!M39","v":52},{"$f":"Recap!O39","v":4},{"$f":"Recap!N39","v":37},37,452.63,10,{"$f":"RANK(G39,$G$3:$G$194,1)+COUNTIF(G$3:G39,G39)-1","v":10},{"$f":"IFERROR(INDEX(Liste!$G$7:$G$198,MATCH(K39,Liste!$I$7:$I$198,0)),\"\")","v":0},37,"A54",46,3,34,54,null,12,13,0,37,"A42",50,3,37,42,null,13,35346.660000000003,43,{"$f":"RANK(AC39,$AC$3:$AC$194,1)+COUNTIF(AC$3:AC39,AC39)-1","v":43},null,{"$f":"S39&COUNTIF(S$3:S39,S39)","v":"037"}]
[{"$f":" Recap!B40","v":"A38"},{"$f":"Recap!M40","v":50},{"$f":"Recap!O40","v":3},{"$f":"Recap!N40","v":35},38,350.65,16,{"$f":"RANK(G40,$G$3:$G$194,1)+COUNTIF(G$3:G40,G40)-1","v":16},{"$f":"IFERROR(INDEX(Liste!$G$7:$G$198,MATCH(K40,Liste!$I$7:$I$198,0)),\"\")","v":0},37,"B54",46,3,34,118,null,12,null,0,37,"B42",50,3,37,106,null,13,35346.660000000003,43,{"$f":"RANK(AC40,$AC$3:$AC$194,1)+COUNTIF(AC$3:AC40,AC40)-1","v":44},null,{"$f":"S40&COUNTIF(S$3:S40,S40)","v":"038"}]
[{"$f":" Recap!B41","v":"A39"},{"$f":"Recap!M41","v":49},{"$f":"Recap!O41","v":3},{"$f":"Recap!N41","v":31},39,349.69,31,{"$f":"RANK(G41,$G$3:$G$194,1)+COUNTIF(G$3:G41,G41)-1","v":31},{"$f":"IFERROR(INDEX(Liste!$G$7:$G$198,MATCH(K41,Liste!$I$7:$I$198,0)),\"\")","v":0},37,"C54",46,3,34,182,null,12,null,0,37,"C42",50,3,37,170,null,13,35346.660000000003,43,{"$f":"RANK(AC41,$AC$3:$AC$194,1)+COUNTIF(AC$3:AC41,AC41)-1","v":45},null,{"$f":"S41&COUNTIF(S$3:S41,S41)","v":"039"}]
[{"$f":" Recap!B42","v":"A40"},{"$f":"Recap!M42","v":38},{"$f":"Recap!O42","v":2},{"$f":"Recap!N42","v":38},40,238.62,106,{"$f":"RANK(G42,$G$3:$G$194,1)+COUNTIF(G$3:G42,G42)-1","v":106},{"$f":"IFERROR(INDEX(Liste!$G$7:$G$198,MATCH(K42,Liste!$I$7:$I$198,0)),\"\")","v":0},40,"A49",44,3,24,49,null,20,14,0,40,"A19",49,3,37,19,null,12,36144.76,19,{"$f":"RANK(AC42,$AC$3:$AC$194,1)+COUNTIF(AC$3:AC42,AC42)-1","v":19},null,{"$f":"S42&COUNTIF(S$3:S42,S42)","v":"040"}]
[{"$f":" Recap!B43","v":"A41"},{"$f":"Recap!M43","v":38},{"$f":"Recap!O43","v":2},{"$f":"Recap!N43","v":45},41,238.55,109,{"$f":"RANK(G43,$G$3:$G$194,1)+COUNTIF(G$3:G43,G43)-1","v":109},{"$f":"IFERROR(INDEX(Liste!$G$7:$G$198,MATCH(K43,Liste!$I$7:$I$198,0)),\"\")","v":0},40,"B49",44,3,24,113,null,20,null,0,40,"B19",49,3,37,83,null,12,36144.76,19,{"$f":"RANK(AC43,$AC$3:$AC$194,1)+COUNTIF(AC$3:AC43,AC43)-1","v":20},null,{"$f":"S43&COUNTIF(S$3:S43,S43)","v":"041"}]
[{"$f":" Recap!B44","v":"A42"},{"$f":"Recap!M44","v":50},{"$f":"Recap!O44","v":3},{"$f":"Recap!N44","v":37},42,350.63,19,{"$f":"RANK(G44,$G$3:$G$194,1)+COUNTIF(G$3:G44,G44)-1","v":19},{"$f":"IFERROR(INDEX(Liste!$G$7:$G$198,MATCH(K44,Liste!$I$7:$I$198,0)),\"\")","v":0},40,"C49",44,3,24,177,null,20,null,0,40,"C19",49,3,37,147,null,12,36144.76,19,{"$f":"RANK(AC44,$AC$3:$AC$194,1)+COUNTIF(AC$3:AC44,AC44)-1","v":21},null,{"$f":"S44&COUNTIF(S$3:S44,S44)","v":"042"}]
[{"$f":" Recap!B45","v":"A43"},{"$f":"Recap!M45","v":48},{"$f":"Recap!O45","v":2},{"$f":"Recap!N45","v":42},43,248.58,61,{"$f":"RANK(G45,$G$3:$G$194,1)+COUNTIF(G$3:G45,G45)-1","v":62},{"$f":"IFERROR(INDEX(Liste!$G$7:$G$198,MATCH(K45,Liste!$I$7:$I$198,0)),\"\")","v":0},43,"A17",44,3,36,17,null,8,15,0,43,"A54",46,3,34,54,null,12,34944.639999999999,49,{"$f":"RANK(AC45,$AC$3:$AC$194,1)+COUNTIF(AC$3:AC45,AC45)-1","v":49},null,{"$f":"S45&COUNTIF(S$3:S45,S45)","v":"043"}]
[{"$f":" Recap!B46","v":"A44"},{"$f":"Recap!M46","v":39},{"$f":"Recap!O46","v":1},{"$f":"Recap!N46","v":47},44,139.53,133,{"$f":"RANK(G46,$G$3:$G$194,1)+COUNTIF(G$3:G46,G46)-1","v":133},{"$f":"IFERROR(INDEX(Liste!$G$7:$G$198,MATCH(K46,Liste!$I$7:$I$198,0)),\"\")","v":0},43,"A35",44,3,36,35,null,8,null,0,43,"B54",46,3,34,118,null,12,34944.639999999999,49,{"$f":"RANK(AC46,$AC$3:$AC$194,1)+COUNTIF(AC$3:AC46,AC46)-1","v":50},null,{"$f":"S46&COUNTIF(S$3:S46,S46)","v":"044"}]
[{"$f":" Recap!B47","v":"A45"},{"$f":"Recap!M47","v":45},{"$f":"Recap!O47","v":2},{"$f":"Recap!N47","v":35},45,245.65,67,{"$f":"RANK(G47,$G$3:$G$194,1)+COUNTIF(G$3:G47,G47)-1","v":67},{"$f":"IFERROR(INDEX(Liste!$G$7:$G$198,MATCH(K47,Liste!$I$7:$I$198,0)),\"\")","v":0},43,"B17",44,3,36,81,null,8,null,0,43,"C54",46,3,34,182,null,12,34944.639999999999,49,{"$f":"RANK(AC47,$AC$3:$AC$194,1)+COUNTIF(AC$3:AC47,AC47)-1","v":51},null,{"$f":"S47&COUNTIF(S$3:S47,S47)","v":"045"}]
[{"$f":" Recap!B48","v":"A46"},{"$f":"Recap!M48","v":35},{"$f":"Recap!O48","v":1},{"$f":"Recap!N48","v":41},46,135.59,139,{"$f":"RANK(G48,$G$3:$G$194,1)+COUNTIF(G$3:G48,G48)-1","v":139},{"$f":"IFERROR(INDEX(Liste!$G$7:$G$198,MATCH(K48,Liste!$I$7:$I$198,0)),\"\")","v":0},43,"B35",44,3,36,99,null,8,16,0,46,"A22",50,3,42,22,null,8,34944.639999999999,49,{"$f":"RANK(AC48,$AC$3:$AC$194,1)+COUNTIF(AC$3:AC48,AC48)-1","v":52},null,{"$f":"S48&COUNTIF(S$3:S48,S48)","v":"046"}]
[{"$f":" Recap!B49","v":"A47"},{"$f":"Recap!M49","v":21},{"$f":"Recap!O49","v":0},{"$f":"Recap!N49","v":52},47,21.48,181,{"$f":"RANK(G49,$G$3:$G$194,1)+COUNTIF(G$3:G49,G49)-1","v":182},{"$f":"IFERROR(INDEX(Liste!$G$7:$G$198,MATCH(K49,Liste!$I$7:$I$198,0)),\"\")","v":0},43,"C17",44,3,36,145,null,8,null,0,46,"B22",50,3,42,86,null,8,34944.639999999999,49,{"$f":"RANK(AC49,$AC$3:$AC$194,1)+COUNTIF(AC$3:AC49,AC49)-1","v":53},null,{"$f":"S49&COUNTIF(S$3:S49,S49)","v":"047"}]
[{"$f":" Recap!B50","v":"A48"},{"$f":"Recap!M50","v":34},{"$f":"Recap!O50","v":1},{"$f":"Recap!N50","v":43},48,134.57,145,{"$f":"RANK(G50,$G$3:$G$194,1)+COUNTIF(G$3:G50,G50)-1","v":145},{"$f":"IFERROR(INDEX(Liste!$G$7:$G$198,MATCH(K50,Liste!$I$7:$I$198,0)),\"\")","v":0},43,"C35",44,3,36,163,null,8,null,0,46,"C22",50,3,42,150,null,8,34944.639999999999,49,{"$f":"RANK(AC50,$AC$3:$AC$194,1)+COUNTIF(AC$3:AC50,AC50)-1","v":54},null,{"$f":"S50&COUNTIF(S$3:S50,S50)","v":"048"}]
[{"$f":" Recap!B51","v":"A49"},{"$f":"Recap!M51","v":44},{"$f":"Recap!O51","v":3},{"$f":"Recap!N51","v":24},49,344.76,40,{"$f":"RANK(G51,$G$3:$G$194,1)+COUNTIF(G$3:G51,G51)-1","v":40},{"$f":"IFERROR(INDEX(Liste!$G$7:$G$198,MATCH(K51,Liste!$I$7:$I$198,0)),\"\")","v":0},49,"A64",43,3,25,64,null,18,17,0,49,"A17",44,3,36,17,null,8,35943.75,25,{"$f":"RANK(AC51,$AC$3:$AC$194,1)+COUNTIF(AC$3:AC51,AC51)-1","v":25},null,{"$f":"S51&COUNTIF(S$3:S51,S51)","v":"049"}]
[{"$f":" Recap!B52","v":"A50"},{"$f":"Recap!M52","v":24},{"$f":"Recap!O52","v":1},{"$f":"Recap!N52","v":46},50,124.54,172,{"$f":"RANK(G52,$G$3:$G$194,1)+COUNTIF(G$3:G52,G52)-1","v":172},{"$f":"IFERROR(INDEX(Liste!$G$7:$G$198,MATCH(K52,Liste!$I$7:$I$198,0)),\"\")","v":0},49,"B64",43,3,25,128,null,18,null,0,49,"A35",44,3,36,35,null,8,35943.75,25,{"$f":"RANK(AC52,$AC$3:$AC$194,1)+COUNTIF(AC$3:AC52,AC52)-1","v":26},null,{"$f":"S52&COUNTIF(S$3:S52,S52)","v":"050"}]
[{"$f":" Recap!B53","v":"A51"},{"$f":"Recap!M53","v":40},{"$f":"Recap!O53","v":2},{"$f":"Recap!N53","v":38},51,240.62,91,{"$f":"RANK(G53,$G$3:$G$194,1)+COUNTIF(G$3:G53,G53)-1","v":91},{"$f":"IFERROR(INDEX(Liste!$G$7:$G$198,MATCH(K53,Liste!$I$7:$I$198,0)),\"\")","v":0},49,"C64",43,3,25,192,null,18,null,0,49,"B17",44,3,36,81,null,8,35943.75,25,{"$f":"RANK(AC53,$AC$3:$AC$194,1)+COUNTIF(AC$3:AC53,AC53)-1","v":27},null,{"$f":"S53&COUNTIF(S$3:S53,S53)","v":"051"}]
[{"$f":" Recap!B54","v":"A52"},{"$f":"Recap!M54","v":52},{"$f":"Recap!O54","v":4},{"$f":"Recap!N54","v":24},52,452.76,1,{"$f":"RANK(G54,$G$3:$G$194,1)+COUNTIF(G$3:G54,G54)-1","v":2},{"$f":"IFERROR(INDEX(Liste!$G$7:$G$198,MATCH(K54,Liste!$I$7:$I$198,0)),\"\")","v":0},52,"A63",41,3,25,63,null,16,18,0,49,"B35",44,3,36,99,null,8,35741.75,31,{"$f":"RANK(AC54,$AC$3:$AC$194,1)+COUNTIF(AC$3:AC54,AC54)-1","v":31},null,{"$f":"S54&COUNTIF(S$3:S54,S54)","v":"052"}]
[{"$f":" Recap!B55","v":"A53"},{"$f":"Recap!M55","v":35},{"$f":"Recap!O55","v":1},{"$f":"Recap!N55","v":47},53,135.53,142,{"$f":"RANK(G55,$G$3:$G$194,1)+COUNTIF(G$3:G55,G55)-1","v":142},{"$f":"IFERROR(INDEX(Liste!$G$7:$G$198,MATCH(K55,Liste!$I$7:$I$198,0)),\"\")","v":0},52,"B63",41,3,25,127,null,16,null,0,49,"C17",44,3,36,145,null,8,35741.75,31,{"$f":"RANK(AC55,$AC$3:$AC$194,1)+COUNTIF(AC$3:AC55,AC55)-1","v":32},null,{"$f":"S55&COUNTIF(S$3:S55,S55)","v":"053"}]
[{"$f":" Recap!B56","v":"A54"},{"$f":"Recap!M56","v":46},{"$f":"Recap!O56","v":3},{"$f":"Recap!N56","v":34},54,346.66,37,{"$f":"RANK(G56,$G$3:$G$194,1)+COUNTIF(G$3:G56,G56)-1","v":37},{"$f":"IFERROR(INDEX(Liste!$G$7:$G$198,MATCH(K56,Liste!$I$7:$I$198,0)),\"\")","v":0},52,"C63",41,3,25,191,null,16,null,0,49,"C35",44,3,36,163,null,8,35741.75,31,{"$f":"RANK(AC56,$AC$3:$AC$194,1)+COUNTIF(AC$3:AC56,AC56)-1","v":33},null,{"$f":"S56&COUNTIF(S$3:S56,S56)","v":"054"}]
[{"$f":" Recap!B57","v":"A55"},{"$f":"Recap!M57","v":21},{"$f":"Recap!O57","v":0},{"$f":"Recap!N57","v":52},55,21.48,181,{"$f":"RANK(G57,$G$3:$G$194,1)+COUNTIF(G$3:G57,G57)-1","v":183},{"$f":"IFERROR(INDEX(Liste!$G$7:$G$198,MATCH(K57,Liste!$I$7:$I$198,0)),\"\")","v":0},55,"A6",41,3,36,6,null,5,19,0,55,"A6",41,3,36,6,null,5,34641.64,55,{"$f":"RANK(AC57,$AC$3:$AC$194,1)+COUNTIF(AC$3:AC57,AC57)-1","v":55},null,{"$f":"S57&COUNTIF(S$3:S57,S57)","v":"055"}]
[{"$f":" Recap!B58","v":"A56"},{"$f":"Recap!M58","v":41},{"$f":"Recap!O58","v":2},{"$f":"Recap!N58","v":30},56,241.7,85,{"$f":"RANK(G58,$G$3:$G$194,1)+COUNTIF(G$3:G58,G58)-1","v":85},{"$f":"IFERROR(INDEX(Liste!$G$7:$G$198,MATCH(K58,Liste!$I$7:$I$198,0)),\"\")","v":0},55,"B6",41,3,36,70,null,5,null,0,55,"B6",41,3,36,70,null,5,34641.64,55,{"$f":"RANK(AC58,$AC$3:$AC$194,1)+COUNTIF(AC$3:AC58,AC58)-1","v":56},null,{"$f":"S58&COUNTIF(S$3:S58,S58)","v":"056"}]
[{"$f":" Recap!B59","v":"A57"},{"$f":"Recap!M59","v":32},{"$f":"Recap!O59","v":2},{"$f":"Recap!N59","v":38},57,232.62,127,{"$f":"RANK(G59,$G$3:$G$194,1)+COUNTIF(G$3:G59,G59)-1","v":127},{"$f":"IFERROR(INDEX(Liste!$G$7:$G$198,MATCH(K59,Liste!$I$7:$I$198,0)),\"\")","v":0},55,"C6",41,3,36,134,null,5,null,0,55,"C6",41,3,36,134,null,5,34641.64,55,{"$f":"RANK(AC59,$AC$3:$AC$194,1)+COUNTIF(AC$3:AC59,AC59)-1","v":57},null,{"$f":"S59&COUNTIF(S$3:S59,S59)","v":"057"}]
[{"$f":" Recap!B60","v":"A58"},{"$f":"Recap!M60","v":35},{"$f":"Recap!O60","v":2},{"$f":"Recap!N60","v":37},58,235.63,115,{"$f":"RANK(G60,$G$3:$G$194,1)+COUNTIF(G$3:G60,G60)-1","v":115},{"$f":"IFERROR(INDEX(Liste!$G$7:$G$198,MATCH(K60,Liste!$I$7:$I$198,0)),\"\")","v":0},58,"A10",40,3,39,10,null,1,20,0,58,"A10",40,3,39,10,null,1,34240.61,58,{"$f":"RANK(AC60,$AC$3:$AC$194,1)+COUNTIF(AC$3:AC60,AC60)-1","v":58},null,{"$f":"S60&COUNTIF(S$3:S60,S60)","v":"058"}]
[{"$f":" Recap!B61","v":"A59"},{"$f":"Recap!M61","v":32},{"$f":"Recap!O61","v":1},{"$f":"Recap!N61","v":43},59,132.57,151,{"$f":"RANK(G61,$G$3:$G$194,1)+COUNTIF(G$3:G61,G61)-1","v":151},{"$f":"IFERROR(INDEX(Liste!$G$7:$G$198,MATCH(K61,Liste!$I$7:$I$198,0)),\"\")","v":0},58,"B10",40,3,39,74,null,1,null,0,58,"B10",40,3,39,74,null,1,34240.61,58,{"$f":"RANK(AC61,$AC$3:$AC$194,1)+COUNTIF(AC$3:AC61,AC61)-1","v":59},null,{"$f":"S61&COUNTIF(S$3:S61,S61)","v":"059"}]
[{"$f":" Recap!B62","v":"A60"},{"$f":"Recap!M62","v":26},{"$f":"Recap!O62","v":1},{"$f":"Recap!N62","v":47},60,126.53,169,{"$f":"RANK(G62,$G$3:$G$194,1)+COUNTIF(G$3:G62,G62)-1","v":169},{"$f":"IFERROR(INDEX(Liste!$G$7:$G$198,MATCH(K62,Liste!$I$7:$I$198,0)),\"\")","v":0},58,"C10",40,3,39,138,null,1,null,0,58,"C10",40,3,39,138,null,1,34240.61,58,{"$f":"RANK(AC62,$AC$3:$AC$194,1)+COUNTIF(AC$3:AC62,AC62)-1","v":60},null,{"$f":"S62&COUNTIF(S$3:S62,S62)","v":"060"}]
[{"$f":" Recap!B63","v":"A61"},{"$f":"Recap!M63","v":37},{"$f":"Recap!O63","v":2},{"$f":"Recap!N63","v":34},61,237.66,112,{"$f":"RANK(G63,$G$3:$G$194,1)+COUNTIF(G$3:G63,G63)-1","v":112},{"$f":"IFERROR(INDEX(Liste!$G$7:$G$198,MATCH(K63,Liste!$I$7:$I$198,0)),\"\")","v":0},61,"A21",48,2,42,21,null,6,21,0,61,"A56",41,2,30,56,null,11,24748.58,79,{"$f":"RANK(AC63,$AC$3:$AC$194,1)+COUNTIF(AC$3:AC63,AC63)-1","v":79},null,{"$f":"S63&COUNTIF(S$3:S63,S63)","v":"061"}]
[{"$f":" Recap!B64","v":"A62"},{"$f":"Recap!M64","v":32},{"$f":"Recap!O64","v":2},{"$f":"Recap!N64","v":37},62,232.63,124,{"$f":"RANK(G64,$G$3:$G$194,1)+COUNTIF(G$3:G64,G64)-1","v":124},{"$f":"IFERROR(INDEX(Liste!$G$7:$G$198,MATCH(K64,Liste!$I$7:$I$198,0)),\"\")","v":0},61,"A43",48,2,42,43,null,6,null,0,61,"B56",41,2,30,120,null,11,24748.58,79,{"$f":"RANK(AC64,$AC$3:$AC$194,1)+COUNTIF(AC$3:AC64,AC64)-1","v":80},null,{"$f":"S64&COUNTIF(S$3:S64,S64)","v":"062"}]
[{"$f":" Recap!B65","v":"A63"},{"$f":"Recap!M65","v":41},{"$f":"Recap!O65","v":3},{"$f":"Recap!N65","v":25},63,341.75,52,{"$f":"RANK(G65,$G$3:$G$194,1)+COUNTIF(G$3:G65,G65)-1","v":52},{"$f":"IFERROR(INDEX(Liste!$G$7:$G$198,MATCH(K65,Liste!$I$7:$I$198,0)),\"\")","v":0},61,"B21",48,2,42,85,null,6,null,0,61,"C56",41,2,30,184,null,11,24748.58,79,{"$f":"RANK(AC65,$AC$3:$AC$194,1)+COUNTIF(AC$3:AC65,AC65)-1","v":81},null,{"$f":"S65&COUNTIF(S$3:S65,S65)","v":"063"}]
[{"$f":" Recap!B66","v":"A64"},{"$f":"Recap!M66","v":43},{"$f":"Recap!O66","v":3},{"$f":"Recap!N66","v":25},64,343.75,49,{"$f":"RANK(G66,$G$3:$G$194,1)+COUNTIF(G$3:G66,G66)-1","v":49},{"$f":"IFERROR(INDEX(Liste!$G$7:$G$198,MATCH(K66,Liste!$I$7:$I$198,0)),\"\")","v":0},61,"B43",48,2,42,107,null,6,22,0,64,"A45",45,2,35,45,null,10,24748.58,79,{"$f":"RANK(AC66,$AC$3:$AC$194,1)+COUNTIF(AC$3:AC66,AC66)-1","v":82},null,{"$f":"S66&COUNTIF(S$3:S66,S66)","v":"064"}]
[{"$f":" Recap!B67","v":"B1"},{"$f":"Recap!M67","v":19},{"$f":"Recap!O67","v":1},{"$f":"Recap!N67","v":41},65,{"$f":"100*C67+B67+(100-D67)/100","v":119.59},178,{"$f":"RANK(G67,$G$3:$G$194,1)+COUNTIF(G$3:G67,G67)-1","v":179},{"$f":"IFERROR(INDEX(Liste!$G$7:$G$198,MATCH(K67,Liste!$I$7:$I$198,0)),\"\")","v":0},{"$f":"INDEX(G:G,MATCH(ROW()-2,H:H,0))","v":61},{"$f":"INDEX(A:A,MATCH(ROW()-2,H:H,0))","v":"C21"},{"$f":"INDEX(B:B,MATCH(ROW()-2,H:H,0))","v":48},{"$f":"INDEX(C:C,MATCH(K67,A:A,0))","v":2},{"$f":"INDEX(D:D,MATCH(ROW()-2,H:H,0))","v":42},{"$f":"INDEX(E:E,MATCH(ROW()-2,H:H,0))","v":149},null,{"$f":"IF(SUM(M67:N67)=0,-1000,L67-N67)","v":6},null,{"$f":"INDEX(I:I,MATCH(U67,K:K,0))","v":0},64,{"$f":"INDEX(K:K,MATCH(ROW()-2,$AD:$AD,0))","v":"B45"},{"$f":"INDEX(L:L,MATCH(ROW()-2,$AD:$AD,0))","v":45},{"$f":"INDEX(M:M,MATCH(ROW()-2,$AD:$AD,0))","v":2},{"$f":"INDEX(N:N,MATCH(ROW()-2,$AD:$AD,0))","v":35},{"$f":"INDEX(O:O,MATCH(ROW()-2,$AD:$AD,0))","v":109},null,10,24748.58,79,{"$f":"RANK(AC67,$AC$3:$AC$194,1)+COUNTIF(AC$3:AC67,AC67)-1","v":83},null,{"$f":"S67&COUNTIF(S$3:S67,S67)","v":"065"}]
[{"$f":" Recap!B68","v":"B2"},{"$f":"Recap!M68","v":11},{"$f":"Recap!O68","v":0},{"$f":"Recap!N68","v":52},{"$f":"ROW()-2","v":66},11.48,{"$f":"RANK(F68,$F$3:$F$194,0)","v":190},{"$f":"RANK(G68,$G$3:$G$194,1)+COUNTIF(G$3:G68,G68)-1","v":191},{"$f":"IFERROR(INDEX(Liste!$G$7:$G$198,MATCH(K68,Liste!$I$7:$I$198,0)),\"\")","v":0},61,"C43",48,2,42,171,null,6,null,0,{"$f":"INDEX(AC:AC,MATCH(ROW()-2,AD:AD,0))","v":64},"C45",45,2,35,173,null,{"$f":"V68-X68","v":10},{"$f":"$M68*10000+($Q68+ABS(MIN($Q:$Q)))*100+$L68+(100-$N68)/100","v":24748.58},{"$f":"RANK(AB68,$AB$3:$AB$194,0)","v":79},{"$f":"RANK(AC68,$AC$3:$AC$194,1)+COUNTIF(AC$3:AC68,AC68)-1","v":84},null,{"$f":"S68&COUNTIF(S$3:S68,S68)","v":"066"}]
[{"$f":" Recap!B69","v":"B3"},{"$f":"Recap!M69","v":30},{"$f":"Recap!O69","v":1},{"$f":"Recap!N69","v":41},67,130.59,154,{"$f":"RANK(G69,$G$3:$G$194,1)+COUNTIF(G$3:G69,G69)-1","v":156},{"$f":"IFERROR(INDEX(Liste!$G$7:$G$198,MATCH(K69,Liste!$I$7:$I$198,0)),\"\")","v":0},67,"A45",45,2,35,45,null,10,23,0,67,"A13",43,2,33,13,null,10,25145.65,64,{"$f":"RANK(AC69,$AC$3:$AC$194,1)+COUNTIF(AC$3:AC69,AC69)-1","v":64},null,{"$f":"S69&COUNTIF(S$3:S69,S69)","v":"067"}]
[{"$f":" Recap!B70","v":"B4"},{"$f":"Recap!M70","v":30},{"$f":"Recap!O70","v":2},{"$f":"Recap!N70","v":38},68,230.62,130,{"$f":"RANK(G70,$G$3:$G$194,1)+COUNTIF(G$3:G70,G70)-1","v":131},{"$f":"IFERROR(INDEX(Liste!$G$7:$G$198,MATCH(K70,Liste!$I$7:$I$198,0)),\"\")","v":0},67,"B45",45,2,35,109,null,10,null,0,67,"B13",43,2,33,77,null,10,25145.65,64,{"$f":"RANK(AC70,$AC$3:$AC$194,1)+COUNTIF(AC$3:AC70,AC70)-1","v":65},null,{"$f":"S70&COUNTIF(S$3:S70,S70)","v":"068"}]
[{"$f":" Recap!B71","v":"B5"},{"$f":"Recap!M71","v":42},{"$f":"Recap!O71","v":2},{"$f":"Recap!N71","v":38},69,242.62,82,{"$f":"RANK(G71,$G$3:$G$194,1)+COUNTIF(G$3:G71,G71)-1","v":83},{"$f":"IFERROR(INDEX(Liste!$G$7:$G$198,MATCH(K71,Liste!$I$7:$I$198,0)),\"\")","v":0},67,"C45",45,2,35,173,null,10,null,0,67,"C13",43,2,33,141,null,10,25145.65,64,{"$f":"RANK(AC71,$AC$3:$AC$194,1)+COUNTIF(AC$3:AC71,AC71)-1","v":66},null,{"$f":"S71&COUNTIF(S$3:S71,S71)","v":"069"}]
[{"$f":" Recap!B72","v":"B6"},{"$f":"Recap!M72","v":41},{"$f":"Recap!O72","v":3},{"$f":"Recap!N72","v":36},70,341.64,55,{"$f":"RANK(G72,$G$3:$G$194,1)+COUNTIF(G$3:G72,G72)-1","v":56},{"$f":"IFERROR(INDEX(Liste!$G$7:$G$198,MATCH(K72,Liste!$I$7:$I$198,0)),\"\")","v":0},70,"A24",45,2,38,24,null,7,24,0,70,"A8",38,2,30,8,null,8,24845.62,73,{"$f":"RANK(AC72,$AC$3:$AC$194,1)+COUNTIF(AC$3:AC72,AC72)-1","v":73},null,{"$f":"S72&COUNTIF(S$3:S72,S72)","v":"070"}]
[{"$f":" Recap!B73","v":"B7"},{"$f":"Recap!M73","v":30},{"$f":"Recap!O73","v":1},{"$f":"Recap!N73","v":41},71,130.59,154,{"$f":"RANK(G73,$G$3:$G$194,1)+COUNTIF(G$3:G73,G73)-1","v":157},{"$f":"IFERROR(INDEX(Liste!$G$7:$G$198,MATCH(K73,Liste!$I$7:$I$198,0)),\"\")","v":0},70,"B24",45,2,38,88,null,7,null,0,70,"B8",38,2,30,72,null,8,24845.62,73,{"$f":"RANK(AC73,$AC$3:$AC$194,1)+COUNTIF(AC$3:AC73,AC73)-1","v":74},null,{"$f":"S73&COUNTIF(S$3:S73,S73)","v":"071"}]
[{"$f":" Recap!B74","v":"B8"},{"$f":"Recap!M74","v":38},{"$f":"Recap!O74","v":2},{"$f":"Recap!N74","v":30},72,238.7,97,{"$f":"RANK(G74,$G$3:$G$194,1)+COUNTIF(G$3:G74,G74)-1","v":98},{"$f":"IFERROR(INDEX(Liste!$G$7:$G$198,MATCH(K74,Liste!$I$7:$I$198,0)),\"\")","v":0},70,"C24",45,2,38,152,null,7,null,0,70,"C8",38,2,30,136,null,8,24845.62,73,{"$f":"RANK(AC74,$AC$3:$AC$194,1)+COUNTIF(AC$3:AC74,AC74)-1","v":75},null,{"$f":"S74&COUNTIF(S$3:S74,S74)","v":"072"}]
[{"$f":" Recap!B75","v":"B9"},{"$f":"Recap!M75","v":52},{"$f":"Recap!O75","v":4},{"$f":"Recap!N75","v":24},73,452.76,1,{"$f":"RANK(G75,$G$3:$G$194,1)+COUNTIF(G$3:G75,G75)-1","v":3},{"$f":"IFERROR(INDEX(Liste!$G$7:$G$198,MATCH(K75,Liste!$I$7:$I$198,0)),\"\")","v":0},73,"A11",45,2,41,11,null,4,25,0,73,"A24",45,2,38,24,null,7,24545.59,91,{"$f":"RANK(AC75,$AC$3:$AC$194,1)+COUNTIF(AC$3:AC75,AC75)-1","v":91},null,{"$f":"S75&COUNTIF(S$3:S75,S75)","v":"073"}]
[{"$f":" Recap!B76","v":"B10"},{"$f":"Recap!M76","v":40},{"$f":"Recap!O76","v":3},{"$f":"Recap!N76","v":39},74,340.61,58,{"$f":"RANK(G76,$G$3:$G$194,1)+COUNTIF(G$3:G76,G76)-1","v":59},{"$f":"IFERROR(INDEX(Liste!$G$7:$G$198,MATCH(K76,Liste!$I$7:$I$198,0)),\"\")","v":0},73,"B11",45,2,41,75,null,4,null,0,73,"B24",45,2,38,88,null,7,24545.59,91,{"$f":"RANK(AC76,$AC$3:$AC$194,1)+COUNTIF(AC$3:AC76,AC76)-1","v":92},null,{"$f":"S76&COUNTIF(S$3:S76,S76)","v":"074"}]
[{"$f":" Recap!B77","v":"B11"},{"$f":"Recap!M77","v":45},{"$f":"Recap!O77","v":2},{"$f":"Recap!N77","v":41},75,245.59,73,{"$f":"RANK(G77,$G$3:$G$194,1)+COUNTIF(G$3:G77,G77)-1","v":74},{"$f":"IFERROR(INDEX(Liste!$G$7:$G$198,MATCH(K77,Liste!$I$7:$I$198,0)),\"\")","v":0},73,"C11",45,2,41,139,null,4,null,0,73,"C24",45,2,38,152,null,7,24545.59,91,{"$f":"RANK(AC77,$AC$3:$AC$194,1)+COUNTIF(AC$3:AC77,AC77)-1","v":93},null,{"$f":"S77&COUNTIF(S$3:S77,S77)","v":"075"}]
[{"$f":" Recap!B78","v":"B12"},{"$f":"Recap!M78","v":50},{"$f":"Recap!O78","v":3},{"$f":"Recap!N78","v":33},76,350.67,13,{"$f":"RANK(G78,$G$3:$G$194,1)+COUNTIF(G$3:G78,G78)-1","v":14},{"$f":"IFERROR(INDEX(Liste!$G$7:$G$198,MATCH(K78,Liste!$I$7:$I$198,0)),\"\")","v":0},76,"A13",43,2,33,13,null,10,26,0,76,"A28",43,2,36,28,null,7,25143.67,67,{"$f":"RANK(AC78,$AC$3:$AC$194,1)+COUNTIF(AC$3:AC78,AC78)-1","v":67},null,{"$f":"S78&COUNTIF(S$3:S78,S78)","v":"076"}]
[{"$f":" Recap!B79","v":"B13"},{"$f":"Recap!M79","v":43},{"$f":"Recap!O79","v":2},{"$f":"Recap!N79","v":33},77,243.67,76,{"$f":"RANK(G79,$G$3:$G$194,1)+COUNTIF(G$3:G79,G79)-1","v":77},{"$f":"IFERROR(INDEX(Liste!$G$7:$G$198,MATCH(K79,Liste!$I$7:$I$198,0)),\"\")","v":0},76,"B13",43,2,33,77,null,10,null,0,76,"B28",43,2,36,92,null,7,25143.67,67,{"$f":"RANK(AC79,$AC$3:$AC$194,1)+COUNTIF(AC$3:AC79,AC79)-1","v":68},null,{"$f":"S79&COUNTIF(S$3:S79,S79)","v":"077"}]
[{"$f":" Recap!B80","v":"B14"},{"$f":"Recap!M80","v":49},{"$f":"Recap!O80","v":3},{"$f":"Recap!N80","v":24},78,349.76,25,{"$f":"RANK(G80,$G$3:$G$194,1)+COUNTIF(G$3:G80,G80)-1","v":26},{"$f":"IFERROR(INDEX(Liste!$G$7:$G$198,MATCH(K80,Liste!$I$7:$I$198,0)),\"\")","v":0},76,"C13",43,2,33,141,null,10,null,0,76,"C28",43,2,36,156,null,7,25143.67,67,{"$f":"RANK(AC80,$AC$3:$AC$194,1)+COUNTIF(AC$3:AC80,AC80)-1","v":69},null,{"$f":"S80&COUNTIF(S$3:S80,S80)","v":"078"}]
[{"$f":" Recap!B81","v":"B15"},{"$f":"Recap!M81","v":38},{"$f":"Recap!O81","v":2},{"$f":"Recap!N81","v":32},79,238.68,100,{"$f":"RANK(G81,$G$3:$G$194,1)+COUNTIF(G$3:G81,G81)-1","v":101},{"$f":"IFERROR(INDEX(Liste!$G$7:$G$198,MATCH(K81,Liste!$I$7:$I$198,0)),\"\")","v":0},79,"A28",43,2,36,28,null,7,27,0,79,"A21",48,2,42,21,null,6,24843.64,76,{"$f":"RANK(AC81,$AC$3:$AC$194,1)+COUNTIF(AC$3:AC81,AC81)-1","v":76},null,{"$f":"S81&COUNTIF(S$3:S81,S81)","v":"079"}]
[{"$f":" Recap!B82","v":"B16"},{"$f":"Recap!M82","v":29},{"$f":"Recap!O82","v":1},{"$f":"Recap!N82","v":44},80,129.56,160,{"$f":"RANK(G82,$G$3:$G$194,1)+COUNTIF(G$3:G82,G82)-1","v":161},{"$f":"IFERROR(INDEX(Liste!$G$7:$G$198,MATCH(K82,Liste!$I$7:$I$198,0)),\"\")","v":0},79,"B28",43,2,36,92,null,7,null,0,79,"A43",48,2,42,43,null,6,24843.64,76,{"$f":"RANK(AC82,$AC$3:$AC$194,1)+COUNTIF(AC$3:AC82,AC82)-1","v":77},null,{"$f":"S82&COUNTIF(S$3:S82,S82)","v":"080"}]
[{"$f":" Recap!B83","v":"B17"},{"$f":"Recap!M83","v":44},{"$f":"Recap!O83","v":3},{"$f":"Recap!N83","v":36},81,344.64,43,{"$f":"RANK(G83,$G$3:$G$194,1)+COUNTIF(G$3:G83,G83)-1","v":45},{"$f":"IFERROR(INDEX(Liste!$G$7:$G$198,MATCH(K83,Liste!$I$7:$I$198,0)),\"\")","v":0},79,"C28",43,2,36,156,null,7,null,0,79,"B21",48,2,42,85,null,6,24843.64,76,{"$f":"RANK(AC83,$AC$3:$AC$194,1)+COUNTIF(AC$3:AC83,AC83)-1","v":78},null,{"$f":"S83&COUNTIF(S$3:S83,S83)","v":"081"}]
[{"$f":" Recap!B84","v":"B18"},{"$f":"Recap!M84","v":33},{"$f":"Recap!O84","v":2},{"$f":"Recap!N84","v":45},82,233.55,121,{"$f":"RANK(G84,$G$3:$G$194,1)+COUNTIF(G$3:G84,G84)-1","v":122},{"$f":"IFERROR(INDEX(Liste!$G$7:$G$198,MATCH(K84,Liste!$I$7:$I$198,0)),\"\")","v":0},82,"A5",42,2,38,5,null,4,28,0,79,"B43",48,2,42,107,null,6,24542.62,94,{"$f":"RANK(AC84,$AC$3:$AC$194,1)+COUNTIF(AC$3:AC84,AC84)-1","v":94},null,{"$f":"S84&COUNTIF(S$3:S84,S84)","v":"082"}]
[{"$f":" Recap!B85","v":"B19"},{"$f":"Recap!M85","v":49},{"$f":"Recap!O85","v":3},{"$f":"Recap!N85","v":37},83,349.63,34,{"$f":"RANK(G85,$G$3:$G$194,1)+COUNTIF(G$3:G85,G85)-1","v":35},{"$f":"IFERROR(INDEX(Liste!$G$7:$G$198,MATCH(K85,Liste!$I$7:$I$198,0)),\"\")","v":0},82,"B5",42,2,38,69,null,4,null,0,79,"C21",48,2,42,149,null,6,24542.62,94,{"$f":"RANK(AC85,$AC$3:$AC$194,1)+COUNTIF(AC$3:AC85,AC85)-1","v":95},null,{"$f":"S85&COUNTIF(S$3:S85,S85)","v":"083"}]
[{"$f":" Recap!B86","v":"B20"},{"$f":"Recap!M86","v":52},{"$f":"Recap!O86","v":4},{"$f":"Recap!N86","v":36},84,452.64,7,{"$f":"RANK(G86,$G$3:$G$194,1)+COUNTIF(G$3:G86,G86)-1","v":8},{"$f":"IFERROR(INDEX(Liste!$G$7:$G$198,MATCH(K86,Liste!$I$7:$I$198,0)),\"\")","v":0},82,"C5",42,2,38,133,null,4,null,0,79,"C43",48,2,42,171,null,6,24542.62,94,{"$f":"RANK(AC86,$AC$3:$AC$194,1)+COUNTIF(AC$3:AC86,AC86)-1","v":96},null,{"$f":"S86&COUNTIF(S$3:S86,S86)","v":"084"}]
[{"$f":" Recap!B87","v":"B21"},{"$f":"Recap!M87","v":48},{"$f":"Recap!O87","v":2},{"$f":"Recap!N87","v":42},85,248.58,61,{"$f":"RANK(G87,$G$3:$G$194,1)+COUNTIF(G$3:G87,G87)-1","v":63},{"$f":"IFERROR(INDEX(Liste!$G$7:$G$198,MATCH(K87,Liste!$I$7:$I$198,0)),\"\")","v":0},85,"A56",41,2,30,56,null,11,29,0,85,"A36",41,2,35,36,null,6,25241.7,61,{"$f":"RANK(AC87,$AC$3:$AC$194,1)+COUNTIF(AC$3:AC87,AC87)-1","v":61},null,{"$f":"S87&COUNTIF(S$3:S87,S87)","v":"085"}]
[{"$f":" Recap!B88","v":"B22"},{"$f":"Recap!M88","v":50},{"$f":"Recap!O88","v":3},{"$f":"Recap!N88","v":42},86,350.58,22,{"$f":"RANK(G88,$G$3:$G$194,1)+COUNTIF(G$3:G88,G88)-1","v":23},{"$f":"IFERROR(INDEX(Liste!$G$7:$G$198,MATCH(K88,Liste!$I$7:$I$198,0)),\"\")","v":0},85,"B56",41,2,30,120,null,11,null,0,85,"B36",41,2,35,100,null,6,25241.7,61,{"$f":"RANK(AC88,$AC$3:$AC$194,1)+COUNTIF(AC$3:AC88,AC88)-1","v":62},null,{"$f":"S88&COUNTIF(S$3:S88,S88)","v":"086"}]
[{"$f":" Recap!B89","v":"B23"},{"$f":"Recap!M89","v":34},{"$f":"Recap!O89","v":1},{"$f":"Recap!N89","v":47},87,134.53,148,{"$f":"RANK(G89,$G$3:$G$194,1)+COUNTIF(G$3:G89,G89)-1","v":149},{"$f":"IFERROR(INDEX(Liste!$G$7:$G$198,MATCH(K89,Liste!$I$7:$I$198,0)),\"\")","v":0},85,"C56",41,2,30,184,null,11,null,0,85,"C36",41,2,35,164,null,6,25241.7,61,{"$f":"RANK(AC89,$AC$3:$AC$194,1)+COUNTIF(AC$3:AC89,AC89)-1","v":63},null,{"$f":"S89&COUNTIF(S$3:S89,S89)","v":"087"}]
[{"$f":" Recap!B90","v":"B24"},{"$f":"Recap!M90","v":45},{"$f":"Recap!O90","v":2},{"$f":"Recap!N90","v":38},88,245.62,70,{"$f":"RANK(G90,$G$3:$G$194,1)+COUNTIF(G$3:G90,G90)-1","v":71},{"$f":"IFERROR(INDEX(Liste!$G$7:$G$198,MATCH(K90,Liste!$I$7:$I$198,0)),\"\")","v":0},88,"A36",41,2,35,36,null,6,30,0,88,"A15",38,2,32,15,null,6,24741.65,85,{"$f":"RANK(AC90,$AC$3:$AC$194,1)+COUNTIF(AC$3:AC90,AC90)-1","v":85},null,{"$f":"S90&COUNTIF(S$3:S90,S90)","v":"088"}]
[{"$f":" Recap!B91","v":"B25"},{"$f":"Recap!M91","v":49},{"$f":"Recap!O91","v":3},{"$f":"Recap!N91","v":27},89,349.73,28,{"$f":"RANK(G91,$G$3:$G$194,1)+COUNTIF(G$3:G91,G91)-1","v":29},{"$f":"IFERROR(INDEX(Liste!$G$7:$G$198,MATCH(K91,Liste!$I$7:$I$198,0)),\"\")","v":0},88,"B36",41,2,35,100,null,6,null,0,88,"B15",38,2,32,79,null,6,24741.65,85,{"$f":"RANK(AC91,$AC$3:$AC$194,1)+COUNTIF(AC$3:AC91,AC91)-1","v":86},null,{"$f":"S91&COUNTIF(S$3:S91,S91)","v":"089"}]
[{"$f":" Recap!B92","v":"B26"},{"$f":"Recap!M92","v":39},{"$f":"Recap!O92","v":2},{"$f":"Recap!N92","v":35},90,239.65,94,{"$f":"RANK(G92,$G$3:$G$194,1)+COUNTIF(G$3:G92,G92)-1","v":95},{"$f":"IFERROR(INDEX(Liste!$G$7:$G$198,MATCH(K92,Liste!$I$7:$I$198,0)),\"\")","v":0},88,"C36",41,2,35,164,null,6,null,0,88,"C15",38,2,32,143,null,6,24741.65,85,{"$f":"RANK(AC92,$AC$3:$AC$194,1)+COUNTIF(AC$3:AC92,AC92)-1","v":87},null,{"$f":"S92&COUNTIF(S$3:S92,S92)","v":"090"}]
[{"$f":" Recap!B93","v":"B27"},{"$f":"Recap!M93","v":36},{"$f":"Recap!O93","v":1},{"$f":"Recap!N93","v":41},91,136.59,136,{"$f":"RANK(G93,$G$3:$G$194,1)+COUNTIF(G$3:G93,G93)-1","v":137},{"$f":"IFERROR(INDEX(Liste!$G$7:$G$198,MATCH(K93,Liste!$I$7:$I$198,0)),\"\")","v":0},91,"A51",40,2,38,51,null,2,31,0,91,"A11",45,2,41,11,null,4,24340.62,106,{"$f":"RANK(AC93,$AC$3:$AC$194,1)+COUNTIF(AC$3:AC93,AC93)-1","v":106},null,{"$f":"S93&COUNTIF(S$3:S93,S93)","v":"091"}]
[{"$f":" Recap!B94","v":"B28"},{"$f":"Recap!M94","v":43},{"$f":"Recap!O94","v":2},{"$f":"Recap!N94","v":36},92,243.64,79,{"$f":"RANK(G94,$G$3:$G$194,1)+COUNTIF(G$3:G94,G94)-1","v":80},{"$f":"IFERROR(INDEX(Liste!$G$7:$G$198,MATCH(K94,Liste!$I$7:$I$198,0)),\"\")","v":0},91,"B51",40,2,38,115,null,2,null,0,91,"B11",45,2,41,75,null,4,24340.62,106,{"$f":"RANK(AC94,$AC$3:$AC$194,1)+COUNTIF(AC$3:AC94,AC94)-1","v":107},null,{"$f":"S94&COUNTIF(S$3:S94,S94)","v":"092"}]
[{"$f":" Recap!B95","v":"B29"},{"$f":"Recap!M95","v":21},{"$f":"Recap!O95","v":0},{"$f":"Recap!N95","v":52},93,21.48,181,{"$f":"RANK(G95,$G$3:$G$194,1)+COUNTIF(G$3:G95,G95)-1","v":184},{"$f":"IFERROR(INDEX(Liste!$G$7:$G$198,MATCH(K95,Liste!$I$7:$I$198,0)),\"\")","v":0},91,"C51",40,2,38,179,null,2,null,0,91,"C11",45,2,41,139,null,4,24340.62,106,{"$f":"RANK(AC95,$AC$3:$AC$194,1)+COUNTIF(AC$3:AC95,AC95)-1","v":108},null,{"$f":"S95&COUNTIF(S$3:S95,S95)","v":"093"}]
[{"$f":" Recap!B96","v":"B30"},{"$f":"Recap!M96","v":29},{"$f":"Recap!O96","v":1},{"$f":"Recap!N96","v":46},94,129.54,163,{"$f":"RANK(G96,$G$3:$G$194,1)+COUNTIF(G$3:G96,G96)-1","v":164},{"$f":"IFERROR(INDEX(Liste!$G$7:$G$198,MATCH(K96,Liste!$I$7:$I$198,0)),\"\")","v":0},94,"A26",39,2,35,26,null,4,32,0,94,"A5",42,2,38,5,null,4,24539.65,97,{"$f":"RANK(AC96,$AC$3:$AC$194,1)+COUNTIF(AC$3:AC96,AC96)-1","v":97},null,{"$f":"S96&COUNTIF(S$3:S96,S96)","v":"094"}]
[{"$f":" Recap!B97","v":"B31"},{"$f":"Recap!M97","v":38},{"$f":"Recap!O97","v":2},{"$f":"Recap!N97","v":34},95,238.66,103,{"$f":"RANK(G97,$G$3:$G$194,1)+COUNTIF(G$3:G97,G97)-1","v":104},{"$f":"IFERROR(INDEX(Liste!$G$7:$G$198,MATCH(K97,Liste!$I$7:$I$198,0)),\"\")","v":0},94,"B26",39,2,35,90,null,4,null,0,94,"B5",42,2,38,69,null,4,24539.65,97,{"$f":"RANK(AC97,$AC$3:$AC$194,1)+COUNTIF(AC$3:AC97,AC97)-1","v":98},null,{"$f":"S97&COUNTIF(S$3:S97,S97)","v":"095"}]
[{"$f":" Recap!B98","v":"B32"},{"$f":"Recap!M98","v":27},{"$f":"Recap!O98","v":1},{"$f":"Recap!N98","v":43},96,127.57,166,{"$f":"RANK(G98,$G$3:$G$194,1)+COUNTIF(G$3:G98,G98)-1","v":167},{"$f":"IFERROR(INDEX(Liste!$G$7:$G$198,MATCH(K98,Liste!$I$7:$I$198,0)),\"\")","v":0},94,"C26",39,2,35,154,null,4,null,0,94,"C5",42,2,38,133,null,4,24539.65,97,{"$f":"RANK(AC98,$AC$3:$AC$194,1)+COUNTIF(AC$3:AC98,AC98)-1","v":99},null,{"$f":"S98&COUNTIF(S$3:S98,S98)","v":"096"}]
[{"$f":" Recap!B99","v":"B33"},{"$f":"Recap!M99","v":22},{"$f":"Recap!O99","v":1},{"$f":"Recap!N99","v":46},97,122.54,175,{"$f":"RANK(G99,$G$3:$G$194,1)+COUNTIF(G$3:G99,G99)-1","v":176},{"$f":"IFERROR(INDEX(Liste!$G$7:$G$198,MATCH(K99,Liste!$I$7:$I$198,0)),\"\")","v":0},{"$f":"INDEX(G:G,MATCH(ROW()-2,H:H,0))","v":97},{"$f":"INDEX(A:A,MATCH(ROW()-2,H:H,0))","v":"A8"},{"$f":"INDEX(B:B,MATCH(ROW()-2,H:H,0))","v":38},2,{"$f":"INDEX(D:D,MATCH(ROW()-2,H:H,0))","v":30},{"$f":"INDEX(E:E,MATCH(ROW()-2,H:H,0))","v":8},null,8,33,{"$f":"INDEX(I:I,MATCH(U99,K:K,0))","v":0},97,{"$f":"INDEX(K:K,MATCH(ROW()-2,$AD:$AD,0))","v":"A26"},{"$f":"INDEX(L:L,MATCH(ROW()-2,$AD:$AD,0))","v":39},{"$f":"INDEX(M:M,MATCH(ROW()-2,$AD:$AD,0))","v":2},{"$f":"INDEX(N:N,MATCH(ROW()-2,$AD:$AD,0))","v":35},{"$f":"INDEX(O:O,MATCH(ROW()-2,$AD:$AD,0))","v":26},null,4,24938.7,70,{"$f":"RANK(AC99,$AC$3:$AC$194,1)+COUNTIF(AC$3:AC99,AC99)-1","v":70},null,{"$f":"S99&COUNTIF(S$3:S99,S99)","v":"097"}]
[{"$f":" Recap!B100","v":"B34"},{"$f":"Recap!M100","v":33},{"$f":"Recap!O100","v":2},{"$f":"Recap!N100","v":39},98,233.61,118,{"$f":"RANK(G100,$G$3:$G$194,1)+COUNTIF(G$3:G100,G100)-1","v":119},{"$f":"IFERROR(INDEX(Liste!$G$7:$G$198,MATCH(K100,Liste!$I$7:$I$198,0)),\"\")","v":0},97,"B8",38,2,30,72,null,8,null,0,97,"B26",39,2,35,90,null,4,24938.7,70,{"$f":"RANK(AC100,$AC$3:$AC$194,1)+COUNTIF(AC$3:AC100,AC100)-1","v":71},null,{"$f":"S100&COUNTIF(S$3:S100,S100)","v":"098"}]
[{"$f":" Recap!B101","v":"B35"},{"$f":"Recap!M101","v":44},{"$f":"Recap!O101","v":3},{"$f":"Recap!N101","v":36},99,344.64,43,{"$f":"RANK(G101,$G$3:$G$194,1)+COUNTIF(G$3:G101,G101)-1","v":46},{"$f":"IFERROR(INDEX(Liste!$G$7:$G$198,MATCH(K101,Liste!$I$7:$I$198,0)),\"\")","v":0},97,"C8",38,2,30,136,null,8,null,0,97,"C26",39,2,35,154,null,4,24938.7,70,{"$f":"RANK(AC101,$AC$3:$AC$194,1)+COUNTIF(AC$3:AC101,AC101)-1","v":72},null,{"$f":"S101&COUNTIF(S$3:S101,S101)","v":"099"}]
[{"$f":" Recap!B102","v":"B36"},{"$f":"Recap!M102","v":41},{"$f":"Recap!O102","v":2},{"$f":"Recap!N102","v":35},100,241.65,88,{"$f":"RANK(G102,$G$3:$G$194,1)+COUNTIF(G$3:G102,G102)-1","v":89},{"$f":"IFERROR(INDEX(Liste!$G$7:$G$198,MATCH(K102,Liste!$I$7:$I$198,0)),\"\")","v":0},100,"A15",38,2,32,15,null,6,34,0,100,"A31",38,2,34,31,null,4,24738.68,88,{"$f":"RANK(AC102,$AC$3:$AC$194,1)+COUNTIF(AC$3:AC102,AC102)-1","v":88},null,{"$f":"S102&COUNTIF(S$3:S102,S102)","v":"0100"}]
[{"$f":" Recap!B103","v":"B37"},{"$f":"Recap!M103","v":52},{"$f":"Recap!O103","v":4},{"$f":"Recap!N103","v":37},101,452.63,10,{"$f":"RANK(G103,$G$3:$G$194,1)+COUNTIF(G$3:G103,G103)-1","v":11},{"$f":"IFERROR(INDEX(Liste!$G$7:$G$198,MATCH(K103,Liste!$I$7:$I$198,0)),\"\")","v":0},100,"B15",38,2,32,79,null,6,null,0,100,"B31",38,2,34,95,null,4,24738.68,88,{"$f":"RANK(AC103,$AC$3:$AC$194,1)+COUNTIF(AC$3:AC103,AC103)-1","v":89},null,{"$f":"S103&COUNTIF(S$3:S103,S103)","v":"0101"}]
[{"$f":" Recap!B104","v":"B38"},{"$f":"Recap!M104","v":50},{"$f":"Recap!O104","v":3},{"$f":"Recap!N104","v":35},102,350.65,16,{"$f":"RANK(G104,$G$3:$G$194,1)+COUNTIF(G$3:G104,G104)-1","v":17},{"$f":"IFERROR(INDEX(Liste!$G$7:$G$198,MATCH(K104,Liste!$I$7:$I$198,0)),\"\")","v":0},100,"C15",38,2,32,143,null,6,null,0,100,"C31",38,2,34,159,null,4,24738.68,88,{"$f":"RANK(AC104,$AC$3:$AC$194,1)+COUNTIF(AC$3:AC104,AC104)-1","v":90},null,{"$f":"S104&COUNTIF(S$3:S104,S104)","v":"0102"}]
[{"$f":" Recap!B105","v":"B39"},{"$f":"Recap!M105","v":49},{"$f":"Recap!O105","v":3},{"$f":"Recap!N105","v":31},103,349.69,31,{"$f":"RANK(G105,$G$3:$G$194,1)+COUNTIF(G$3:G105,G105)-1","v":32},{"$f":"IFERROR(INDEX(Liste!$G$7:$G$198,MATCH(K105,Liste!$I$7:$I$198,0)),\"\")","v":0},103,"A31",38,2,34,31,null,4,35,0,103,"A61",37,2,34,61,null,3,24538.66,100,{"$f":"RANK(AC105,$AC$3:$AC$194,1)+COUNTIF(AC$3:AC105,AC105)-1","v":100},null,{"$f":"S105&COUNTIF(S$3:S105,S105)","v":"0103"}]
[{"$f":" Recap!B106","v":"B40"},{"$f":"Recap!M106","v":38},{"$f":"Recap!O106","v":2},{"$f":"Recap!N106","v":38},104,238.62,106,{"$f":"RANK(G106,$G$3:$G$194,1)+COUNTIF(G$3:G106,G106)-1","v":107},{"$f":"IFERROR(INDEX(Liste!$G$7:$G$198,MATCH(K106,Liste!$I$7:$I$198,0)),\"\")","v":0},103,"B31",38,2,34,95,null,4,null,0,103,"B61",37,2,34,125,null,3,24538.66,100,{"$f":"RANK(AC106,$AC$3:$AC$194,1)+COUNTIF(AC$3:AC106,AC106)-1","v":101},null,{"$f":"S106&COUNTIF(S$3:S106,S106)","v":"0104"}]
[{"$f":" Recap!B107","v":"B41"},{"$f":"Recap!M107","v":38},{"$f":"Recap!O107","v":2},{"$f":"Recap!N107","v":45},105,238.55,109,{"$f":"RANK(G107,$G$3:$G$194,1)+COUNTIF(G$3:G107,G107)-1","v":110},{"$f":"IFERROR(INDEX(Liste!$G$7:$G$198,MATCH(K107,Liste!$I$7:$I$198,0)),\"\")","v":0},103,"C31",38,2,34,159,null,4,null,0,103,"C61",37,2,34,189,null,3,24538.66,100,{"$f":"RANK(AC107,$AC$3:$AC$194,1)+COUNTIF(AC$3:AC107,AC107)-1","v":102},null,{"$f":"S107&COUNTIF(S$3:S107,S107)","v":"0105"}]
[{"$f":" Recap!B108","v":"B42"},{"$f":"Recap!M108","v":50},{"$f":"Recap!O108","v":3},{"$f":"Recap!N108","v":37},106,350.63,19,{"$f":"RANK(G108,$G$3:$G$194,1)+COUNTIF(G$3:G108,G108)-1","v":20},{"$f":"IFERROR(INDEX(Liste!$G$7:$G$198,MATCH(K108,Liste!$I$7:$I$198,0)),\"\")","v":0},106,"A40",38,2,38,40,null,0,36,0,106,"A51",40,2,38,51,null,2,24138.62,109,{"$f":"RANK(AC108,$AC$3:$AC$194,1)+COUNTIF(AC$3:AC108,AC108)-1","v":109},null,{"$f":"S108&COUNTIF(S$3:S108,S108)","v":"0106"}]
[{"$f":" Recap!B109","v":"B43"},{"$f":"Recap!M109","v":48},{"$f":"Recap!O109","v":2},{"$f":"Recap!N109","v":42},107,248.58,61,{"$f":"RANK(G109,$G$3:$G$194,1)+COUNTIF(G$3:G109,G109)-1","v":64},{"$f":"IFERROR(INDEX(Liste!$G$7:$G$198,MATCH(K109,Liste!$I$7:$I$198,0)),\"\")","v":0},106,"B40",38,2,38,104,null,0,null,0,106,"B51",40,2,38,115,null,2,24138.62,109,{"$f":"RANK(AC109,$AC$3:$AC$194,1)+COUNTIF(AC$3:AC109,AC109)-1","v":110},null,{"$f":"S109&COUNTIF(S$3:S109,S109)","v":"0107"}]
[{"$f":" Recap!B110","v":"B44"},{"$f":"Recap!M110","v":39},{"$f":"Recap!O110","v":1},{"$f":"Recap!N110","v":47},108,139.53,133,{"$f":"RANK(G110,$G$3:$G$194,1)+COUNTIF(G$3:G110,G110)-1","v":134},{"$f":"IFERROR(INDEX(Liste!$G$7:$G$198,MATCH(K110,Liste!$I$7:$I$198,0)),\"\")","v":0},106,"C40",38,2,38,168,null,0,null,0,106,"C51",40,2,38,179,null,2,24138.62,109,{"$f":"RANK(AC110,$AC$3:$AC$194,1)+COUNTIF(AC$3:AC110,AC110)-1","v":111},null,{"$f":"S110&COUNTIF(S$3:S110,S110)","v":"0108"}]
[{"$f":" Recap!B111","v":"B45"},{"$f":"Recap!M111","v":45},{"$f":"Recap!O111","v":2},{"$f":"Recap!N111","v":35},109,245.65,67,{"$f":"RANK(G111,$G$3:$G$194,1)+COUNTIF(G$3:G111,G111)-1","v":68},{"$f":"IFERROR(INDEX(Liste!$G$7:$G$198,MATCH(K111,Liste!$I$7:$I$198,0)),\"\")","v":0},109,"A41",38,2,45,41,null,-7,37,0,109,"A40",38,2,38,40,null,0,23438.55,124,{"$f":"RANK(AC111,$AC$3:$AC$194,1)+COUNTIF(AC$3:AC111,AC111)-1","v":124},null,{"$f":"S111&COUNTIF(S$3:S111,S111)","v":"0109"}]
[{"$f":" Recap!B112","v":"B46"},{"$f":"Recap!M112","v":35},{"$f":"Recap!O112","v":1},{"$f":"Recap!N112","v":41},110,135.59,139,{"$f":"RANK(G112,$G$3:$G$194,1)+COUNTIF(G$3:G112,G112)-1","v":140},{"$f":"IFERROR(INDEX(Liste!$G$7:$G$198,MATCH(K112,Liste!$I$7:$I$198,0)),\"\")","v":0},109,"B41",38,2,45,105,null,-7,null,0,109,"B40",38,2,38,104,null,0,23438.55,124,{"$f":"RANK(AC112,$AC$3:$AC$194,1)+COUNTIF(AC$3:AC112,AC112)-1","v":125},null,{"$f":"S112&COUNTIF(S$3:S112,S112)","v":"0110"}]
[{"$f":" Recap!B113","v":"B47"},{"$f":"Recap!M113","v":21},{"$f":"Recap!O113","v":0},{"$f":"Recap!N113","v":52},111,21.48,181,{"$f":"RANK(G113,$G$3:$G$194,1)+COUNTIF(G$3:G113,G113)-1","v":185},{"$f":"IFERROR(INDEX(Liste!$G$7:$G$198,MATCH(K113,Liste!$I$7:$I$198,0)),\"\")","v":0},109,"C41",38,2,45,169,null,-7,null,0,109,"C40",38,2,38,168,null,0,23438.55,124,{"$f":"RANK(AC113,$AC$3:$AC$194,1)+COUNTIF(AC$3:AC113,AC113)-1","v":126},null,{"$f":"S113&COUNTIF(S$3:S113,S113)","v":"0111"}]
[{"$f":" Recap!B114","v":"B48"},{"$f":"Recap!M114","v":34},{"$f":"Recap!O114","v":1},{"$f":"Recap!N114","v":43},112,134.57,145,{"$f":"RANK(G114,$G$3:$G$194,1)+COUNTIF(G$3:G114,G114)-1","v":146},{"$f":"IFERROR(INDEX(Liste!$G$7:$G$198,MATCH(K114,Liste!$I$7:$I$198,0)),\"\")","v":0},112,"A61",37,2,34,61,null,3,38,0,112,"A58",35,2,37,58,null,-2,24437.66,103,{"$f":"RANK(AC114,$AC$3:$AC$194,1)+COUNTIF(AC$3:AC114,AC114)-1","v":103},null,{"$f":"S114&COUNTIF(S$3:S114,S114)","v":"0112"}]
[{"$f":" Recap!B115","v":"B49"},{"$f":"Recap!M115","v":44},{"$f":"Recap!O115","v":3},{"$f":"Recap!N115","v":24},113,344.76,40,{"$f":"RANK(G115,$G$3:$G$194,1)+COUNTIF(G$3:G115,G115)-1","v":41},{"$f":"IFERROR(INDEX(Liste!$G$7:$G$198,MATCH(K115,Liste!$I$7:$I$198,0)),\"\")","v":0},112,"B61",37,2,34,125,null,3,null,0,112,"B58",35,2,37,122,null,-2,24437.66,103,{"$f":"RANK(AC115,$AC$3:$AC$194,1)+COUNTIF(AC$3:AC115,AC115)-1","v":104},null,{"$f":"S115&COUNTIF(S$3:S115,S115)","v":"0113"}]
[{"$f":" Recap!B116","v":"B50"},{"$f":"Recap!M116","v":24},{"$f":"Recap!O116","v":1},{"$f":"Recap!N116","v":46},114,124.54,172,{"$f":"RANK(G116,$G$3:$G$194,1)+COUNTIF(G$3:G116,G116)-1","v":173},{"$f":"IFERROR(INDEX(Liste!$G$7:$G$198,MATCH(K116,Liste!$I$7:$I$198,0)),\"\")","v":0},112,"C61",37,2,34,189,null,3,null,0,112,"C58",35,2,37,186,null,-2,24437.66,103,{"$f":"RANK(AC116,$AC$3:$AC$194,1)+COUNTIF(AC$3:AC116,AC116)-1","v":105},null,{"$f":"S116&COUNTIF(S$3:S116,S116)","v":"0114"}]
[{"$f":" Recap!B117","v":"B51"},{"$f":"Recap!M117","v":40},{"$f":"Recap!O117","v":2},{"$f":"Recap!N117","v":38},115,240.62,91,{"$f":"RANK(G117,$G$3:$G$194,1)+COUNTIF(G$3:G117,G117)-1","v":92},{"$f":"IFERROR(INDEX(Liste!$G$7:$G$198,MATCH(K117,Liste!$I$7:$I$198,0)),\"\")","v":0},115,"A58",35,2,37,58,null,-2,39,0,115,"A62",32,2,37,62,null,-5,23935.63,112,{"$f":"RANK(AC117,$AC$3:$AC$194,1)+COUNTIF(AC$3:AC117,AC117)-1","v":112},null,{"$f":"S117&COUNTIF(S$3:S117,S117)","v":"0115"}]
[{"$f":" Recap!B118","v":"B52"},{"$f":"Recap!M118","v":52},{"$f":"Recap!O118","v":4},{"$f":"Recap!N118","v":24},116,452.76,1,{"$f":"RANK(G118,$G$3:$G$194,1)+COUNTIF(G$3:G118,G118)-1","v":4},{"$f":"IFERROR(INDEX(Liste!$G$7:$G$198,MATCH(K118,Liste!$I$7:$I$198,0)),\"\")","v":0},115,"B58",35,2,37,122,null,-2,null,0,115,"B62",32,2,37,126,null,-5,23935.63,112,{"$f":"RANK(AC118,$AC$3:$AC$194,1)+COUNTIF(AC$3:AC118,AC118)-1","v":113},null,{"$f":"S118&COUNTIF(S$3:S118,S118)","v":"0116"}]
[{"$f":" Recap!B119","v":"B53"},{"$f":"Recap!M119","v":35},{"$f":"Recap!O119","v":1},{"$f":"Recap!N119","v":47},117,135.53,142,{"$f":"RANK(G119,$G$3:$G$194,1)+COUNTIF(G$3:G119,G119)-1","v":143},{"$f":"IFERROR(INDEX(Liste!$G$7:$G$198,MATCH(K119,Liste!$I$7:$I$198,0)),\"\")","v":0},115,"C58",35,2,37,186,null,-2,null,0,115,"C62",32,2,37,190,null,-5,23935.63,112,{"$f":"RANK(AC119,$AC$3:$AC$194,1)+COUNTIF(AC$3:AC119,AC119)-1","v":114},null,{"$f":"S119&COUNTIF(S$3:S119,S119)","v":"0117"}]
[{"$f":" Recap!B120","v":"B54"},{"$f":"Recap!M120","v":46},{"$f":"Recap!O120","v":3},{"$f":"Recap!N120","v":34},118,346.66,37,{"$f":"RANK(G120,$G$3:$G$194,1)+COUNTIF(G$3:G120,G120)-1","v":38},{"$f":"IFERROR(INDEX(Liste!$G$7:$G$198,MATCH(K120,Liste!$I$7:$I$198,0)),\"\")","v":0},118,"A34",33,2,39,34,null,-6,40,0,118,"A34",33,2,39,34,null,-6,23533.61,118,{"$f":"RANK(AC120,$AC$3:$AC$194,1)+COUNTIF(AC$3:AC120,AC120)-1","v":118},null,{"$f":"S120&COUNTIF(S$3:S120,S120)","v":"0118"}]
[{"$f":" Recap!B121","v":"B55"},{"$f":"Recap!M121","v":21},{"$f":"Recap!O121","v":0},{"$f":"Recap!N121","v":52},119,21.48,181,{"$f":"RANK(G121,$G$3:$G$194,1)+COUNTIF(G$3:G121,G121)-1","v":186},{"$f":"IFERROR(INDEX(Liste!$G$7:$G$198,MATCH(K121,Liste!$I$7:$I$198,0)),\"\")","v":0},118,"B34",33,2,39,98,null,-6,null,0,118,"B34",33,2,39,98,null,-6,23533.61,118,{"$f":"RANK(AC121,$AC$3:$AC$194,1)+COUNTIF(AC$3:AC121,AC121)-1","v":119},null,{"$f":"S121&COUNTIF(S$3:S121,S121)","v":"0119"}]
[{"$f":" Recap!B122","v":"B56"},{"$f":"Recap!M122","v":41},{"$f":"Recap!O122","v":2},{"$f":"Recap!N122","v":30},120,241.7,85,{"$f":"RANK(G122,$G$3:$G$194,1)+COUNTIF(G$3:G122,G122)-1","v":86},{"$f":"IFERROR(INDEX(Liste!$G$7:$G$198,MATCH(K122,Liste!$I$7:$I$198,0)),\"\")","v":0},118,"C34",33,2,39,162,null,-6,null,0,118,"C34",33,2,39,162,null,-6,23533.61,118,{"$f":"RANK(AC122,$AC$3:$AC$194,1)+COUNTIF(AC$3:AC122,AC122)-1","v":120},null,{"$f":"S122&COUNTIF(S$3:S122,S122)","v":"0120"}]
[{"$f":" Recap!B123","v":"B57"},{"$f":"Recap!M123","v":32},{"$f":"Recap!O123","v":2},{"$f":"Recap!N123","v":38},121,232.62,127,{"$f":"RANK(G123,$G$3:$G$194,1)+COUNTIF(G$3:G123,G123)-1","v":128},{"$f":"IFERROR(INDEX(Liste!$G$7:$G$198,MATCH(K123,Liste!$I$7:$I$198,0)),\"\")","v":0},121,"A18",33,2,45,18,null,-12,41,0,121,"A57",32,2,38,57,null,-6,22933.55,130,{"$f":"RANK(AC123,$AC$3:$AC$194,1)+COUNTIF(AC$3:AC123,AC123)-1","v":130},null,{"$f":"S123&COUNTIF(S$3:S123,S123)","v":"0121"}]
[{"$f":" Recap!B124","v":"B58"},{"$f":"Recap!M124","v":35},{"$f":"Recap!O124","v":2},{"$f":"Recap!N124","v":37},122,235.63,115,{"$f":"RANK(G124,$G$3:$G$194,1)+COUNTIF(G$3:G124,G124)-1","v":116},{"$f":"IFERROR(INDEX(Liste!$G$7:$G$198,MATCH(K124,Liste!$I$7:$I$198,0)),\"\")","v":0},121,"B18",33,2,45,82,null,-12,null,0,121,"B57",32,2,38,121,null,-6,22933.55,130,{"$f":"RANK(AC124,$AC$3:$AC$194,1)+COUNTIF(AC$3:AC124,AC124)-1","v":131},null,{"$f":"S124&COUNTIF(S$3:S124,S124)","v":"0122"}]
[{"$f":" Recap!B125","v":"B59"},{"$f":"Recap!M125","v":32},{"$f":"Recap!O125","v":1},{"$f":"Recap!N125","v":43},123,132.57,151,{"$f":"RANK(G125,$G$3:$G$194,1)+COUNTIF(G$3:G125,G125)-1","v":152},{"$f":"IFERROR(INDEX(Liste!$G$7:$G$198,MATCH(K125,Liste!$I$7:$I$198,0)),\"\")","v":0},121,"C18",33,2,45,146,null,-12,null,0,121,"C57",32,2,38,185,null,-6,22933.55,130,{"$f":"RANK(AC125,$AC$3:$AC$194,1)+COUNTIF(AC$3:AC125,AC125)-1","v":132},null,{"$f":"S125&COUNTIF(S$3:S125,S125)","v":"0123"}]
[{"$f":" Recap!B126","v":"B60"},{"$f":"Recap!M126","v":26},{"$f":"Recap!O126","v":1},{"$f":"Recap!N126","v":47},124,126.53,169,{"$f":"RANK(G126,$G$3:$G$194,1)+COUNTIF(G$3:G126,G126)-1","v":170},{"$f":"IFERROR(INDEX(Liste!$G$7:$G$198,MATCH(K126,Liste!$I$7:$I$198,0)),\"\")","v":0},124,"A62",32,2,37,62,null,-5,42,0,124,"A41",38,2,45,41,null,-7,23632.63,115,{"$f":"RANK(AC126,$AC$3:$AC$194,1)+COUNTIF(AC$3:AC126,AC126)-1","v":115},null,{"$f":"S126&COUNTIF(S$3:S126,S126)","v":"0124"}]
[{"$f":" Recap!B127","v":"B61"},{"$f":"Recap!M127","v":37},{"$f":"Recap!O127","v":2},{"$f":"Recap!N127","v":34},125,237.66,112,{"$f":"RANK(G127,$G$3:$G$194,1)+COUNTIF(G$3:G127,G127)-1","v":113},{"$f":"IFERROR(INDEX(Liste!$G$7:$G$198,MATCH(K127,Liste!$I$7:$I$198,0)),\"\")","v":0},124,"B62",32,2,37,126,null,-5,null,0,124,"B41",38,2,45,105,null,-7,23632.63,115,{"$f":"RANK(AC127,$AC$3:$AC$194,1)+COUNTIF(AC$3:AC127,AC127)-1","v":116},null,{"$f":"S127&COUNTIF(S$3:S127,S127)","v":"0125"}]
[{"$f":" Recap!B128","v":"B62"},{"$f":"Recap!M128","v":32},{"$f":"Recap!O128","v":2},{"$f":"Recap!N128","v":37},126,232.63,124,{"$f":"RANK(G128,$G$3:$G$194,1)+COUNTIF(G$3:G128,G128)-1","v":125},{"$f":"IFERROR(INDEX(Liste!$G$7:$G$198,MATCH(K128,Liste!$I$7:$I$198,0)),\"\")","v":0},124,"C62",32,2,37,190,null,-5,null,0,124,"C41",38,2,45,169,null,-7,23632.63,115,{"$f":"RANK(AC128,$AC$3:$AC$194,1)+COUNTIF(AC$3:AC128,AC128)-1","v":117},null,{"$f":"S128&COUNTIF(S$3:S128,S128)","v":"0126"}]
[{"$f":" Recap!B129","v":"B63"},{"$f":"Recap!M129","v":41},{"$f":"Recap!O129","v":3},{"$f":"Recap!N129","v":25},127,341.75,52,{"$f":"RANK(G129,$G$3:$G$194,1)+COUNTIF(G$3:G129,G129)-1","v":53},{"$f":"IFERROR(INDEX(Liste!$G$7:$G$198,MATCH(K129,Liste!$I$7:$I$198,0)),\"\")","v":0},127,"A57",32,2,38,57,null,-6,43,0,127,"A4",30,2,38,4,null,-8,23532.62,121,{"$f":"RANK(AC129,$AC$3:$AC$194,1)+COUNTIF(AC$3:AC129,AC129)-1","v":121},null,{"$f":"S129&COUNTIF(S$3:S129,S129)","v":"0127"}]
[{"$f":" Recap!B130","v":"B64"},{"$f":"Recap!M130","v":43},{"$f":"Recap!O130","v":3},{"$f":"Recap!N130","v":25},128,343.75,49,{"$f":"RANK(G130,$G$3:$G$194,1)+COUNTIF(G$3:G130,G130)-1","v":50},{"$f":"IFERROR(INDEX(Liste!$G$7:$G$198,MATCH(K130,Liste!$I$7:$I$198,0)),\"\")","v":0},127,"B57",32,2,38,121,null,-6,null,0,127,"B4",30,2,38,68,null,-8,23532.62,121,{"$f":"RANK(AC130,$AC$3:$AC$194,1)+COUNTIF(AC$3:AC130,AC130)-1","v":122},null,{"$f":"S130&COUNTIF(S$3:S130,S130)","v":"0128"}]
[{"$f":" Recap!B131","v":"C1"},{"$f":"Recap!M131","v":19},{"$f":"Recap!O131","v":1},{"$f":"Recap!N131","v":41},129,{"$f":"100*C131+B131+(100-D131)/100","v":119.59},178,{"$f":"RANK(G131,$G$3:$G$194,1)+COUNTIF(G$3:G131,G131)-1","v":180},{"$f":"IFERROR(INDEX(Liste!$G$7:$G$198,MATCH(K131,Liste!$I$7:$I$198,0)),\"\")","v":0},{"$f":"INDEX(G:G,MATCH(ROW()-2,H:H,0))","v":127},{"$f":"INDEX(A:A,MATCH(ROW()-2,H:H,0))","v":"C57"},{"$f":"INDEX(B:B,MATCH(ROW()-2,H:H,0))","v":32},{"$f":"INDEX(C:C,MATCH(K131,A:A,0))","v":2},{"$f":"INDEX(D:D,MATCH(ROW()-2,H:H,0))","v":38},{"$f":"INDEX(E:E,MATCH(ROW()-2,H:H,0))","v":185},null,{"$f":"IF(SUM(M131:N131)=0,-1000,L131-N131)","v":-6},null,{"$f":"INDEX(I:I,MATCH(U131,K:K,0))","v":0},127,{"$f":"INDEX(K:K,MATCH(ROW()-2,$AD:$AD,0))","v":"C4"},{"$f":"INDEX(L:L,MATCH(ROW()-2,$AD:$AD,0))","v":30},{"$f":"INDEX(M:M,MATCH(ROW()-2,$AD:$AD,0))","v":2},{"$f":"INDEX(N:N,MATCH(ROW()-2,$AD:$AD,0))","v":38},{"$f":"INDEX(O:O,MATCH(ROW()-2,$AD:$AD,0))","v":132},null,-8,23532.62,121,{"$f":"RANK(AC131,$AC$3:$AC$194,1)+COUNTIF(AC$3:AC131,AC131)-1","v":123},null,{"$f":"S131&COUNTIF(S$3:S131,S131)","v":"0129"}]
[{"$f":" Recap!B132","v":"C2"},{"$f":"Recap!M132","v":11},{"$f":"Recap!O132","v":0},{"$f":"Recap!N132","v":52},{"$f":"ROW()-2","v":130},11.48,{"$f":"RANK(F132,$F$3:$F$194,0)","v":190},{"$f":"RANK(G132,$G$3:$G$194,1)+COUNTIF(G$3:G132,G132)-1","v":192},{"$f":"IFERROR(INDEX(Liste!$G$7:$G$198,MATCH(K132,Liste!$I$7:$I$198,0)),\"\")","v":0},130,"A4",30,2,38,4,null,-8,44,0,{"$f":"INDEX(AC:AC,MATCH(ROW()-2,AD:AD,0))","v":130},"A18",33,2,45,18,null,{"$f":"V132-X132","v":-12},{"$f":"$M132*10000+($Q132+ABS(MIN($Q:$Q)))*100+$L132+(100-$N132)/100","v":23330.62},{"$f":"RANK(AB132,$AB$3:$AB$194,0)","v":127},{"$f":"RANK(AC132,$AC$3:$AC$194,1)+COUNTIF(AC$3:AC132,AC132)-1","v":127},null,{"$f":"S132&COUNTIF(S$3:S132,S132)","v":"0130"}]
[{"$f":" Recap!B133","v":"C3"},{"$f":"Recap!M133","v":30},{"$f":"Recap!O133","v":1},{"$f":"Recap!N133","v":41},131,130.59,154,{"$f":"RANK(G133,$G$3:$G$194,1)+COUNTIF(G$3:G133,G133)-1","v":158},{"$f":"IFERROR(INDEX(Liste!$G$7:$G$198,MATCH(K133,Liste!$I$7:$I$198,0)),\"\")","v":0},130,"B4",30,2,38,68,null,-8,null,0,130,"B18",33,2,45,82,null,-12,23330.62,127,{"$f":"RANK(AC133,$AC$3:$AC$194,1)+COUNTIF(AC$3:AC133,AC133)-1","v":128},null,{"$f":"S133&COUNTIF(S$3:S133,S133)","v":"0131"}]
[{"$f":" Recap!B134","v":"C4"},{"$f":"Recap!M134","v":30},{"$f":"Recap!O134","v":2},{"$f":"Recap!N134","v":38},132,230.62,130,{"$f":"RANK(G134,$G$3:$G$194,1)+COUNTIF(G$3:G134,G134)-1","v":132},{"$f":"IFERROR(INDEX(Liste!$G$7:$G$198,MATCH(K134,Liste!$I$7:$I$198,0)),\"\")","v":0},130,"C4",30,2,38,132,null,-8,null,0,130,"C18",33,2,45,146,null,-12,23330.62,127,{"$f":"RANK(AC134,$AC$3:$AC$194,1)+COUNTIF(AC$3:AC134,AC134)-1","v":129},null,{"$f":"S134&COUNTIF(S$3:S134,S134)","v":"0132"}]
[{"$f":" Recap!B135","v":"C5"},{"$f":"Recap!M135","v":42},{"$f":"Recap!O135","v":2},{"$f":"Recap!N135","v":38},133,242.62,82,{"$f":"RANK(G135,$G$3:$G$194,1)+COUNTIF(G$3:G135,G135)-1","v":84},{"$f":"IFERROR(INDEX(Liste!$G$7:$G$198,MATCH(K135,Liste!$I$7:$I$198,0)),\"\")","v":0},133,"A44",39,1,47,44,null,-8,45,0,133,"A27",36,1,41,27,null,-5,13339.53,139,{"$f":"RANK(AC135,$AC$3:$AC$194,1)+COUNTIF(AC$3:AC135,AC135)-1","v":139},null,{"$f":"S135&COUNTIF(S$3:S135,S135)","v":"0133"}]
[{"$f":" Recap!B136","v":"C6"},{"$f":"Recap!M136","v":41},{"$f":"Recap!O136","v":3},{"$f":"Recap!N136","v":36},134,341.64,55,{"$f":"RANK(G136,$G$3:$G$194,1)+COUNTIF(G$3:G136,G136)-1","v":57},{"$f":"IFERROR(INDEX(Liste!$G$7:$G$198,MATCH(K136,Liste!$I$7:$I$198,0)),\"\")","v":0},133,"B44",39,1,47,108,null,-8,null,0,133,"B27",36,1,41,91,null,-5,13339.53,139,{"$f":"RANK(AC136,$AC$3:$AC$194,1)+COUNTIF(AC$3:AC136,AC136)-1","v":140},null,{"$f":"S136&COUNTIF(S$3:S136,S136)","v":"0134"}]
[{"$f":" Recap!B137","v":"C7"},{"$f":"Recap!M137","v":30},{"$f":"Recap!O137","v":1},{"$f":"Recap!N137","v":41},135,130.59,154,{"$f":"RANK(G137,$G$3:$G$194,1)+COUNTIF(G$3:G137,G137)-1","v":159},{"$f":"IFERROR(INDEX(Liste!$G$7:$G$198,MATCH(K137,Liste!$I$7:$I$198,0)),\"\")","v":0},133,"C44",39,1,47,172,null,-8,null,0,133,"C27",36,1,41,155,null,-5,13339.53,139,{"$f":"RANK(AC137,$AC$3:$AC$194,1)+COUNTIF(AC$3:AC137,AC137)-1","v":141},null,{"$f":"S137&COUNTIF(S$3:S137,S137)","v":"0135"}]
[{"$f":" Recap!B138","v":"C8"},{"$f":"Recap!M138","v":38},{"$f":"Recap!O138","v":2},{"$f":"Recap!N138","v":30},136,238.7,97,{"$f":"RANK(G138,$G$3:$G$194,1)+COUNTIF(G$3:G138,G138)-1","v":99},{"$f":"IFERROR(INDEX(Liste!$G$7:$G$198,MATCH(K138,Liste!$I$7:$I$198,0)),\"\")","v":0},136,"A27",36,1,41,27,null,-5,46,0,136,"A46",35,1,41,46,null,-6,13636.59,133,{"$f":"RANK(AC138,$AC$3:$AC$194,1)+COUNTIF(AC$3:AC138,AC138)-1","v":133},null,{"$f":"S138&COUNTIF(S$3:S138,S138)","v":"0136"}]
[{"$f":" Recap!B139","v":"C9"},{"$f":"Recap!M139","v":52},{"$f":"Recap!O139","v":4},{"$f":"Recap!N139","v":24},137,452.76,1,{"$f":"RANK(G139,$G$3:$G$194,1)+COUNTIF(G$3:G139,G139)-1","v":5},{"$f":"IFERROR(INDEX(Liste!$G$7:$G$198,MATCH(K139,Liste!$I$7:$I$198,0)),\"\")","v":0},136,"B27",36,1,41,91,null,-5,null,0,136,"B46",35,1,41,110,null,-6,13636.59,133,{"$f":"RANK(AC139,$AC$3:$AC$194,1)+COUNTIF(AC$3:AC139,AC139)-1","v":134},null,{"$f":"S139&COUNTIF(S$3:S139,S139)","v":"0137"}]
[{"$f":" Recap!B140","v":"C10"},{"$f":"Recap!M140","v":40},{"$f":"Recap!O140","v":3},{"$f":"Recap!N140","v":39},138,340.61,58,{"$f":"RANK(G140,$G$3:$G$194,1)+COUNTIF(G$3:G140,G140)-1","v":60},{"$f":"IFERROR(INDEX(Liste!$G$7:$G$198,MATCH(K140,Liste!$I$7:$I$198,0)),\"\")","v":0},136,"C27",36,1,41,155,null,-5,null,0,136,"C46",35,1,41,174,null,-6,13636.59,133,{"$f":"RANK(AC140,$AC$3:$AC$194,1)+COUNTIF(AC$3:AC140,AC140)-1","v":135},null,{"$f":"S140&COUNTIF(S$3:S140,S140)","v":"0138"}]
[{"$f":" Recap!B141","v":"C11"},{"$f":"Recap!M141","v":45},{"$f":"Recap!O141","v":2},{"$f":"Recap!N141","v":41},139,245.59,73,{"$f":"RANK(G141,$G$3:$G$194,1)+COUNTIF(G$3:G141,G141)-1","v":75},{"$f":"IFERROR(INDEX(Liste!$G$7:$G$198,MATCH(K141,Liste!$I$7:$I$198,0)),\"\")","v":0},139,"A46",35,1,41,46,null,-6,47,0,139,"A44",39,1,47,44,null,-8,13535.59,136,{"$f":"RANK(AC141,$AC$3:$AC$194,1)+COUNTIF(AC$3:AC141,AC141)-1","v":136},null,{"$f":"S141&COUNTIF(S$3:S141,S141)","v":"0139"}]
[{"$f":" Recap!B142","v":"C12"},{"$f":"Recap!M142","v":50},{"$f":"Recap!O142","v":3},{"$f":"Recap!N142","v":33},140,350.67,13,{"$f":"RANK(G142,$G$3:$G$194,1)+COUNTIF(G$3:G142,G142)-1","v":15},{"$f":"IFERROR(INDEX(Liste!$G$7:$G$198,MATCH(K142,Liste!$I$7:$I$198,0)),\"\")","v":0},139,"B46",35,1,41,110,null,-6,null,0,139,"B44",39,1,47,108,null,-8,13535.59,136,{"$f":"RANK(AC142,$AC$3:$AC$194,1)+COUNTIF(AC$3:AC142,AC142)-1","v":137},null,{"$f":"S142&COUNTIF(S$3:S142,S142)","v":"0140"}]
[{"$f":" Recap!B143","v":"C13"},{"$f":"Recap!M143","v":43},{"$f":"Recap!O143","v":2},{"$f":"Recap!N143","v":33},141,243.67,76,{"$f":"RANK(G143,$G$3:$G$194,1)+COUNTIF(G$3:G143,G143)-1","v":78},{"$f":"IFERROR(INDEX(Liste!$G$7:$G$198,MATCH(K143,Liste!$I$7:$I$198,0)),\"\")","v":0},139,"C46",35,1,41,174,null,-6,null,0,139,"C44",39,1,47,172,null,-8,13535.59,136,{"$f":"RANK(AC143,$AC$3:$AC$194,1)+COUNTIF(AC$3:AC143,AC143)-1","v":138},null,{"$f":"S143&COUNTIF(S$3:S143,S143)","v":"0141"}]
[{"$f":" Recap!B144","v":"C14"},{"$f":"Recap!M144","v":49},{"$f":"Recap!O144","v":3},{"$f":"Recap!N144","v":24},142,349.76,25,{"$f":"RANK(G144,$G$3:$G$194,1)+COUNTIF(G$3:G144,G144)-1","v":27},{"$f":"IFERROR(INDEX(Liste!$G$7:$G$198,MATCH(K144,Liste!$I$7:$I$198,0)),\"\")","v":0},142,"A53",35,1,47,53,null,-12,48,0,142,"A48",34,1,43,48,null,-9,12935.53,154,{"$f":"RANK(AC144,$AC$3:$AC$194,1)+COUNTIF(AC$3:AC144,AC144)-1","v":154},null,{"$f":"S144&COUNTIF(S$3:S144,S144)","v":"0142"}]
[{"$f":" Recap!B145","v":"C15"},{"$f":"Recap!M145","v":38},{"$f":"Recap!O145","v":2},{"$f":"Recap!N145","v":32},143,238.68,100,{"$f":"RANK(G145,$G$3:$G$194,1)+COUNTIF(G$3:G145,G145)-1","v":102},{"$f":"IFERROR(INDEX(Liste!$G$7:$G$198,MATCH(K145,Liste!$I$7:$I$198,0)),\"\")","v":0},142,"B53",35,1,47,117,null,-12,null,0,142,"B48",34,1,43,112,null,-9,12935.53,154,{"$f":"RANK(AC145,$AC$3:$AC$194,1)+COUNTIF(AC$3:AC145,AC145)-1","v":155},null,{"$f":"S145&COUNTIF(S$3:S145,S145)","v":"0143"}]
[{"$f":" Recap!B146","v":"C16"},{"$f":"Recap!M146","v":29},{"$f":"Recap!O146","v":1},{"$f":"Recap!N146","v":44},144,129.56,160,{"$f":"RANK(G146,$G$3:$G$194,1)+COUNTIF(G$3:G146,G146)-1","v":162},{"$f":"IFERROR(INDEX(Liste!$G$7:$G$198,MATCH(K146,Liste!$I$7:$I$198,0)),\"\")","v":0},142,"C53",35,1,47,181,null,-12,null,0,142,"C48",34,1,43,176,null,-9,12935.53,154,{"$f":"RANK(AC146,$AC$3:$AC$194,1)+COUNTIF(AC$3:AC146,AC146)-1","v":156},null,{"$f":"S146&COUNTIF(S$3:S146,S146)","v":"0144"}]
[{"$f":" Recap!B147","v":"C17"},{"$f":"Recap!M147","v":44},{"$f":"Recap!O147","v":3},{"$f":"Recap!N147","v":36},145,344.64,43,{"$f":"RANK(G147,$G$3:$G$194,1)+COUNTIF(G$3:G147,G147)-1","v":47},{"$f":"IFERROR(INDEX(Liste!$G$7:$G$198,MATCH(K147,Liste!$I$7:$I$198,0)),\"\")","v":0},145,"A48",34,1,43,48,null,-9,49,0,145,"A59",32,1,43,59,null,-11,13234.57,142,{"$f":"RANK(AC147,$AC$3:$AC$194,1)+COUNTIF(AC$3:AC147,AC147)-1","v":142},null,{"$f":"S147&COUNTIF(S$3:S147,S147)","v":"0145"}]
[{"$f":" Recap!B148","v":"C18"},{"$f":"Recap!M148","v":33},{"$f":"Recap!O148","v":2},{"$f":"Recap!N148","v":45},146,233.55,121,{"$f":"RANK(G148,$G$3:$G$194,1)+COUNTIF(G$3:G148,G148)-1","v":123},{"$f":"IFERROR(INDEX(Liste!$G$7:$G$198,MATCH(K148,Liste!$I$7:$I$198,0)),\"\")","v":0},145,"B48",34,1,43,112,null,-9,null,0,145,"B59",32,1,43,123,null,-11,13234.57,142,{"$f":"RANK(AC148,$AC$3:$AC$194,1)+COUNTIF(AC$3:AC148,AC148)-1","v":143},null,{"$f":"S148&COUNTIF(S$3:S148,S148)","v":"0146"}]
[{"$f":" Recap!B149","v":"C19"},{"$f":"Recap!M149","v":49},{"$f":"Recap!O149","v":3},{"$f":"Recap!N149","v":37},147,349.63,34,{"$f":"RANK(G149,$G$3:$G$194,1)+COUNTIF(G$3:G149,G149)-1","v":36},{"$f":"IFERROR(INDEX(Liste!$G$7:$G$198,MATCH(K149,Liste!$I$7:$I$198,0)),\"\")","v":0},145,"C48",34,1,43,176,null,-9,null,0,145,"C59",32,1,43,187,null,-11,13234.57,142,{"$f":"RANK(AC149,$AC$3:$AC$194,1)+COUNTIF(AC$3:AC149,AC149)-1","v":144},null,{"$f":"S149&COUNTIF(S$3:S149,S149)","v":"0147"}]
[{"$f":" Recap!B150","v":"C20"},{"$f":"Recap!M150","v":52},{"$f":"Recap!O150","v":4},{"$f":"Recap!N150","v":36},148,452.64,7,{"$f":"RANK(G150,$G$3:$G$194,1)+COUNTIF(G$3:G150,G150)-1","v":9},{"$f":"IFERROR(INDEX(Liste!$G$7:$G$198,MATCH(K150,Liste!$I$7:$I$198,0)),\"\")","v":0},148,"A23",34,1,47,23,null,-13,50,0,148,"A3",30,1,41,3,null,-11,12834.53,157,{"$f":"RANK(AC150,$AC$3:$AC$194,1)+COUNTIF(AC$3:AC150,AC150)-1","v":157},null,{"$f":"S150&COUNTIF(S$3:S150,S150)","v":"0148"}]
[{"$f":" Recap!B151","v":"C21"},{"$f":"Recap!M151","v":48},{"$f":"Recap!O151","v":2},{"$f":"Recap!N151","v":42},149,248.58,61,{"$f":"RANK(G151,$G$3:$G$194,1)+COUNTIF(G$3:G151,G151)-1","v":65},{"$f":"IFERROR(INDEX(Liste!$G$7:$G$198,MATCH(K151,Liste!$I$7:$I$198,0)),\"\")","v":0},148,"B23",34,1,47,87,null,-13,null,0,148,"A7",30,1,41,7,null,-11,12834.53,157,{"$f":"RANK(AC151,$AC$3:$AC$194,1)+COUNTIF(AC$3:AC151,AC151)-1","v":158},null,{"$f":"S151&COUNTIF(S$3:S151,S151)","v":"0149"}]
[{"$f":" Recap!B152","v":"C22"},{"$f":"Recap!M152","v":50},{"$f":"Recap!O152","v":3},{"$f":"Recap!N152","v":42},150,350.58,22,{"$f":"RANK(G152,$G$3:$G$194,1)+COUNTIF(G$3:G152,G152)-1","v":24},{"$f":"IFERROR(INDEX(Liste!$G$7:$G$198,MATCH(K152,Liste!$I$7:$I$198,0)),\"\")","v":0},148,"C23",34,1,47,151,null,-13,null,0,148,"B3",30,1,41,67,null,-11,12834.53,157,{"$f":"RANK(AC152,$AC$3:$AC$194,1)+COUNTIF(AC$3:AC152,AC152)-1","v":159},null,{"$f":"S152&COUNTIF(S$3:S152,S152)","v":"0150"}]
[{"$f":" Recap!B153","v":"C23"},{"$f":"Recap!M153","v":34},{"$f":"Recap!O153","v":1},{"$f":"Recap!N153","v":47},151,134.53,148,{"$f":"RANK(G153,$G$3:$G$194,1)+COUNTIF(G$3:G153,G153)-1","v":150},{"$f":"IFERROR(INDEX(Liste!$G$7:$G$198,MATCH(K153,Liste!$I$7:$I$198,0)),\"\")","v":0},151,"A59",32,1,43,59,null,-11,51,0,148,"B7",30,1,41,71,null,-11,13032.57,145,{"$f":"RANK(AC153,$AC$3:$AC$194,1)+COUNTIF(AC$3:AC153,AC153)-1","v":145},null,{"$f":"S153&COUNTIF(S$3:S153,S153)","v":"0151"}]
[{"$f":" Recap!B154","v":"C24"},{"$f":"Recap!M154","v":45},{"$f":"Recap!O154","v":2},{"$f":"Recap!N154","v":38},152,245.62,70,{"$f":"RANK(G154,$G$3:$G$194,1)+COUNTIF(G$3:G154,G154)-1","v":72},{"$f":"IFERROR(INDEX(Liste!$G$7:$G$198,MATCH(K154,Liste!$I$7:$I$198,0)),\"\")","v":0},151,"B59",32,1,43,123,null,-11,null,0,148,"C3",30,1,41,131,null,-11,13032.57,145,{"$f":"RANK(AC154,$AC$3:$AC$194,1)+COUNTIF(AC$3:AC154,AC154)-1","v":146},null,{"$f":"S154&COUNTIF(S$3:S154,S154)","v":"0152"}]
[{"$f":" Recap!B155","v":"C25"},{"$f":"Recap!M155","v":49},{"$f":"Recap!O155","v":3},{"$f":"Recap!N155","v":27},153,349.73,28,{"$f":"RANK(G155,$G$3:$G$194,1)+COUNTIF(G$3:G155,G155)-1","v":30},{"$f":"IFERROR(INDEX(Liste!$G$7:$G$198,MATCH(K155,Liste!$I$7:$I$198,0)),\"\")","v":0},151,"C59",32,1,43,187,null,-11,null,0,148,"C7",30,1,41,135,null,-11,13032.57,145,{"$f":"RANK(AC155,$AC$3:$AC$194,1)+COUNTIF(AC$3:AC155,AC155)-1","v":147},null,{"$f":"S155&COUNTIF(S$3:S155,S155)","v":"0153"}]
[{"$f":" Recap!B156","v":"C26"},{"$f":"Recap!M156","v":39},{"$f":"Recap!O156","v":2},{"$f":"Recap!N156","v":35},154,239.65,94,{"$f":"RANK(G156,$G$3:$G$194,1)+COUNTIF(G$3:G156,G156)-1","v":96},{"$f":"IFERROR(INDEX(Liste!$G$7:$G$198,MATCH(K156,Liste!$I$7:$I$198,0)),\"\")","v":0},154,"A3",30,1,41,3,null,-11,52,0,154,"A53",35,1,47,53,null,-12,13030.59,148,{"$f":"RANK(AC156,$AC$3:$AC$194,1)+COUNTIF(AC$3:AC156,AC156)-1","v":148},null,{"$f":"S156&COUNTIF(S$3:S156,S156)","v":"0154"}]
[{"$f":" Recap!B157","v":"C27"},{"$f":"Recap!M157","v":36},{"$f":"Recap!O157","v":1},{"$f":"Recap!N157","v":41},155,136.59,136,{"$f":"RANK(G157,$G$3:$G$194,1)+COUNTIF(G$3:G157,G157)-1","v":138},{"$f":"IFERROR(INDEX(Liste!$G$7:$G$198,MATCH(K157,Liste!$I$7:$I$198,0)),\"\")","v":0},154,"A7",30,1,41,7,null,-11,null,0,154,"B53",35,1,47,117,null,-12,13030.59,148,{"$f":"RANK(AC157,$AC$3:$AC$194,1)+COUNTIF(AC$3:AC157,AC157)-1","v":149},null,{"$f":"S157&COUNTIF(S$3:S157,S157)","v":"0155"}]
[{"$f":" Recap!B158","v":"C28"},{"$f":"Recap!M158","v":43},{"$f":"Recap!O158","v":2},{"$f":"Recap!N158","v":36},156,243.64,79,{"$f":"RANK(G158,$G$3:$G$194,1)+COUNTIF(G$3:G158,G158)-1","v":81},{"$f":"IFERROR(INDEX(Liste!$G$7:$G$198,MATCH(K158,Liste!$I$7:$I$198,0)),\"\")","v":0},154,"B3",30,1,41,67,null,-11,null,0,154,"C53",35,1,47,181,null,-12,13030.59,148,{"$f":"RANK(AC158,$AC$3:$AC$194,1)+COUNTIF(AC$3:AC158,AC158)-1","v":150},null,{"$f":"S158&COUNTIF(S$3:S158,S158)","v":"0156"}]
[{"$f":" Recap!B159","v":"C29"},{"$f":"Recap!M159","v":21},{"$f":"Recap!O159","v":0},{"$f":"Recap!N159","v":52},157,21.48,181,{"$f":"RANK(G159,$G$3:$G$194,1)+COUNTIF(G$3:G159,G159)-1","v":187},{"$f":"IFERROR(INDEX(Liste!$G$7:$G$198,MATCH(K159,Liste!$I$7:$I$198,0)),\"\")","v":0},154,"B7",30,1,41,71,null,-11,53,0,157,"A23",34,1,47,23,null,-13,13030.59,148,{"$f":"RANK(AC159,$AC$3:$AC$194,1)+COUNTIF(AC$3:AC159,AC159)-1","v":151},null,{"$f":"S159&COUNTIF(S$3:S159,S159)","v":"0157"}]
[{"$f":" Recap!B160","v":"C30"},{"$f":"Recap!M160","v":29},{"$f":"Recap!O160","v":1},{"$f":"Recap!N160","v":46},158,129.54,163,{"$f":"RANK(G160,$G$3:$G$194,1)+COUNTIF(G$3:G160,G160)-1","v":165},{"$f":"IFERROR(INDEX(Liste!$G$7:$G$198,MATCH(K160,Liste!$I$7:$I$198,0)),\"\")","v":0},154,"C3",30,1,41,131,null,-11,null,0,157,"B23",34,1,47,87,null,-13,13030.59,148,{"$f":"RANK(AC160,$AC$3:$AC$194,1)+COUNTIF(AC$3:AC160,AC160)-1","v":152},null,{"$f":"S160&COUNTIF(S$3:S160,S160)","v":"0158"}]
[{"$f":" Recap!B161","v":"C31"},{"$f":"Recap!M161","v":38},{"$f":"Recap!O161","v":2},{"$f":"Recap!N161","v":34},159,238.66,103,{"$f":"RANK(G161,$G$3:$G$194,1)+COUNTIF(G$3:G161,G161)-1","v":105},{"$f":"IFERROR(INDEX(Liste!$G$7:$G$198,MATCH(K161,Liste!$I$7:$I$198,0)),\"\")","v":0},154,"C7",30,1,41,135,null,-11,null,0,157,"C23",34,1,47,151,null,-13,13030.59,148,{"$f":"RANK(AC161,$AC$3:$AC$194,1)+COUNTIF(AC$3:AC161,AC161)-1","v":153},null,{"$f":"S161&COUNTIF(S$3:S161,S161)","v":"0159"}]
[{"$f":" Recap!B162","v":"C32"},{"$f":"Recap!M162","v":27},{"$f":"Recap!O162","v":1},{"$f":"Recap!N162","v":43},160,127.57,166,{"$f":"RANK(G162,$G$3:$G$194,1)+COUNTIF(G$3:G162,G162)-1","v":168},{"$f":"IFERROR(INDEX(Liste!$G$7:$G$198,MATCH(K162,Liste!$I$7:$I$198,0)),\"\")","v":0},160,"A16",29,1,44,16,null,-15,54,0,160,"A16",29,1,44,16,null,-15,12629.56,160,{"$f":"RANK(AC162,$AC$3:$AC$194,1)+COUNTIF(AC$3:AC162,AC162)-1","v":160},null,{"$f":"S162&COUNTIF(S$3:S162,S162)","v":"0160"}]
[{"$f":" Recap!B163","v":"C33"},{"$f":"Recap!M163","v":22},{"$f":"Recap!O163","v":1},{"$f":"Recap!N163","v":46},161,122.54,175,{"$f":"RANK(G163,$G$3:$G$194,1)+COUNTIF(G$3:G163,G163)-1","v":177},{"$f":"IFERROR(INDEX(Liste!$G$7:$G$198,MATCH(K163,Liste!$I$7:$I$198,0)),\"\")","v":0},{"$f":"INDEX(G:G,MATCH(ROW()-2,H:H,0))","v":160},{"$f":"INDEX(A:A,MATCH(ROW()-2,H:H,0))","v":"B16"},{"$f":"INDEX(B:B,MATCH(ROW()-2,H:H,0))","v":29},1,{"$f":"INDEX(D:D,MATCH(ROW()-2,H:H,0))","v":44},{"$f":"INDEX(E:E,MATCH(ROW()-2,H:H,0))","v":80},null,-15,null,{"$f":"INDEX(I:I,MATCH(U163,K:K,0))","v":0},160,{"$f":"INDEX(K:K,MATCH(ROW()-2,$AD:$AD,0))","v":"B16"},{"$f":"INDEX(L:L,MATCH(ROW()-2,$AD:$AD,0))","v":29},{"$f":"INDEX(M:M,MATCH(ROW()-2,$AD:$AD,0))","v":1},{"$f":"INDEX(N:N,MATCH(ROW()-2,$AD:$AD,0))","v":44},{"$f":"INDEX(O:O,MATCH(ROW()-2,$AD:$AD,0))","v":80},null,-15,12629.56,160,{"$f":"RANK(AC163,$AC$3:$AC$194,1)+COUNTIF(AC$3:AC163,AC163)-1","v":161},null,{"$f":"S163&COUNTIF(S$3:S163,S163)","v":"0161"}]
[{"$f":" Recap!B164","v":"C34"},{"$f":"Recap!M164","v":33},{"$f":"Recap!O164","v":2},{"$f":"Recap!N164","v":39},162,233.61,118,{"$f":"RANK(G164,$G$3:$G$194,1)+COUNTIF(G$3:G164,G164)-1","v":120},{"$f":"IFERROR(INDEX(Liste!$G$7:$G$198,MATCH(K164,Liste!$I$7:$I$198,0)),\"\")","v":0},160,"C16",29,1,44,144,null,-15,null,0,160,"C16",29,1,44,144,null,-15,12629.56,160,{"$f":"RANK(AC164,$AC$3:$AC$194,1)+COUNTIF(AC$3:AC164,AC164)-1","v":162},null,{"$f":"S164&COUNTIF(S$3:S164,S164)","v":"0162"}]
[{"$f":" Recap!B165","v":"C35"},{"$f":"Recap!M165","v":44},{"$f":"Recap!O165","v":3},{"$f":"Recap!N165","v":36},163,344.64,43,{"$f":"RANK(G165,$G$3:$G$194,1)+COUNTIF(G$3:G165,G165)-1","v":48},{"$f":"IFERROR(INDEX(Liste!$G$7:$G$198,MATCH(K165,Liste!$I$7:$I$198,0)),\"\")","v":0},163,"A30",29,1,46,30,null,-17,55,0,163,"A32",27,1,43,32,null,-16,12429.54,166,{"$f":"RANK(AC165,$AC$3:$AC$194,1)+COUNTIF(AC$3:AC165,AC165)-1","v":166},null,{"$f":"S165&COUNTIF(S$3:S165,S165)","v":"0163"}]
[{"$f":" Recap!B166","v":"C36"},{"$f":"Recap!M166","v":41},{"$f":"Recap!O166","v":2},{"$f":"Recap!N166","v":35},164,241.65,88,{"$f":"RANK(G166,$G$3:$G$194,1)+COUNTIF(G$3:G166,G166)-1","v":90},{"$f":"IFERROR(INDEX(Liste!$G$7:$G$198,MATCH(K166,Liste!$I$7:$I$198,0)),\"\")","v":0},163,"B30",29,1,46,94,null,-17,null,0,163,"B32",27,1,43,96,null,-16,12429.54,166,{"$f":"RANK(AC166,$AC$3:$AC$194,1)+COUNTIF(AC$3:AC166,AC166)-1","v":167},null,{"$f":"S166&COUNTIF(S$3:S166,S166)","v":"0164"}]
[{"$f":" Recap!B167","v":"C37"},{"$f":"Recap!M167","v":52},{"$f":"Recap!O167","v":4},{"$f":"Recap!N167","v":37},165,452.63,10,{"$f":"RANK(G167,$G$3:$G$194,1)+COUNTIF(G$3:G167,G167)-1","v":12},{"$f":"IFERROR(INDEX(Liste!$G$7:$G$198,MATCH(K167,Liste!$I$7:$I$198,0)),\"\")","v":0},163,"C30",29,1,46,158,null,-17,null,0,163,"C32",27,1,43,160,null,-16,12429.54,166,{"$f":"RANK(AC167,$AC$3:$AC$194,1)+COUNTIF(AC$3:AC167,AC167)-1","v":168},null,{"$f":"S167&COUNTIF(S$3:S167,S167)","v":"0165"}]
[{"$f":" Recap!B168","v":"C38"},{"$f":"Recap!M168","v":50},{"$f":"Recap!O168","v":3},{"$f":"Recap!N168","v":35},166,350.65,16,{"$f":"RANK(G168,$G$3:$G$194,1)+COUNTIF(G$3:G168,G168)-1","v":18},{"$f":"IFERROR(INDEX(Liste!$G$7:$G$198,MATCH(K168,Liste!$I$7:$I$198,0)),\"\")","v":0},166,"A32",27,1,43,32,null,-16,56,0,166,"A30",29,1,46,30,null,-17,12527.57,163,{"$f":"RANK(AC168,$AC$3:$AC$194,1)+COUNTIF(AC$3:AC168,AC168)-1","v":163},null,{"$f":"S168&COUNTIF(S$3:S168,S168)","v":"0166"}]
[{"$f":" Recap!B169","v":"C39"},{"$f":"Recap!M169","v":49},{"$f":"Recap!O169","v":3},{"$f":"Recap!N169","v":31},167,349.69,31,{"$f":"RANK(G169,$G$3:$G$194,1)+COUNTIF(G$3:G169,G169)-1","v":33},{"$f":"IFERROR(INDEX(Liste!$G$7:$G$198,MATCH(K169,Liste!$I$7:$I$198,0)),\"\")","v":0},166,"B32",27,1,43,96,null,-16,null,0,166,"B30",29,1,46,94,null,-17,12527.57,163,{"$f":"RANK(AC169,$AC$3:$AC$194,1)+COUNTIF(AC$3:AC169,AC169)-1","v":164},null,{"$f":"S169&COUNTIF(S$3:S169,S169)","v":"0167"}]
[{"$f":" Recap!B170","v":"C40"},{"$f":"Recap!M170","v":38},{"$f":"Recap!O170","v":2},{"$f":"Recap!N170","v":38},168,238.62,106,{"$f":"RANK(G170,$G$3:$G$194,1)+COUNTIF(G$3:G170,G170)-1","v":108},{"$f":"IFERROR(INDEX(Liste!$G$7:$G$198,MATCH(K170,Liste!$I$7:$I$198,0)),\"\")","v":0},166,"C32",27,1,43,160,null,-16,null,0,166,"C30",29,1,46,158,null,-17,12527.57,163,{"$f":"RANK(AC170,$AC$3:$AC$194,1)+COUNTIF(AC$3:AC170,AC170)-1","v":165},null,{"$f":"S170&COUNTIF(S$3:S170,S170)","v":"0168"}]
[{"$f":" Recap!B171","v":"C41"},{"$f":"Recap!M171","v":38},{"$f":"Recap!O171","v":2},{"$f":"Recap!N171","v":45},169,238.55,109,{"$f":"RANK(G171,$G$3:$G$194,1)+COUNTIF(G$3:G171,G171)-1","v":111},{"$f":"IFERROR(INDEX(Liste!$G$7:$G$198,MATCH(K171,Liste!$I$7:$I$198,0)),\"\")","v":0},169,"A60",26,1,47,60,null,-21,57,0,169,"A60",26,1,47,60,null,-21,12026.53,169,{"$f":"RANK(AC171,$AC$3:$AC$194,1)+COUNTIF(AC$3:AC171,AC171)-1","v":169},null,{"$f":"S171&COUNTIF(S$3:S171,S171)","v":"0169"}]
[{"$f":" Recap!B172","v":"C42"},{"$f":"Recap!M172","v":50},{"$f":"Recap!O172","v":3},{"$f":"Recap!N172","v":37},170,350.63,19,{"$f":"RANK(G172,$G$3:$G$194,1)+COUNTIF(G$3:G172,G172)-1","v":21},{"$f":"IFERROR(INDEX(Liste!$G$7:$G$198,MATCH(K172,Liste!$I$7:$I$198,0)),\"\")","v":0},169,"B60",26,1,47,124,null,-21,null,0,169,"B60",26,1,47,124,null,-21,12026.53,169,{"$f":"RANK(AC172,$AC$3:$AC$194,1)+COUNTIF(AC$3:AC172,AC172)-1","v":170},null,{"$f":"S172&COUNTIF(S$3:S172,S172)","v":"0170"}]
[{"$f":" Recap!B173","v":"C43"},{"$f":"Recap!M173","v":48},{"$f":"Recap!O173","v":2},{"$f":"Recap!N173","v":42},171,248.58,61,{"$f":"RANK(G173,$G$3:$G$194,1)+COUNTIF(G$3:G173,G173)-1","v":66},{"$f":"IFERROR(INDEX(Liste!$G$7:$G$198,MATCH(K173,Liste!$I$7:$I$198,0)),\"\")","v":0},169,"C60",26,1,47,188,null,-21,null,0,169,"C60",26,1,47,188,null,-21,12026.53,169,{"$f":"RANK(AC173,$AC$3:$AC$194,1)+COUNTIF(AC$3:AC173,AC173)-1","v":171},null,{"$f":"S173&COUNTIF(S$3:S173,S173)","v":"0171"}]
[{"$f":" Recap!B174","v":"C44"},{"$f":"Recap!M174","v":39},{"$f":"Recap!O174","v":1},{"$f":"Recap!N174","v":47},172,139.53,133,{"$f":"RANK(G174,$G$3:$G$194,1)+COUNTIF(G$3:G174,G174)-1","v":135},{"$f":"IFERROR(INDEX(Liste!$G$7:$G$198,MATCH(K174,Liste!$I$7:$I$198,0)),\"\")","v":0},172,"A50",24,1,46,50,null,-22,58,0,172,"A50",24,1,46,50,null,-22,11924.54,172,{"$f":"RANK(AC174,$AC$3:$AC$194,1)+COUNTIF(AC$3:AC174,AC174)-1","v":172},null,{"$f":"S174&COUNTIF(S$3:S174,S174)","v":"0172"}]
[{"$f":" Recap!B175","v":"C45"},{"$f":"Recap!M175","v":45},{"$f":"Recap!O175","v":2},{"$f":"Recap!N175","v":35},173,245.65,67,{"$f":"RANK(G175,$G$3:$G$194,1)+COUNTIF(G$3:G175,G175)-1","v":69},{"$f":"IFERROR(INDEX(Liste!$G$7:$G$198,MATCH(K175,Liste!$I$7:$I$198,0)),\"\")","v":0},172,"B50",24,1,46,114,null,-22,null,0,172,"B50",24,1,46,114,null,-22,11924.54,172,{"$f":"RANK(AC175,$AC$3:$AC$194,1)+COUNTIF(AC$3:AC175,AC175)-1","v":173},null,{"$f":"S175&COUNTIF(S$3:S175,S175)","v":"0173"}]
[{"$f":" Recap!B176","v":"C46"},{"$f":"Recap!M176","v":35},{"$f":"Recap!O176","v":1},{"$f":"Recap!N176","v":41},174,135.59,139,{"$f":"RANK(G176,$G$3:$G$194,1)+COUNTIF(G$3:G176,G176)-1","v":141},{"$f":"IFERROR(INDEX(Liste!$G$7:$G$198,MATCH(K176,Liste!$I$7:$I$198,0)),\"\")","v":0},172,"C50",24,1,46,178,null,-22,null,0,172,"C50",24,1,46,178,null,-22,11924.54,172,{"$f":"RANK(AC176,$AC$3:$AC$194,1)+COUNTIF(AC$3:AC176,AC176)-1","v":174},null,{"$f":"S176&COUNTIF(S$3:S176,S176)","v":"0174"}]
[{"$f":" Recap!B177","v":"C47"},{"$f":"Recap!M177","v":21},{"$f":"Recap!O177","v":0},{"$f":"Recap!N177","v":52},175,21.48,181,{"$f":"RANK(G177,$G$3:$G$194,1)+COUNTIF(G$3:G177,G177)-1","v":188},{"$f":"IFERROR(INDEX(Liste!$G$7:$G$198,MATCH(K177,Liste!$I$7:$I$198,0)),\"\")","v":0},175,"A33",22,1,46,33,null,-24,59,0,175,"A1",19,1,41,1,null,-22,11722.54,178,{"$f":"RANK(AC177,$AC$3:$AC$194,1)+COUNTIF(AC$3:AC177,AC177)-1","v":178},null,{"$f":"S177&COUNTIF(S$3:S177,S177)","v":"0175"}]
[{"$f":" Recap!B178","v":"C48"},{"$f":"Recap!M178","v":34},{"$f":"Recap!O178","v":1},{"$f":"Recap!N178","v":43},176,134.57,145,{"$f":"RANK(G178,$G$3:$G$194,1)+COUNTIF(G$3:G178,G178)-1","v":147},{"$f":"IFERROR(INDEX(Liste!$G$7:$G$198,MATCH(K178,Liste!$I$7:$I$198,0)),\"\")","v":0},175,"B33",22,1,46,97,null,-24,null,0,175,"B1",19,1,41,65,null,-22,11722.54,178,{"$f":"RANK(AC178,$AC$3:$AC$194,1)+COUNTIF(AC$3:AC178,AC178)-1","v":179},null,{"$f":"S178&COUNTIF(S$3:S178,S178)","v":"0176"}]
[{"$f":" Recap!B179","v":"C49"},{"$f":"Recap!M179","v":44},{"$f":"Recap!O179","v":3},{"$f":"Recap!N179","v":24},177,344.76,40,{"$f":"RANK(G179,$G$3:$G$194,1)+COUNTIF(G$3:G179,G179)-1","v":42},{"$f":"IFERROR(INDEX(Liste!$G$7:$G$198,MATCH(K179,Liste!$I$7:$I$198,0)),\"\")","v":0},175,"C33",22,1,46,161,null,-24,null,0,175,"C1",19,1,41,129,null,-22,11722.54,178,{"$f":"RANK(AC179,$AC$3:$AC$194,1)+COUNTIF(AC$3:AC179,AC179)-1","v":180},null,{"$f":"S179&COUNTIF(S$3:S179,S179)","v":"0177"}]
[{"$f":" Recap!B180","v":"C50"},{"$f":"Recap!M180","v":24},{"$f":"Recap!O180","v":1},{"$f":"Recap!N180","v":46},178,124.54,172,{"$f":"RANK(G180,$G$3:$G$194,1)+COUNTIF(G$3:G180,G180)-1","v":174},{"$f":"IFERROR(INDEX(Liste!$G$7:$G$198,MATCH(K180,Liste!$I$7:$I$198,0)),\"\")","v":0},178,"A1",19,1,41,1,null,-22,60,0,178,"A33",22,1,46,33,null,-24,11919.59,175,{"$f":"RANK(AC180,$AC$3:$AC$194,1)+COUNTIF(AC$3:AC180,AC180)-1","v":175},null,{"$f":"S180&COUNTIF(S$3:S180,S180)","v":"0178"}]
[{"$f":" Recap!B181","v":"C51"},{"$f":"Recap!M181","v":40},{"$f":"Recap!O181","v":2},{"$f":"Recap!N181","v":38},179,240.62,91,{"$f":"RANK(G181,$G$3:$G$194,1)+COUNTIF(G$3:G181,G181)-1","v":93},{"$f":"IFERROR(INDEX(Liste!$G$7:$G$198,MATCH(K181,Liste!$I$7:$I$198,0)),\"\")","v":0},178,"B1",19,1,41,65,null,-22,null,0,178,"B33",22,1,46,97,null,-24,11919.59,175,{"$f":"RANK(AC181,$AC$3:$AC$194,1)+COUNTIF(AC$3:AC181,AC181)-1","v":176},null,{"$f":"S181&COUNTIF(S$3:S181,S181)","v":"0179"}]
[{"$f":" Recap!B182","v":"C52"},{"$f":"Recap!M182","v":52},{"$f":"Recap!O182","v":4},{"$f":"Recap!N182","v":24},180,452.76,1,{"$f":"RANK(G182,$G$3:$G$194,1)+COUNTIF(G$3:G182,G182)-1","v":6},{"$f":"IFERROR(INDEX(Liste!$G$7:$G$198,MATCH(K182,Liste!$I$7:$I$198,0)),\"\")","v":0},178,"C1",19,1,41,129,null,-22,null,0,178,"C33",22,1,46,161,null,-24,11919.59,175,{"$f":"RANK(AC182,$AC$3:$AC$194,1)+COUNTIF(AC$3:AC182,AC182)-1","v":177},null,{"$f":"S182&COUNTIF(S$3:S182,S182)","v":"0180"}]
[{"$f":" Recap!B183","v":"C53"},{"$f":"Recap!M183","v":35},{"$f":"Recap!O183","v":1},{"$f":"Recap!N183","v":47},181,135.53,142,{"$f":"RANK(G183,$G$3:$G$194,1)+COUNTIF(G$3:G183,G183)-1","v":144},{"$f":"IFERROR(INDEX(Liste!$G$7:$G$198,MATCH(K183,Liste!$I$7:$I$198,0)),\"\")","v":0},181,"A29",21,0,52,29,null,-31,61,0,181,"A29",21,0,52,29,null,-31,1021.48,181,{"$f":"RANK(AC183,$AC$3:$AC$194,1)+COUNTIF(AC$3:AC183,AC183)-1","v":181},null,{"$f":"S183&COUNTIF(S$3:S183,S183)","v":"0181"}]
[{"$f":" Recap!B184","v":"C54"},{"$f":"Recap!M184","v":46},{"$f":"Recap!O184","v":3},{"$f":"Recap!N184","v":34},182,346.66,37,{"$f":"RANK(G184,$G$3:$G$194,1)+COUNTIF(G$3:G184,G184)-1","v":39},{"$f":"IFERROR(INDEX(Liste!$G$7:$G$198,MATCH(K184,Liste!$I$7:$I$198,0)),\"\")","v":0},181,"A47",21,0,52,47,null,-31,null,0,181,"A47",21,0,52,47,null,-31,1021.48,181,{"$f":"RANK(AC184,$AC$3:$AC$194,1)+COUNTIF(AC$3:AC184,AC184)-1","v":182},null,{"$f":"S184&COUNTIF(S$3:S184,S184)","v":"0182"}]
[{"$f":" Recap!B185","v":"C55"},{"$f":"Recap!M185","v":21},{"$f":"Recap!O185","v":0},{"$f":"Recap!N185","v":52},183,21.48,181,{"$f":"RANK(G185,$G$3:$G$194,1)+COUNTIF(G$3:G185,G185)-1","v":189},{"$f":"IFERROR(INDEX(Liste!$G$7:$G$198,MATCH(K185,Liste!$I$7:$I$198,0)),\"\")","v":0},181,"A55",21,0,52,55,null,-31,null,0,181,"A55",21,0,52,55,null,-31,1021.48,181,{"$f":"RANK(AC185,$AC$3:$AC$194,1)+COUNTIF(AC$3:AC185,AC185)-1","v":183},null,{"$f":"S185&COUNTIF(S$3:S185,S185)","v":"0183"}]
[{"$f":" Recap!B186","v":"C56"},{"$f":"Recap!M186","v":41},{"$f":"Recap!O186","v":2},{"$f":"Recap!N186","v":30},184,241.7,85,{"$f":"RANK(G186,$G$3:$G$194,1)+COUNTIF(G$3:G186,G186)-1","v":87},{"$f":"IFERROR(INDEX(Liste!$G$7:$G$198,MATCH(K186,Liste!$I$7:$I$198,0)),\"\")","v":0},181,"B29",21,0,52,93,null,-31,62,0,181,"B29",21,0,52,93,null,-31,1021.48,181,{"$f":"RANK(AC186,$AC$3:$AC$194,1)+COUNTIF(AC$3:AC186,AC186)-1","v":184},null,{"$f":"S186&COUNTIF(S$3:S186,S186)","v":"0184"}]
[{"$f":" Recap!B187","v":"C57"},{"$f":"Recap!M187","v":32},{"$f":"Recap!O187","v":2},{"$f":"Recap!N187","v":38},185,232.62,127,{"$f":"RANK(G187,$G$3:$G$194,1)+COUNTIF(G$3:G187,G187)-1","v":129},{"$f":"IFERROR(INDEX(Liste!$G$7:$G$198,MATCH(K187,Liste!$I$7:$I$198,0)),\"\")","v":0},181,"B47",21,0,52,111,null,-31,null,0,181,"B47",21,0,52,111,null,-31,1021.48,181,{"$f":"RANK(AC187,$AC$3:$AC$194,1)+COUNTIF(AC$3:AC187,AC187)-1","v":185},null,{"$f":"S187&COUNTIF(S$3:S187,S187)","v":"0185"}]
[{"$f":" Recap!B188","v":"C58"},{"$f":"Recap!M188","v":35},{"$f":"Recap!O188","v":2},{"$f":"Recap!N188","v":37},186,235.63,115,{"$f":"RANK(G188,$G$3:$G$194,1)+COUNTIF(G$3:G188,G188)-1","v":117},{"$f":"IFERROR(INDEX(Liste!$G$7:$G$198,MATCH(K188,Liste!$I$7:$I$198,0)),\"\")","v":0},181,"B55",21,0,52,119,null,-31,null,0,181,"B55",21,0,52,119,null,-31,1021.48,181,{"$f":"RANK(AC188,$AC$3:$AC$194,1)+COUNTIF(AC$3:AC188,AC188)-1","v":186},null,{"$f":"S188&COUNTIF(S$3:S188,S188)","v":"0186"}]
[{"$f":" Recap!B189","v":"C59"},{"$f":"Recap!M189","v":32},{"$f":"Recap!O189","v":1},{"$f":"Recap!N189","v":43},187,132.57,151,{"$f":"RANK(G189,$G$3:$G$194,1)+COUNTIF(G$3:G189,G189)-1","v":153},{"$f":"IFERROR(INDEX(Liste!$G$7:$G$198,MATCH(K189,Liste!$I$7:$I$198,0)),\"\")","v":0},181,"C29",21,0,52,157,null,-31,63,0,181,"C29",21,0,52,157,null,-31,1021.48,181,{"$f":"RANK(AC189,$AC$3:$AC$194,1)+COUNTIF(AC$3:AC189,AC189)-1","v":187},null,{"$f":"S189&COUNTIF(S$3:S189,S189)","v":"0187"}]
[{"$f":" Recap!B190","v":"C60"},{"$f":"Recap!M190","v":26},{"$f":"Recap!O190","v":1},{"$f":"Recap!N190","v":47},188,126.53,169,{"$f":"RANK(G190,$G$3:$G$194,1)+COUNTIF(G$3:G190,G190)-1","v":171},{"$f":"IFERROR(INDEX(Liste!$G$7:$G$198,MATCH(K190,Liste!$I$7:$I$198,0)),\"\")","v":0},181,"C47",21,0,52,175,null,-31,null,0,181,"C47",21,0,52,175,null,-31,1021.48,181,{"$f":"RANK(AC190,$AC$3:$AC$194,1)+COUNTIF(AC$3:AC190,AC190)-1","v":188},null,{"$f":"S190&COUNTIF(S$3:S190,S190)","v":"0188"}]
[{"$f":" Recap!B191","v":"C61"},{"$f":"Recap!M191","v":37},{"$f":"Recap!O191","v":2},{"$f":"Recap!N191","v":34},189,237.66,112,{"$f":"RANK(G191,$G$3:$G$194,1)+COUNTIF(G$3:G191,G191)-1","v":114},{"$f":"IFERROR(INDEX(Liste!$G$7:$G$198,MATCH(K191,Liste!$I$7:$I$198,0)),\"\")","v":0},181,"C55",21,0,52,183,null,-31,null,0,181,"C55",21,0,52,183,null,-31,1021.48,181,{"$f":"RANK(AC191,$AC$3:$AC$194,1)+COUNTIF(AC$3:AC191,AC191)-1","v":189},null,{"$f":"S191&COUNTIF(S$3:S191,S191)","v":"0189"}]
[{"$f":" Recap!B192","v":"C62"},{"$f":"Recap!M192","v":32},{"$f":"Recap!O192","v":2},{"$f":"Recap!N192","v":37},190,232.63,124,{"$f":"RANK(G192,$G$3:$G$194,1)+COUNTIF(G$3:G192,G192)-1","v":126},{"$f":"IFERROR(INDEX(Liste!$G$7:$G$198,MATCH(K192,Liste!$I$7:$I$198,0)),\"\")","v":0},190,"A2",11,0,52,2,null,-41,64,0,190,"A2",11,0,52,2,null,-41,11.48,190,{"$f":"RANK(AC192,$AC$3:$AC$194,1)+COUNTIF(AC$3:AC192,AC192)-1","v":190},null,{"$f":"S192&COUNTIF(S$3:S192,S192)","v":"0190"}]
[{"$f":" Recap!B193","v":"C63"},{"$f":"Recap!M193","v":41},{"$f":"Recap!O193","v":3},{"$f":"Recap!N193","v":25},191,341.75,52,{"$f":"RANK(G193,$G$3:$G$194,1)+COUNTIF(G$3:G193,G193)-1","v":54},{"$f":"IFERROR(INDEX(Liste!$G$7:$G$198,MATCH(K193,Liste!$I$7:$I$198,0)),\"\")","v":0},190,"B2",11,0,52,66,null,-41,null,0,190,"B2",11,0,52,66,null,-41,11.48,190,{"$f":"RANK(AC193,$AC$3:$AC$194,1)+COUNTIF(AC$3:AC193,AC193)-1","v":191},null,{"$f":"S193&COUNTIF(S$3:S193,S193)","v":"0191"}]
[{"$f":" Recap!B194","v":"C64"},{"$f":"Recap!M194","v":43},{"$f":"Recap!O194","v":3},{"$f":"Recap!N194","v":25},192,343.75,49,{"$f":"RANK(G194,$G$3:$G$194,1)+COUNTIF(G$3:G194,G194)-1","v":51},{"$f":"IFERROR(INDEX(Liste!$G$7:$G$198,MATCH(K194,Liste!$I$7:$I$198,0)),\"\")","v":0},190,"C2",11,0,52,130,null,-41,null,0,190,"C2",11,0,52,130,null,-41,11.48,190,{"$f":"RANK(AC194,$AC$3:$AC$194,1)+COUNTIF(AC$3:AC194,AC194)-1","v":192},null,{"$f":"S194&COUNTIF(S$3:S194,S194)","v":"0192"}]