{"text_format":"1","workbook":"xlsx","n_sheets":7,"sheets":["RELEVÉS","MAI_2022","MINI-MAXI","MOIS","CONSOLE","GRAPHIQUES","Liste_shapes"],"not_rendered":{"charts":23,"images":56,"macros":1,"external_links":0,"defined_names":2,"comments":1,"pivot_tables":0},"unopened":[],"bounds":{"document_bytes":16777216,"sheet_cells":100000,"rows_first":2000,"rows_last":500,"rows_between":2000,"halvings":0,"cell_chars":16384,"cell_head_chars":4096},"cells_cut":0,"cells_raw":0,"read":"whole","date_system":"1900"}

{"sheet":"RELEVÉS","index":0,"n_rows":1450,"n_cols":49,"rows_kept":1450,"cut":false,"hidden":false,"merged":[[1,27,1,35]]}
["08:48:00",null,null,null,null,null,null,null,null,null,"J",null,null,"N",null,null,"W",null,null,null,null,null,null,null,null,null,null,null,null,null,null,null,null,null,null,null,null,"AG",null,null,"AK",null,null,null,null,null,null,"AX","AX"]
[null,"Pression mini",null,null,"Pression maxi",null,null,"Température ressentie",null,null,"Température mini",null,null,"Température maxi",null,null,"Vent en Km/h",null,null,null,null,null,null,null,null,null,null,"Humidité H%",null,null,null,null,null,null,null,null,null,"Pluie",null,null,"Temps de pluie",null,null,null,null,null,null,"Sonde Soleil"]
[null,"mini",null,"heure","maxi",null,"heure","mini",null,"heure","mini",null,"heure","maxi",null,"heure","maxi",null,"Heure",null,"Moyenne",null,null,"Sens",null,"Sens",null,"Mini",null,"Heure",null,"Maxi",null,"Heure",null,"Moy","mm",null,"Heure",null,"AK",null,null,null,null,null,null,{"$f":"W1450/60/1440","v":6.3888888888888884E-2}]
[null,null,null,null,null,null,null,null,null,null,null,null,null,null,null,null,null,null,null,null,null,null,null,null,null,null,null,null,null,null,null,null,null,null,null,null,null,null,null,null,"0 à 7h",null,"7 à 12h",null," 12 à 19h",null,"19h à 24h"]
[null,{"$f":"MIN(H9:H1448)","v":1019.7},null,{"$f":"VLOOKUP($B5,$H$9:$Q$1448,10,0)","v":"00:01:00"},{"$f":"MAX(H9:H1448)","v":1024.2},null,{"$f":"VLOOKUP($E5,$H$9:$Q$1448,10,0)","v":"09:08:00"},{"$f":"MAX($B$9:$B$1448)","v":15.7},null,{"$f":"VLOOKUP($H5,$D$9:$Q$1448,14,0)","v":"09:06:00"},{"$f":"MIN($B$9:$B$1448)","v":12.8},null,{"$f":"VLOOKUP($K5,$B$9:$Q$1448,16,0)","v":"06:34:00"},{"$f":"MAX(B9:B1448)","v":15.7},null,{"$f":"VLOOKUP($N5,$B$9:$Q$1448,16,0)","v":"09:06:00"},{"$f":"MAX(E9:F1448)","v":13},null,{"$f":"VLOOKUP($Q5,$F$9:$Q$1448,12,0)","v":"08:51:00"},null,{"$f":"AVERAGE(F9:F1448)","v":4.4507246376811596},null,null,null,null,"ONO",null,{"$f":"MIN(C9:C1448)","v":76},null,null,null,{"$f":"MAX(C9:C1448)","v":86},null,{"$f":"VLOOKUP($AF5,$C$9:$Q$1448,15,0)","v":"06:28:00"},null,{"$f":"AVERAGE(C9:C1448)","v":81.385869565217391},{"$f":"MAX($K$9:$K$1448)","v":0},null,{"$f":"(U1450/60)/1440","v":"00:00:00"},null,{"$f":"AO6+AQ6","v":"00:00:00"},null,null,null,{"$f":"AS6+AU6","v":"00:00:00"}]
[null,null,null,null,null,null,null,null,null,null,null,null,null,null,null,null,null,null,null,null,null,null,null,null,null,null,null,null,null,null,null,null,null,null,null,null,null,null,null,null,{"$f":"SUM(U9:U428)/60/1440","v":"00:00:00"},null,{"$f":"SUM(U429:U728)/60/1440","v":"00:00:00"},null,{"$f":"SUM(U729:U1148)/60/1440","v":"00:00:00"},null,{"$f":"SUM(U1148:U1448)/60/1440","v":"00:00:00"}]
[null,"5","6","8","9","10","11","13","14","15","16"]
[null,"T° Ext","H% Ext","Ressentie","Vent","Rafale","Sens","Pression","Lux","Pluie 1h","Jour","Semaine","Mois","Année","CH1","CH2","Heures","Date","Maxi","Graph","Pluie",null,"Soleil",null,null,"Soleil",null,null,null,null,null,null,null,null,null,null,"Fin",null,"Début"]
[null,13.8,77,13.8,1.8,3.6,38,1020,0,0,0,11.7,15.2,138.69999999999999,11.5,12,"00:00:00","20220525",null,null,null,null,null,null,null,"N",null,null,null,0,0]
[null,13.8,77,13.8,4,5.4,4,1019.7,0,0,0,11.7,15.2,138.69999999999999,11.5,12,"00:01:00",null,null,null,{"$f":"IF(J10>0,60,\"\")","v":""},null,null,null,null,"N",null,0,null,11,22]
[null,13.8,77,13.8,0.4,1.8,33,1020.1,0,0,0,11.7,15.2,138.69999999999999,11.5,12,"00:02:00",null,null,null,{"$f":"IF(J11>0,60,\"\")","v":""},null,null,null,null,"NNE",null,22.5,null,{"$f":"AB11+$AD$10","v":33.5},45,null,null,null,null,null,null,null,"Aide mémoire"]
[null,13.7,77,13.7,1.8,1.8,136,1019.9,0,0,0,11.7,15.2,138.69999999999999,11.5,12,"00:03:00",null,null,null,{"$f":"IF(J12>0,60,\"\")","v":""},null,null,null,null,"NE",null,45,null,56,67,null,null,null,null,null,"Pluie",null,"=SOMME(K9:K1448)"]
[null,13.7,77,13.7,4,5.4,305,1019.8,0,0,0,11.7,15.2,138.69999999999999,11.5,12,"00:04:00",null,null,null,"",null,null,null,null,"ENE",null,67.5,null,78.5,90]
[null,13.7,77,13.7,4.3,5.4,298,1020,0,0,0,11.7,15.2,138.69999999999999,11.5,12,"00:05:00",null,null,null,"",null,null,null,null,null,null,90,null,101,112,null,null,null,null,null,"Commentaires",null,null,null,"=SOMME(U9:U1448)"]
[null,13.7,77,13.7,0.7,1.8,110,1019.8,0,0,0,11.7,15.2,138.69999999999999,11.5,12,"00:06:00",null,null,null,"",null,null,null,null,"ESE",null,112.5,null,123.5,135]
[null,13.7,77,13.7,5,5.4,305,1019.7,0,0,0,11.7,15.2,138.69999999999999,11.5,12,"00:07:00",null,null,null,"",null,null,null,null,"SSE",null,135,null,146,157,null,null,null,null,null,"Soleil",null,"=SOMME(W9:W1448)"]
[null,13.7,77,13.7,7.9,9.4,282,1019.9,0,0,0,11.7,15.2,138.69999999999999,11.5,12,"00:08:00",null,null,null,"",null,null,null,null,"SE",null,157.5,null,168.5,180,null,null,null,null,null,"Soleil",null,"=W1450/60/1440"]
[null,13.7,77,13.7,2.2000000000000002,3.6,278,1019.8,0,0,0,11.7,15.2,138.69999999999999,11.5,12,"00:09:00",null,null,null,"",null,null,null,null,"S",null,180,null,191,202]
[null,13.7,77,13.7,1.8,1.8,219,1019.8,0,0,0,11.7,15.2,138.69999999999999,11.4,12,"00:10:00",null,null,null,"",null,null,null,null,"SSO",null,202.5,null,213.5,225]
[null,13.7,77,13.7,4.7,5.4,0,1019.9,0,0,0,11.7,15.2,138.69999999999999,11.4,12,"00:11:00",null,null,null,"",null,null,null,null,"SO",null,225,null,236,247]
[null,13.7,77,13.7,2.9,5.4,268,1019.9,0,0,0,11.7,15.2,138.69999999999999,11.5,12,"00:12:00",null,null,null,"",null,null,null,null,"OSO",null,247.5,null,258.5,270]
[null,13.7,77,13.7,1.4,1.8,46,1019.8,0,0,0,11.7,15.2,138.69999999999999,11.5,12,"00:13:00",null,null,null,"",null,null,null,null,"O",null,270,null,281,292]
[null,13.7,77,13.7,3.6,3.6,287,1019.8,0,0,0,11.7,15.2,138.69999999999999,11.4,12,"00:14:00",null,null,null,"",null,null,null,null,"ONO",null,292.5,null,303.5,315]
[null,13.7,77,13.7,2.2000000000000002,3.6,126,1020,0,0,0,11.7,15.2,138.69999999999999,11.5,11.9,"00:15:00",null,null,null,"",null,null,null,null,"NO",null,315,null,326,337]
[null,13.7,77,13.7,4.7,5.4,298,1020,0,0,0,11.7,15.2,138.69999999999999,11.4,12,"00:16:00",null,null,null,"",null,null,null,null,"NNO",null,337.5,null,348.5,349]
[null,13.7,77,13.7,5.4,7.2,350,1019.9,0,0,0,11.7,15.2,138.69999999999999,11.4,12,"00:17:00",null,null,null,"",null,null,null,null,"N",null,349,null,360]
[null,13.7,77,13.7,1.8,1.8,14,1019.9,0,0,0,11.7,15.2,138.69999999999999,11.4,11.9,"00:18:00",null,null,null,""]
[null,13.7,77,13.7,2.5,3.6,89,1020,0,0,0,11.7,15.2,138.69999999999999,11.4,11.9,"00:19:00",null,null,null,"",null,null,null,null,"Vues",null,null,null,{"$f":"INDEX($Z$9:$Z$26,IF(ISNA(MATCH($AD$30,$AD$9:$AD$26,0)),MATCH($AD$30,$AD$9:$AD$26,1)+1,MATCH($AD$30,$AD$9:$AD$26,0)),1)","v":"O"}]
[null,13.6,77,13.6,5.4,5.4,281,1020,0,0,0,11.7,15.2,138.69999999999999,11.4,11.9,"00:20:00",null,null,null,"",null,null,"2022-05-22",null,1363,null,{"$f":"SUM(AB32:AB47)","v":1},null,{"$f":"MAX(AB32:AB47)","v":0.22727272727272727},null,{"$f":"SUM(AF32:AF47)","v":22}]
[null,13.6,77,13.6,3.6,5.4,281,1020,0,0,0,11.7,15.2,138.69999999999999,11.4,11.9,"00:21:00",null,null,null,"",null,null,null,null,null,null,null,null,{"$f":"VLOOKUP(AD29,AB32:AD47,AD31,0)","v":270}]
{"$rows_left_out":1421}
{"sheet":"MAI_2022","index":1,"n_rows":86,"n_cols":67,"rows_kept":86,"cut":false,"hidden":false,"merged":[[4,23,4,25],[6,46,6,47],[8,20,8,21],[6,2,6,3],[6,20,6,21],[8,2,8,3],[6,29,6,30],[4,9,4,15]]}
[null,null,null,null,null,null,null,null,null,null,null,null,null,null,null,null,null,null,null,null,null,null,null,null,null,null,null,null,null,null,null,null,null,null,null,null,null,null,null,null,null,null,null,null,null,null,null,null,null,null,null,null,null,"La Rochelle","http://www.meteociel.fr/climatologie/villes.php?code=7316&mois=4&annee=2022",null,null,null,null,null,null,null,null,null,null,"Ephéméride","http://www.ephemeride.com/calendrier/solaire/19/horaires-du-soleil.html"]
[]
[null,null,null,null,null,null,null,null,null,null,null,null,null,null,null,null,null,null,null,null,null,null,null,null,null,null,null,null,null,{"$f":"$C$5","v":"Mai_2022"},null,null,"Hauteur de pluie en mm",null,null,null,"Temps de précipitations par 1/4 de journée",null,null,null,null,null,null,null,null,null,{"$f":"$C$5","v":"Mai_2022"},null,null,"Chaleur solaire",null,null,null,"Marées","https://marine.meteoconsult.fr/meteo-marine/horaires-maree-la-tranche-sur-mer-1083-0.php"]
[]
[null,null,"Mai_2022",null,null,"Mise à jour",null,"le",null,{"$f":"NOW()","v":"2022-05-25T18:55:23.240"},null,null,null,null,null,null,null,null,null,null,{"$f":"C5","v":"Mai_2022"},null,null,{"$f":"NOW()","v":"2022-05-25T18:55:23.240"},null,null,null,null,null,"Mise à jour",null,null,{"$f":"SUM($AG$11:$AG$72)","v":12.2},null,{"$f":"SUM($AI$11:$AI$72)","v":0.38680555555555551},null,{"$f":"SUM(AK$11:AK$72)","v":0.24027777777777781},null,{"$f":"SUM(AM$11:AM$72)","v":0.12361111111111112},null,{"$f":"SUM(AO$11:AO$72)","v":0.15972222222222221},null,{"$f":"SUM(AQ$11:AQ$72)","v":0},null,null,null,"Mise à jour",null,null,{"$f":"SUM(AX$11:AX$72)","v":12.813888888888888},null,null,null,"T° de l'eau","https://fr.surf-forecast.com/breaks/La-Tranchesur-Mer/seatemp",null,null,null,null,null,null,null,null,null,null,"meteofloralies","https://www.wunderground.com/dashboard/pws/ILATRA6"]
[]
[null,null,"Températures",null,null,{"$f":"MIN(F11:F72)","v":17.5},null,{"$f":"VLOOKUP($F$7,$F$11:$V$72,17,0)","v":"2022-05-24"},null,{"$f":"MIN($J$11:$J$72)","v":8.6999999999999993},null,{"$f":"VLOOKUP($J$7,$J$11:$V$72,13,0)","v":"2022-05-05"},null,{"$f":"MAX(N11:N55)","v":29.8},null,{"$f":"VLOOKUP($N$7,$N$11:$V$72,9,0)","v":"2022-05-18"},null,null,null,null,"Mise à jour",null,null,"Maxi",null,null,null,null,null,{"$f":"TODAY()","v":"2022-05-25"},null,null,{"$f":"VLOOKUP($AG$9,$AG$11:$AV$72,16,0)","v":"2022-05-23"},null,{"$f":"VLOOKUP($AI$9,$AI$11:$AV$72,14,0)","v":"2022-05-23"},null,"Pluie AM",null,"Pluie AM",null,"Pluie AP",null,"Pluie AP",null,null,null,{"$f":"TODAY()","v":"2022-05-25"},null,null,{"$f":"VLOOKUP($AX$9,$AX$11:$BB$72,5,0)","v":"2022-05-17"}]
[]
[null,null,null,null,null,"Ressentie",null,{"$f":"VLOOKUP($F$7,$F$11:$P$72,3,0)","v":"17:35:00"},null,"Mini",null,{"$f":"VLOOKUP($J$7,$J$11:$L$72,3,0)","v":"06:41:00"},null,"Maxi",null,{"$f":"VLOOKUP($N$7,$N$11:$P$72,3,0)","v":"16:13:00"},null,null,null,null,"Vitesse du vent",null,null,{"$f":"MAX($X$11:$X$72)","v":40.299999999999997},null,{"$f":"VLOOKUP($X$9,$X$11:$AE$72,8,0)","v":"2022-05-05"},null,null,null,{"$f":"BB9+AG5","v":135.69999999999999},"Année",null,{"$f":"MAX($AG$11:$AG$72)","v":11.2},null,{"$f":"MAX($AI$11:AI$72)","v":0.25694444444444442},null,"de 0 à 6h59",null,"7h à 11h59",null,"12h à 18h59",null,"19h à 23h59",null,null,null,"Soleil de l'Année",{"$f":"BC9+AX5","v":29.213888888888889},null,{"$f":"MAX($AX$11:$AX$72)","v":0.58611111111111114},null,null,null,123.5,16.400000000000002,null,"Météofloralies","=SUBSTITUE(TEXTE(MAX(CNUM(SUBSTITUE($U$2;\".\";\",\"));CNUM(SUBSTITUE($V$2;\".\";\",\")));\"standard\");\",\";\".\")"]
[]
[null,null,{"$f":"PROPER(TEXT(D11,\"JJJJ\"))","v":"Dimanche"},"2022-05-01",null,19.5,null,0.65208333333333302,null,9.6999999999999993,null,0.28958333333333303,null,19.5,null,0.65208333333333302,null,null,null,null,{"$f":"$C11","v":"Dimanche"},{"$f":"$D11","v":"2022-05-01"},null,20.2,null,"19:20:00",null,null,null,{"$f":"$C11","v":"Dimanche"},{"$f":"$D11","v":"2022-05-01"},null,0,null,"00:00:00",null,"00:00:00",null,"00:00:00",null,"00:00:00",null,"00:00:00",null,null,null,{"$f":"$C11","v":"Dimanche"},{"$f":"$D11","v":"2022-05-01"},null,"10:15:00",null,null,3,{"$f":"D11","v":"2022-05-01"},{"$f":"$C11","v":"Dimanche"}]
[]
[null,null,{"$f":"PROPER(TEXT(D13,\"JJJJ\"))","v":"Lundi"},{"$f":"$D11+1","v":"2022-05-02"},null,20.399999999999999,null,0.71458333333333302,null,10.1,null,0.30069444444444399,null,20.399999999999999,null,0.71458333333333302,null,null,null,null,{"$f":"$C13","v":"Lundi"},{"$f":"$D13","v":"2022-05-02"},null,29.5,null,"13:58:00",null,null,null,{"$f":"$C13","v":"Lundi"},{"$f":"$D13","v":"2022-05-02"},null,0,null,"00:00:00",null,"00:00:00",null,"00:00:00",null,"00:00:00",null,"00:00:00",null,null,null,{"$f":"$C13","v":"Lundi"},{"$f":"$D13","v":"2022-05-02"},null,"12:19:00",null,null,4,{"$f":"D13","v":"2022-05-02"},{"$f":"$C13","v":"Lundi"}]
[]
[null,null,{"$f":"PROPER(TEXT(D15,\"JJJJ\"))","v":"Mardi"},{"$f":"$D13+1","v":"2022-05-03"},null,21.5,null,0.70347222222222205,null,9.4,null,0.297916666666667,null,21.5,null,0.70347222222222205,null,null,null,null,{"$f":"$C15","v":"Mardi"},{"$f":"$D15","v":"2022-05-03"},null,25.6,null,"13:39:00",null,null,null,{"$f":"$C15","v":"Mardi"},{"$f":"$D15","v":"2022-05-03"},null,0,null,"00:00:00",null,"00:00:00",null,"00:00:00",null,"00:00:00",null,"00:00:00",null,null,null,{"$f":"$C15","v":"Mardi"},{"$f":"$D15","v":"2022-05-03"},null,"12:58:00",null,null,5,{"$f":"D15","v":"2022-05-03"},{"$f":"$C15","v":"Mardi"}]
[]
[null,null,{"$f":"PROPER(TEXT(D17,\"JJJJ\"))","v":"Mercredi"},{"$f":"$D15+1","v":"2022-05-04"},null,18.600000000000001,null,0.66666666666666696,null,9.5,null,0.25694444444444398,null,18.600000000000001,null,0.66666666666666696,null,null,null,null,{"$f":"$C17","v":"Mercredi"},{"$f":"$D17","v":"2022-05-04"},null,27.7,null,"16:02:00",null,null,null,{"$f":"$C17","v":"Mercredi"},{"$f":"$D17","v":"2022-05-04"},null,0,null,"00:00:00",null,"00:00:00",null,"00:00:00",null,"00:00:00",null,"00:00:00",null,null,null,{"$f":"$C17","v":"Mercredi"},{"$f":"$D17","v":"2022-05-04"},null,"11:19:00",null,null,6,{"$f":"D17","v":"2022-05-04"},{"$f":"$C17","v":"Mercredi"}]
[]
[null,null,{"$f":"PROPER(TEXT(D19,\"JJJJ\"))","v":"Jeudi"},{"$f":"$D17+1","v":"2022-05-05"},null,18.2,null,0.71041666666666703,null,8.6999999999999993,null,0.27847222222222201,null,18.2,null,0.71041666666666703,null,null,null,null,{"$f":"$C19","v":"Jeudi"},{"$f":"$D19","v":"2022-05-05"},null,40.299999999999997,null,"00:08:00",null,null,null,{"$f":"$C19","v":"Jeudi"},{"$f":"$D19","v":"2022-05-05"},null,0,null,"00:00:00",null,"00:00:00",null,"00:00:00",null,"00:00:00",null,"00:00:00",null,null,null,{"$f":"$C19","v":"Jeudi"},{"$f":"$D19","v":"2022-05-05"},null,"12:48:00",null,null,7,{"$f":"D19","v":"2022-05-05"},{"$f":"$C19","v":"Jeudi"}]
[]
[null,null,{"$f":"PROPER(TEXT(D21,\"JJJJ\"))","v":"Vendredi"},{"$f":"$D19+1","v":"2022-05-06"},null,22.1,null,0.73541666666666705,null,9.1999999999999993,null,0.28402777777777799,null,22.1,null,0.73541666666666705,null,null,null,null,{"$f":"$C21","v":"Vendredi"},{"$f":"$D21","v":"2022-05-06"},null,27.7,null,"13:06:00",null,null,null,{"$f":"$C21","v":"Vendredi"},{"$f":"$D21","v":"2022-05-06"},null,0,null,"00:00:00",null,"00:00:00",null,"00:00:00",null,"00:00:00",null,"00:00:00",null,null,null,{"$f":"$C21","v":"Vendredi"},{"$f":"$D21","v":"2022-05-06"},null,"12:52:00",null,null,8,{"$f":"D21","v":"2022-05-06"},{"$f":"$C21","v":"Vendredi"}]
[]
[null,null,{"$f":"PROPER(TEXT(D23,\"JJJJ\"))","v":"Samedi"},{"$f":"$D21+1","v":"2022-05-07"},null,20.5,null,0.52777777777777801,null,13.9,null,0.389583333333333,null,20.5,null,0.52777777777777801,null,null,null,null,{"$f":"$C23","v":"Samedi"},{"$f":"$D23","v":"2022-05-07"},null,26.5,null,"15:40:00",null,null,null,{"$f":"$C23","v":"Samedi"},{"$f":"$D23","v":"2022-05-07"},null,0,null,"00:00:00",null,"00:00:00",null,"00:00:00",null,"00:00:00",null,"00:00:00",null,null,null,{"$f":"$C23","v":"Samedi"},{"$f":"$D23","v":"2022-05-07"},null,"12:54:00",null,null,9,{"$f":"D23","v":"2022-05-07"},{"$f":"$C23","v":"Samedi"}]
[]
[null,null,{"$f":"PROPER(TEXT(D25,\"JJJJ\"))","v":"Dimanche"},{"$f":"$D23+1","v":"2022-05-08"},null,23.2,null,0.63333333333333297,null,11.2,null,0.28819444444444398,null,23.2,null,0.63333333333333297,null,null,null,null,{"$f":"$C25","v":"Dimanche"},{"$f":"$D25","v":"2022-05-08"},null,20.2,null,"17:12:00",null,null,null,{"$f":"$C25","v":"Dimanche"},{"$f":"$D25","v":"2022-05-08"},null,0,null,"00:00:00",null,"00:00:00",null,"00:00:00",null,"00:00:00",null,"00:00:00",null,null,null,{"$f":"$C25","v":"Dimanche"},{"$f":"$D25","v":"2022-05-08"},null,"13:08:00",null,null,10,{"$f":"D25","v":"2022-05-08"},{"$f":"$C25","v":"Dimanche"}]
[]
[null,null,{"$f":"PROPER(TEXT(D27,\"JJJJ\"))","v":"Lundi"},{"$f":"$D25+1","v":"2022-05-09"},null,26,null,0.66527777777777797,null,12.2,null,0.28402777777777799,null,26,null,0.66527777777777797,null,null,null,null,{"$f":"$C27","v":"Lundi"},{"$f":"$D27","v":"2022-05-09"},null,22,null,"16:38:00",null,null,null,{"$f":"$C27","v":"Lundi"},{"$f":"$D27","v":"2022-05-09"},null,0,null,"00:00:00",null,"00:00:00",null,"00:00:00",null,"00:00:00",null,"00:00:00",null,null,null,{"$f":"$C27","v":"Lundi"},{"$f":"$D27","v":"2022-05-09"},null,"13:22:00",null,null,11,{"$f":"D27","v":"2022-05-09"},{"$f":"$C27","v":"Lundi"}]
[]
[null,null,{"$f":"PROPER(TEXT(D29,\"JJJJ\"))","v":"Mardi"},{"$f":"$D27+1","v":"2022-05-10"},null,25,null,0.68888888888888899,null,14.3,null,0.29375000000000001,null,25,null,0.68888888888888899,null,null,null,null,{"$f":"$C29","v":"Mardi"},{"$f":"$D29","v":"2022-05-10"},null,18.399999999999999,null,"19:47:00",null,null,null,{"$f":"$C29","v":"Mardi"},{"$f":"$D29","v":"2022-05-10"},null,0,null,"00:00:00",null,"00:00:00",null,"00:00:00",null,"00:00:00",null,"00:00:00",null,null,null,{"$f":"$C29","v":"Mardi"},{"$f":"$D29","v":"2022-05-10"},null,"13:24:00",null,null,12,{"$f":"D29","v":"2022-05-10"},{"$f":"$C29","v":"Mardi"}]
[]
{"$rows_left_out":57}
{"sheet":"MINI-MAXI","index":2,"n_rows":21,"n_cols":9,"rows_kept":21,"cut":false,"hidden":false,"merged":[[5,10,5,11],[1,5,1,7],[20,3,20,5],[15,0,15,1],[16,0,16,1]]}
[{"$f":"MAI_2022!C5","v":"Mai_2022"}]
[null,null,null,null,null,null,null,null,"1900-05-24"]
[null,null,null,"Pluie Maxi Jour et total mois",null,null,"Températures Mini et Maxi",null,{"$f":"I1-940","v":-940}]
[null,null,null,null,null,"Vent maxi",null,null,3]
[null,null,null,null,null,null,null,null,{"$f":"I2-I3-I4","v":1082}]
["Jour","Mois",null,"__200    "]
[null,null,null,"__180    ",{"$f":"INDIRECT($A$1&\"!$W9\")","v":"00:00:00"},null,null,null,{"$f":"MAI_2022!J7","v":8.6999999999999993}]
[null,null,null,"__160    ",132,null,null,null,145]
[{"$f":"INDIRECT($A$1&\"!$AG5\")","v":12.2},{"$f":"INDIRECT($A$1&\"!$AG9\")","v":11.2},null,"__140    ",{"$f":"INDIRECT($A$1&\"!$X$9\")","v":40.299999999999997},null,null,null,{"$f":"I7-940","v":-931.3}]
[200,200,null,"__120    ",2,null,null,null,3]
[{"$f":"100*(1-(A9/A10))","v":93.9},{"$f":"100*(1-(B9/B10))","v":94.399999999999991},null,"__100    ",{"$f":"E8-E9-E10","v":89.7},null,null,null,{"$f":"I8-I9-I10","v":1073.3}]
[{"$f":"20*A11/100","v":18.78},{"$f":"20*B11/100","v":18.88},null,"__80   ",null,"Soleil maxi"]
[17,28,null,"__60   "]
[{"$f":"(A10/100)*(1+(2*A10/100))/2","v":5},{"$f":"(B10/100)*(1+(2*B10/100))/2","v":5},null,"__40   ",null,null,null,null,"22:00:00"]
[null,null,null,"_20 ",null,null,null,null,"00:00:00"]
[{"$f":"INDIRECT($A1&\"!$AG9\")","v":11.2},null,null,null,null,null,null,null,{"$f":"MAI_2022!$AX$9","v":"14:04:00"}]
[{"$f":"INDIRECT($A$1&\"!$AG9\")","v":11.2},null,null,{"$f":"MAI_2022!AG7","v":"2022-05-23"},null,null,null,null,{"$f":"I14-I16","v":"07:56:00"}]
[]
[]
[]
[null,null,null,{"$f":"NOW()","v":"2022-05-25T18:55:23.240"},null,null,{"$f":"MAI_2022!L7","v":"2022-05-05"},{"$f":"MAI_2022!P7","v":"2022-05-18"}]

{"sheet":"MOIS","index":3,"n_rows":59,"n_cols":7,"rows_kept":59,"cut":false,"hidden":false,"merged":[[47,2,47,4],[20,1,20,4],[43,4,43,5],[44,4,44,5]]}
[{"$f":"MAI_2022!C5","v":"Mai_2022"}]
[]
[null,"Jours de pluie + de 2mm",null,null,"Jours de soleil + de 4h"]
[]
[]
[]
[]
[]
[31,null,null,31,null,31]
[0,null,null,0,null,0]
[{"$f":"C51","v":1},null,null,{"$f":"C50","v":24},null,{"$f":"C58","v":{"$error":"#REF!"}}]
[{"$f":"A9-A10-A11","v":30},null,null,{"$f":"D9-D10-D11","v":7},null,{"$f":"F9-F10-F11","v":{"$error":"#REF!"}}]
[]
[]
[]
[]
[]
[]
[]
[]
[null,{"$f":"NOW()","v":"2022-05-25T18:55:23.240"}]
[]
[null,"Heures de pluie",null,null,"Heures de soleil"]
[]
[]
[]
[]
[]
[2.5,null,null,22.083333333333332]
["00:00:00",null,null,"00:00:00",null,22.083333333333332]
{"$rows_left_out":30}
{"sheet":"CONSOLE","index":4,"n_rows":33,"n_cols":11,"rows_kept":33,"cut":false,"hidden":false,"merged":[]}
[null,null,"Marées",null,"https://marine.meteoconsult.fr/meteo-marine/horaires-maree-la-tranche-sur-mer-1083-0.php"]
[]
["Lune",null,null,null,null,null,"Marée haute","02:14:00"]
["Dernier Croissant",null,null,null,"                       Températures                                   Lune                             Chaleur solaire = T°+2°                                                              Vitesse du vent",null,"Marée haute","14:58:00"]
[]
[null,null,null,null,null,null,"Coeff",54]
[null,null,null,null,null,null,null,57]
[]
[null,null,null,null,null,null,"Marée basse","07:44:00"]
[null,null,null,null,null,null,"Marée basse","20:16:00"]
[null,null,null,null,null,null,null,null,null,null," "]
[]
[null,null,null,null,null,null,"T° de l'eau",18]
[null,null,null,null,"       Température ressentie                                                                                                                                                          Vent en rafale :"]
["Conditions",null,null,null,"                                                                                Dernière mise à jour :                                                               Vent moyen :",null,"Heures Soleil","06:22:00"]
["Petite Pluie",null,null,null,"                                                                                                                                                                                  Pluie",null,null,"21:43:00"]
[null,null,null,null,"                                               Heures des marées                                                                            Statistiques                                                Journée                       Mois                        Année",null,"Total","15:14:00"]
["Ensoleillé"]
["Peux nuageux",null,null,null,null,null,"T° extérieure",{"$f":"INDEX(RELEVÉS!$B9:$B50000,COUNTA(RELEVÉS!$B9:$B50000))","v":15.5}]
["Nuageux",null,null,null,null,null,"T° ressentie",{"$f":"INDEX(RELEVÉS!$D9:$D50000,COUNTA(RELEVÉS!$D9:$D50000))","v":15.5}]
["Très nuageux"]
["Petite pluie",null,null,null,null,null,"Vent journée",{"$f":"RELEVÉS!Q5+5","v":18}]
["Grosse pluie",null,null,null,null,null,"Vent moyen",{"$f":"RELEVÉS!U5+5","v":9.4507246376811587}]
["Orageux",null,null,null,null,null,"Vent console",14.8]
["Brouillard",null,null,null,null,null,"Vent rafale",{"$f":"H24+10","v":24.8}]
["Neige"]
["Nuit dégagée"]
["Nuit Nuageuse"]
[]
[]
{"$rows_left_out":4}
{"sheet":"GRAPHIQUES","index":5,"n_rows":21,"n_cols":9,"rows_kept":21,"cut":false,"hidden":false,"merged":[]}
[null,null,"                            Dernière mise à jour le :",null,null,{"$f":"NOW()","v":"2022-05-25T18:55:23.240"}]
[null,null,"Température extérieure",null,null," ",null,null,"Température Mini et Maxi extérieure"]
[]
[]
[]
[null,null,"Précipitations",null,null,null,null,null,"Précipitations"]
[]
[]
[]
[null,null,"Vitesse du vent de la journée",null,null,null,null,null,"Vitesse du vent"]
[]
[]
[null,null,"Vitesse du vent"]
[]
[]
[null,null,null,null,null,null,null,null,"Nombre d'heures de soleil"]
[]
[]
[]
[]
[null,null,"Chaleur solaire"]

{"sheet":"Liste_shapes","index":6,"n_rows":70,"n_cols":6,"rows_kept":70,"cut":false,"hidden":false,"merged":[]}
[]
["HublotLune",13,78.75,317.25,128.25,129.75]
["hublot_Lune",13,78,157.5,128.25,127.5]
["Image 3",13,486,58.5,21,29.25]
["Image 15",13,33,131.25,34.5,39]
["Image 21",13,75.75,477.75,128.25,127.5]
["Image 24",13,90,794.25,103.5,105]
["Image 25",13,312,164.25,141.75,239.25]
["Image 26",13,312.75,423.75,141.75,236.25]
["Rectangle 131",1,312.00009155273437,768,141.73228454589844,52.440944671630859]
["Graphique 132",3,315.75,764.25,141.75,56.25]
["Rectangle 135",1,312.3748779296875,685.52301025390625,141.73228454589844,52.440944671630859]
["Graphique 136",3,313.5,683.25,141.75,54.75]
["Rectangle 137",1,312.00009155273437,847.5,141.73228454589844,52.440944671630859]
["Graphique 138",3,314.25,845.25,141.75,59.25]
["TextBox 143",17,297,685.5,15.75,51.02362060546875]
["TextBox 144",17,297.00009155273438,843,16.5,62.25]
["TextBox 146",17,297,766.5,15.75,53.858268737792969]
["Groupe 46",6,309.75,684,144,54]
["Groupe 179",6,311.25,767.25,144.75,54]
["Groupe 189",6,312,846.75,144.75,54.75]
["TextBox 47",17,97.5,200.99992370605469,18.75,62.362205505371094]
["TextBox 208",17,160.5,201.75,19.5,62.362205505371094]
["TextBox 12",17,123,168.75,33,101.25]
["TextBox 27",17,328.5,180.75,14.17322826385498,93]
["TextBox 164",17,343.50009155273437,180.75007629394531,14.17322826385498,93]
["TextBox 173",17,328.87496948242187,289.87661743164062,14.17322826385498,52.123386383056641]
["TextBox 174",17,342.75,283.49990844726562,14.92322826385498,57.75]
["TextBox 175",17,329.25,348.75,14.173307418823242,43.499919891357422]
["TextBox 176",17,344.25,356.62518310546875,14.17322826385498,31.874881744384766]
{"$rows_left_out":40}