{"text_format":"1","workbook":"xlsx","n_sheets":6,"sheets":["RELEVÉS","MAI_2022","MINI-MAXI","MOIS","CONSOLE","GRAPHIQUES"],"not_rendered":{"charts":23,"images":57,"macros":1,"external_links":0,"defined_names":2,"comments":1,"pivot_tables":0},"unopened":[],"bounds":{"document_bytes":16777216,"sheet_cells":100000,"rows_first":2000,"rows_last":500,"rows_between":2000,"halvings":0,"cell_chars":16384,"cell_head_chars":4096},"cells_cut":0,"cells_raw":0,"read":"whole","date_system":"1900"}

{"sheet":"RELEVÉS","index":0,"n_rows":1450,"n_cols":49,"rows_kept":1450,"cut":false,"hidden":false,"merged":[[1,27,1,35]]}
["08:48:00",null,null,null,null,null,null,null,null,null,"J",null,null,"N",null,null,"W",null,null,null,null,null,null,null,null,null,null,null,null,null,null,null,null,null,null,null,null,"AG",null,null,"AK",null,null,null,null,null,null,"AX","AX"]
[null,"Pression mini",null,null,"Pression maxi",null,null,"Température ressentie",null,null,"Température mini",null,null,"Température maxi",null,null,"Vent en Km/h",null,null,null,null,null,null,null,null,null,null,"Humidité H%",null,null,null,null,null,null,null,null,null,"Pluie",null,null,"Temps de pluie",null,null,null,null,null,null,"Sonde Soleil"]
[null,"mini",null,"heure","maxi",null,"heure","mini",null,"heure","mini",null,"heure","maxi",null,"heure","maxi",null,"Heure",null,"Moyenne",null,null,"Sens",null,"Sens",null,"Mini",null,"Heure",null,"Maxi",null,"Heure",null,"Moy","mm",null,"Heure",null,"AK",null,null,null,null,null,null,{"$f":"W1450/60/1440","v":0.47847222222222224}]
[null,null,null,null,null,null,null,null,null,null,null,null,null,null,null,null,null,null,null,null,null,null,null,null,null,null,null,null,null,null,null,null,null,null,null,null,null,null,null,null,"0 à 7h",null,"7 à 12h",null," 12 à 19h",null,"19h à 24h"]
[null,{"$f":"MIN(H9:H1448)","v":1007.8},null,{"$f":"VLOOKUP($B5,$H$9:$Q$1448,10,0)","v":"19:35:00"},{"$f":"MAX(H9:H1448)","v":1018.9},null,{"$f":"VLOOKUP($E5,$H$9:$Q$1448,10,0)","v":"01:07:00"},{"$f":"MAX($B$9:$B$1448)","v":29.8},null,{"$f":"VLOOKUP($H5,$D$9:$Q$1448,14,0)","v":"15:28:00"},{"$f":"MIN($B$9:$B$1448)","v":17.5},null,{"$f":"VLOOKUP($K5,$B$9:$Q$1448,16,0)","v":"07:29:00"},{"$f":"MAX(B9:B1448)","v":29.8},null,{"$f":"VLOOKUP($N5,$B$9:$Q$1448,16,0)","v":"16:33:00"},{"$f":"MAX(E9:F1448)","v":18.399999999999999},null,{"$f":"VLOOKUP($Q5,$F$9:$Q$1448,12,0)","v":"07:20:00"},null,null,null,null,null,null,"ONO",null,{"$f":"MIN(C9:C1448)","v":55},null,null,null,{"$f":"MAX(C9:C1448)","v":77},null,{"$f":"VLOOKUP($AF5,$C$9:$Q$1448,15,0)","v":"07:18:00"},null,{"$f":"AVERAGE(C9:C1448)","v":64.845704753961641},{"$f":"MAX($K$9:$K$1448)","v":0.3},null,{"$f":"(U1450/60)/1440","v":"00:58:00"},null,{"$f":"AO6+AQ6","v":"00:58:00"},null,null,null,{"$f":"AS6+AU6","v":"00:00:00"}]
[null,null,null,null,null,null,null,null,null,null,null,null,null,null,null,null,null,null,null,null,null,null,null,null,null,null,null,null,null,null,null,null,null,null,null,null,null,null,null,null,{"$f":"SUM(U9:U428)/60/1440","v":"00:00:00"},null,{"$f":"SUM(U429:U728)/60/1440","v":"00:58:00"},null,{"$f":"SUM(U729:U1148)/60/1440","v":"00:00:00"},null,{"$f":"SUM(U1148:U1448)/60/1440","v":"00:00:00"}]
[null,"5","6","8","9","10","11","13","14","15","16"]
[null,"T° Ext","H% Ext","Ressentie","Vent","Rafale","Sens","Pression","Lux","Pluie 1h","Jour","Semaine","Mois","Année","CH1","CH2","Heures","Date","Maxi","Graph","Pluie",null,"Soleil",null,null,"Soleil",null,null,null,null,null,null,null,null,null,null,"Fin",null,"Début"]
[null,22.7,58,22.7,7.2,9.4,23,1018.1,0,0,0,0,3.5,127,21.8,22,"00:00:00","20220522",null,null,null,null,null,null,null,"N",null,null,null,0,0]
[null,22.7,58,22.7,6.8,9.4,66,1018.3,0,0,0,0,3.5,127,21.8,22,"00:01:00",null,null,null,{"$f":"IF(J10>0,60,\"\")","v":""},null,null,null,null,"N",null,0,null,11,22]
[null,22.7,59,22.7,6.1,9.4,23,1018.3,0,0,0,0,3.5,127,21.8,22,"00:02:00",null,null,null,{"$f":"IF(J11>0,60,\"\")","v":""},null,null,null,null,"NNE",null,22.5,null,{"$f":"AB11+$AD$10","v":33.5},45,null,null,null,null,null,null,null,"Aide mémoire"]
[null,22.6,59,22.6,5.8,7.2,47,1018.1,0,0,0,0,3.5,127,21.7,21.9,"00:03:00",null,null,null,{"$f":"IF(J12>0,60,\"\")","v":""},null,null,null,null,"NE",null,45,null,56,67,null,null,null,null,null,"Pluie",null,"=SOMME(K9:K1448)"]
[null,22.6,59,22.6,6.1,9.4,26,1018.1,0,0,0,0,3.5,127,21.7,21.9,"00:04:00",null,null,null,"",null,null,null,null,"ENE",null,67.5,null,78.5,90]
[null,22.6,59,22.6,6.1,7.2,3,1018.2,0,0,0,0,3.5,127,21.7,21.9,"00:05:00",null,null,null,"",null,null,null,null,null,null,90,null,101,112,null,null,null,null,null,"Commentaires",null,null,null,"=SOMME(U9:U1448)"]
[null,22.6,59,22.6,4,5.4,39,1018.3,0,0,0,0,3.5,127,21.7,21.9,"00:06:00",null,null,null,"",null,null,null,null,"ESE",null,112.5,null,123.5,135]
[null,22.6,59,22.6,1.4,1.8,34,1018.3,0,0,0,0,3.5,127,21.7,21.9,"00:07:00",null,null,null,"",null,null,null,null,"SSE",null,135,null,146,157,null,null,null,null,null,"Soleil",null,"=SOMME(W9:W1448)"]
[null,22.5,59,22.5,2.2000000000000002,3.6,44,1018.2,0,0,0,0,3.5,127,21.6,21.8,"00:08:00",null,null,null,"",null,null,null,null,"SE",null,157.5,null,168.5,180,null,null,null,null,null,"Soleil",null,"=W1450/60/1440"]
[null,22.5,59,22.5,6.1,7.2,24,1018.2,0,0,0,0,3.5,127,21.6,21.8,"00:09:00",null,null,null,"",null,null,null,null,"S",null,180,null,191,202]
[null,22.4,59,22.4,4.7,5.4,27,1018.2,0,0,0,0,3.5,127,21.6,21.8,"00:10:00",null,null,null,"",null,null,null,null,"SSO",null,202.5,null,213.5,225]
[null,22.4,59,22.4,5.4,5.4,42,1018.2,0,0,0,0,3.5,127,21.6,21.7,"00:11:00",null,null,null,"",null,null,null,null,"SO",null,225,null,236,247]
[null,22.4,59,22.4,6.1,7.2,34,1018.2,0,0,0,0,3.5,127,21.6,21.7,"00:12:00",null,null,null,"",null,null,null,null,"OSO",null,247.5,null,258.5,270]
[null,22.4,59,22.4,6.8,9.4,32,1017.9,0,0,0,0,3.5,127,21.6,21.7,"00:13:00",null,null,null,"",null,null,null,null,"O",null,270,null,281,292]
[null,22.3,60,22.3,5.4,7.2,37,1018,0,0,0,0,3.5,127,21.5,21.7,"00:14:00",null,null,null,"",null,null,null,null,"ONO",null,292.5,null,303.5,315]
[null,22.3,60,22.3,2.9,3.6,20,1018,0,0,0,0,3.5,127,21.5,21.6,"00:15:00",null,null,null,"",null,null,null,null,"NO",null,315,null,326,337]
[null,22.3,60,22.3,3.6,7.2,36,1018.2,0,0,0,0,3.5,127,21.5,21.6,"00:16:00",null,null,null,"",null,null,null,null,"NNO",null,337.5,null,348.5,349]
[null,22.3,60,22.3,4.7,7.2,36,1018.2,0,0,0,0,3.5,127,21.5,21.6,"00:17:00",null,null,null,"",null,null,null,null,"N",null,349,null,360]
[null,22.3,60,22.3,2.2000000000000002,3.6,47,1018.1,0,0,0,0,3.5,127,21.5,21.6,"00:18:00",null,null,null,""]
[null,22.3,60,22.3,5.4,7.2,21,1018.1,0,0,0,0,3.5,127,21.4,21.6,"00:19:00",null,null,null,"",null,null,null,null,null,null,null,null,{"$f":"INDEX($Z$9:$Z$26,IF(ISNA(MATCH($AD$30,$AD$9:$AD$26,0)),MATCH($AD$30,$AD$9:$AD$26,1)+1,MATCH($AD$30,$AD$9:$AD$26,0)),1)","v":"NNE"}]
[null,22.3,60,22.3,4.3,5.4,33,1018.2,0,0,0,0,3.5,127,21.4,21.6,"00:20:00",null,null,null,"",null,null,null,null,null,null,{"$f":"SUM(AB32:AB47)","v":0.99999999999999989},null,{"$f":"MAX(AB32:AB47)","v":0.23636363636363636},null,{"$f":"SUM(AF32:AF47)","v":55}]
[null,22.3,60,22.3,3.2,3.6,59,1018.1,0,0,0,0,3.5,127,21.4,21.5,"00:21:00",null,null,null,"",null,null,null,null,null,null,null,null,{"$f":"VLOOKUP(AD29,AB32:AD47,AD31,0)","v":22}]
{"$rows_left_out":1421}
{"sheet":"MAI_2022","index":1,"n_rows":86,"n_cols":67,"rows_kept":86,"cut":false,"hidden":false,"merged":[[4,23,4,25],[6,46,6,47],[8,20,8,21],[6,2,6,3],[6,20,6,21],[8,2,8,3],[6,29,6,30],[4,9,4,15]]}
[null,null,null,null,null,null,null,null,null,null,null,null,null,null,null,null,null,null,null,null,null,null,null,null,null,null,null,null,null,null,null,null,null,null,null,null,null,null,null,null,null,null,null,null,null,null,null,null,null,null,null,null,null,"La Rochelle","http://www.meteociel.fr/climatologie/villes.php?code=7316&mois=4&annee=2022",null,null,null,null,null,null,null,null,null,null,"Ephéméride","http://www.ephemeride.com/calendrier/solaire/19/horaires-du-soleil.html"]
[]
[null,null,null,null,null,null,null,null,null,null,null,null,null,null,null,null,null,null,null,null,null,null,null,null,null,null,null,null,null,{"$f":"$C$5","v":"Mai_2022"},null,null,"Hauteur de pluie en mm",null,null,null,"Temps de précipitations par 1/4 de journée",null,null,null,null,null,null,null,null,null,{"$f":"$C$5","v":"Mai_2022"},null,null,"Chaleur solaire",null,null,null,"Marées","https://marine.meteoconsult.fr/meteo-marine/horaires-maree-la-tranche-sur-mer-1083-0.php"]
[]
[null,null,"Mai_2022",null,null,"Mise à jour",null,"le",null,{"$f":"NOW()","v":"2022-05-22T20:22:19.440"},null,null,null,null,null,null,null,null,null,null,{"$f":"C5","v":"Mai_2022"},null,null,{"$f":"NOW()","v":"2022-05-22T20:22:19.440"},null,null,null,null,null,"Mise à jour",null,null,{"$f":"SUM($AG$11:$AG$72)","v":3.5},null,{"$f":"SUM($AI$11:$AI$72)","v":0.18680555555555556},null,{"$f":"SUM(AK$11:AK$72)","v":0.1652777777777778},null,{"$f":"SUM(AM$11:AM$72)","v":2.1527777777777778E-2},null,{"$f":"SUM(AO$11:AO$72)","v":0},null,{"$f":"SUM(AQ$11:AQ$72)","v":0},null,null,null,"Mise à jour",null,null,{"$f":"SUM(AX$11:AX$72)","v":11.328472222222222},null,null,null,"T° de l'eau","https://fr.surf-forecast.com/breaks/La-Tranchesur-Mer/seatemp",null,null,null,null,null,null,null,null,null,null,"meteofloralies","https://www.wunderground.com/dashboard/pws/ILATRA6"]
[]
[null,null,"Températures",null,null,{"$f":"MIN(F11:F72)","v":18.2},null,{"$f":"VLOOKUP($F$7,$F$11:$V$72,17,0)","v":"2022-05-05"},null,{"$f":"MIN($J$11:$J$72)","v":8.6999999999999993},null,{"$f":"VLOOKUP($J$7,$J$11:$V$72,13,0)","v":"2022-05-05"},null,{"$f":"MAX(N11:N55)","v":29.8},null,{"$f":"VLOOKUP($N$7,$N$11:$V$72,9,0)","v":"2022-05-18"},null,null,null,null,"Mise à jour",null,null,"Maxi",null,null,null,null,null,{"$f":"TODAY()","v":"2022-05-22"},null,null,{"$f":"VLOOKUP($AG$9,$AG$11:$AV$72,16,0)","v":"2022-05-15"},null,{"$f":"VLOOKUP($AI$9,$AI$11:$AV$72,14,0)","v":"2022-05-15"},null,"Pluie AM",null,"Pluie AM",null,"Pluie AP",null,"Pluie AP",null,null,null,{"$f":"TODAY()","v":"2022-05-22"},null,null,{"$f":"VLOOKUP($AX$9,$AX$11:$BB$72,5,0)","v":"2022-05-17"}]
[]
[null,null,null,null,null,"Ressentie",null,{"$f":"VLOOKUP($F$7,$F$11:$P$72,3,0)","v":"17:03:00"},null,"Mini",null,{"$f":"VLOOKUP($J$7,$J$11:$L$72,3,0)","v":"06:41:00"},null,"Maxi",null,{"$f":"VLOOKUP($N$7,$N$11:$P$72,3,0)","v":"16:13:00"},null,null,null,null,"Vitesse du vent",null,null,{"$f":"MAX($X$11:$X$72)","v":40.299999999999997},null,{"$f":"VLOOKUP($X$9,$X$11:$AE$72,8,0)","v":"2022-05-05"},null,null,null,{"$f":"BB9+AG5","v":102.1},"Année",null,{"$f":"MAX($AG$11:$AG$72)","v":3},null,{"$f":"MAX($AI$11:AI$72)","v":0.13680555555555557},null,"de 0 à 6h59",null,"7h à 11h59",null,"12h à 18h59",null,"19h à 23h59",null,null,null,"Soleil de l'Année",{"$f":"BC9+AX5","v":27.728472222222223},null,{"$f":"MAX($AX$11:$AX$72)","v":0.58611111111111114},null,null,null,98.6,16.400000000000002,null,"Météofloralies","=SUBSTITUE(TEXTE(MAX(CNUM(SUBSTITUE($U$2;\".\";\",\"));CNUM(SUBSTITUE($V$2;\".\";\",\")));\"standard\");\",\";\".\")"]
[]
[null,null,{"$f":"PROPER(TEXT(D11,\"JJJJ\"))","v":"Dimanche"},"2022-05-01",null,19.5,null,0.65208333333333302,null,9.6999999999999993,null,0.28958333333333303,null,19.5,null,0.65208333333333302,null,null,null,null,{"$f":"$C11","v":"Dimanche"},{"$f":"$D11","v":"2022-05-01"},null,20.2,null,"19:20:00",null,null,null,{"$f":"$C11","v":"Dimanche"},{"$f":"$D11","v":"2022-05-01"},null,0,null,"00:00:00",null,"00:00:00",null,"00:00:00",null,"00:00:00",null,"00:00:00",null,null,null,{"$f":"$C11","v":"Dimanche"},{"$f":"$D11","v":"2022-05-01"},null,"10:15:00",null,null,3,{"$f":"D11","v":"2022-05-01"},{"$f":"$C11","v":"Dimanche"}]
[]
[null,null,{"$f":"PROPER(TEXT(D13,\"JJJJ\"))","v":"Lundi"},{"$f":"$D11+1","v":"2022-05-02"},null,20.399999999999999,null,0.71458333333333302,null,10.1,null,0.30069444444444399,null,20.399999999999999,null,0.71458333333333302,null,null,null,null,{"$f":"$C13","v":"Lundi"},{"$f":"$D13","v":"2022-05-02"},null,29.5,null,"13:58:00",null,null,null,{"$f":"$C13","v":"Lundi"},{"$f":"$D13","v":"2022-05-02"},null,0,null,"00:00:00",null,"00:00:00",null,"00:00:00",null,"00:00:00",null,"00:00:00",null,null,null,{"$f":"$C13","v":"Lundi"},{"$f":"$D13","v":"2022-05-02"},null,"12:19:00",null,null,4,{"$f":"D13","v":"2022-05-02"},{"$f":"$C13","v":"Lundi"}]
[]
[null,null,{"$f":"PROPER(TEXT(D15,\"JJJJ\"))","v":"Mardi"},{"$f":"$D13+1","v":"2022-05-03"},null,21.5,null,0.70347222222222205,null,9.4,null,0.297916666666667,null,21.5,null,0.70347222222222205,null,null,null,null,{"$f":"$C15","v":"Mardi"},{"$f":"$D15","v":"2022-05-03"},null,25.6,null,"13:39:00",null,null,null,{"$f":"$C15","v":"Mardi"},{"$f":"$D15","v":"2022-05-03"},null,0,null,"00:00:00",null,"00:00:00",null,"00:00:00",null,"00:00:00",null,"00:00:00",null,null,null,{"$f":"$C15","v":"Mardi"},{"$f":"$D15","v":"2022-05-03"},null,"12:58:00",null,null,5,{"$f":"D15","v":"2022-05-03"},{"$f":"$C15","v":"Mardi"}]
[]
[null,null,{"$f":"PROPER(TEXT(D17,\"JJJJ\"))","v":"Mercredi"},{"$f":"$D15+1","v":"2022-05-04"},null,18.600000000000001,null,0.66666666666666696,null,9.5,null,0.25694444444444398,null,18.600000000000001,null,0.66666666666666696,null,null,null,null,{"$f":"$C17","v":"Mercredi"},{"$f":"$D17","v":"2022-05-04"},null,27.7,null,"16:02:00",null,null,null,{"$f":"$C17","v":"Mercredi"},{"$f":"$D17","v":"2022-05-04"},null,0,null,"00:00:00",null,"00:00:00",null,"00:00:00",null,"00:00:00",null,"00:00:00",null,null,null,{"$f":"$C17","v":"Mercredi"},{"$f":"$D17","v":"2022-05-04"},null,"11:19:00",null,null,6,{"$f":"D17","v":"2022-05-04"},{"$f":"$C17","v":"Mercredi"}]
[]
[null,null,{"$f":"PROPER(TEXT(D19,\"JJJJ\"))","v":"Jeudi"},{"$f":"$D17+1","v":"2022-05-05"},null,18.2,null,0.71041666666666703,null,8.6999999999999993,null,0.27847222222222201,null,18.2,null,0.71041666666666703,null,null,null,null,{"$f":"$C19","v":"Jeudi"},{"$f":"$D19","v":"2022-05-05"},null,40.299999999999997,null,"00:08:00",null,null,null,{"$f":"$C19","v":"Jeudi"},{"$f":"$D19","v":"2022-05-05"},null,0,null,"00:00:00",null,"00:00:00",null,"00:00:00",null,"00:00:00",null,"00:00:00",null,null,null,{"$f":"$C19","v":"Jeudi"},{"$f":"$D19","v":"2022-05-05"},null,"12:48:00",null,null,7,{"$f":"D19","v":"2022-05-05"},{"$f":"$C19","v":"Jeudi"}]
[]
[null,null,{"$f":"PROPER(TEXT(D21,\"JJJJ\"))","v":"Vendredi"},{"$f":"$D19+1","v":"2022-05-06"},null,22.1,null,0.73541666666666705,null,9.1999999999999993,null,0.28402777777777799,null,22.1,null,0.73541666666666705,null,null,null,null,{"$f":"$C21","v":"Vendredi"},{"$f":"$D21","v":"2022-05-06"},null,27.7,null,"13:06:00",null,null,null,{"$f":"$C21","v":"Vendredi"},{"$f":"$D21","v":"2022-05-06"},null,0,null,"00:00:00",null,"00:00:00",null,"00:00:00",null,"00:00:00",null,"00:00:00",null,null,null,{"$f":"$C21","v":"Vendredi"},{"$f":"$D21","v":"2022-05-06"},null,"12:52:00",null,null,8,{"$f":"D21","v":"2022-05-06"},{"$f":"$C21","v":"Vendredi"}]
[]
[null,null,{"$f":"PROPER(TEXT(D23,\"JJJJ\"))","v":"Samedi"},{"$f":"$D21+1","v":"2022-05-07"},null,20.5,null,0.52777777777777801,null,13.9,null,0.389583333333333,null,20.5,null,0.52777777777777801,null,null,null,null,{"$f":"$C23","v":"Samedi"},{"$f":"$D23","v":"2022-05-07"},null,26.5,null,"15:40:00",null,null,null,{"$f":"$C23","v":"Samedi"},{"$f":"$D23","v":"2022-05-07"},null,0,null,"00:00:00",null,"00:00:00",null,"00:00:00",null,"00:00:00",null,"00:00:00",null,null,null,{"$f":"$C23","v":"Samedi"},{"$f":"$D23","v":"2022-05-07"},null,"12:54:00",null,null,9,{"$f":"D23","v":"2022-05-07"},{"$f":"$C23","v":"Samedi"}]
[]
[null,null,{"$f":"PROPER(TEXT(D25,\"JJJJ\"))","v":"Dimanche"},{"$f":"$D23+1","v":"2022-05-08"},null,23.2,null,0.63333333333333297,null,11.2,null,0.28819444444444398,null,23.2,null,0.63333333333333297,null,null,null,null,{"$f":"$C25","v":"Dimanche"},{"$f":"$D25","v":"2022-05-08"},null,20.2,null,"17:12:00",null,null,null,{"$f":"$C25","v":"Dimanche"},{"$f":"$D25","v":"2022-05-08"},null,0,null,"00:00:00",null,"00:00:00",null,"00:00:00",null,"00:00:00",null,"00:00:00",null,null,null,{"$f":"$C25","v":"Dimanche"},{"$f":"$D25","v":"2022-05-08"},null,"13:08:00",null,null,10,{"$f":"D25","v":"2022-05-08"},{"$f":"$C25","v":"Dimanche"}]
[]
[null,null,{"$f":"PROPER(TEXT(D27,\"JJJJ\"))","v":"Lundi"},{"$f":"$D25+1","v":"2022-05-09"},null,26,null,0.66527777777777797,null,12.2,null,0.28402777777777799,null,26,null,0.66527777777777797,null,null,null,null,{"$f":"$C27","v":"Lundi"},{"$f":"$D27","v":"2022-05-09"},null,22,null,"16:38:00",null,null,null,{"$f":"$C27","v":"Lundi"},{"$f":"$D27","v":"2022-05-09"},null,0,null,"00:00:00",null,"00:00:00",null,"00:00:00",null,"00:00:00",null,"00:00:00",null,null,null,{"$f":"$C27","v":"Lundi"},{"$f":"$D27","v":"2022-05-09"},null,"13:22:00",null,null,11,{"$f":"D27","v":"2022-05-09"},{"$f":"$C27","v":"Lundi"}]
[]
[null,null,{"$f":"PROPER(TEXT(D29,\"JJJJ\"))","v":"Mardi"},{"$f":"$D27+1","v":"2022-05-10"},null,25,null,0.68888888888888899,null,14.3,null,0.29375000000000001,null,25,null,0.68888888888888899,null,null,null,null,{"$f":"$C29","v":"Mardi"},{"$f":"$D29","v":"2022-05-10"},null,18.399999999999999,null,"19:47:00",null,null,null,{"$f":"$C29","v":"Mardi"},{"$f":"$D29","v":"2022-05-10"},null,0,null,"00:00:00",null,"00:00:00",null,"00:00:00",null,"00:00:00",null,"00:00:00",null,null,null,{"$f":"$C29","v":"Mardi"},{"$f":"$D29","v":"2022-05-10"},null,"13:24:00",null,null,12,{"$f":"D29","v":"2022-05-10"},{"$f":"$C29","v":"Mardi"}]
[]
{"$rows_left_out":57}
{"sheet":"MINI-MAXI","index":2,"n_rows":21,"n_cols":9,"rows_kept":21,"cut":false,"hidden":false,"merged":[[15,0,15,1],[16,0,16,1],[5,10,5,11],[1,5,1,7],[20,3,20,5]]}
[{"$f":"MAI_2022!C5","v":"Mai_2022"}]
[null,null,null,null,null,null,null,null,"1900-05-24"]
[null,null,null,"Pluie Maxi Jour et total mois",null,null,"Températures Mini et Maxi",null,{"$f":"I1-940","v":-940}]
[null,null,null,null,null,"Vent maxi",null,null,3]
[null,null,null,null,null,null,null,null,{"$f":"I2-I3-I4","v":1082}]
["Jour","Mois",null,"__200    "]
[null,null,null,"__180    ",{"$f":"INDIRECT($A$1&\"!$W9\")","v":"00:00:00"},null,null,null,{"$f":"MAI_2022!J7","v":8.6999999999999993}]
[null,null,null,"__160    ",132,null,null,null,145]
[{"$f":"INDIRECT($A$1&\"!$AG5\")","v":3.5},{"$f":"INDIRECT($A$1&\"!$AG9\")","v":3},null,"__140    ",{"$f":"INDIRECT($A$1&\"!$X$9\")","v":40.299999999999997},null,null,null,{"$f":"I7-940","v":-931.3}]
[200,200,null,"__120    ",2,null,null,null,3]
[{"$f":"100*(1-(A9/A10))","v":98.25},{"$f":"100*(1-(B9/B10))","v":98.5},null,"__100    ",{"$f":"E8-E9-E10","v":89.7},null,null,null,{"$f":"I8-I9-I10","v":1073.3}]
[{"$f":"20*A11/100","v":19.649999999999999},{"$f":"20*B11/100","v":19.7},null,"__80   ",null,"Soleil maxi"]
[17,28,null,"__60   "]
[{"$f":"(A10/100)*(1+(2*A10/100))/2","v":5},{"$f":"(B10/100)*(1+(2*B10/100))/2","v":5},null,"__40   ",null,null,null,null,"22:00:00"]
[null,null,null,"_20 ",null,null,null,null,"00:00:00"]
[{"$f":"INDIRECT($A1&\"!$AG9\")","v":3},null,null,null,null,null,null,null,{"$f":"MAI_2022!$AX$9","v":"14:04:00"}]
[{"$f":"INDIRECT($A$1&\"!$AG9\")","v":3},null,null,{"$f":"MAI_2022!AG7","v":"2022-05-15"},null,null,null,null,{"$f":"I14-I16","v":"07:56:00"}]
[]
[]
[]
[null,null,null,{"$f":"NOW()","v":"2022-05-22T20:22:19.430"},null,null,{"$f":"MAI_2022!L7","v":"2022-05-05"},{"$f":"MAI_2022!P7","v":"2022-05-18"}]

{"sheet":"MOIS","index":3,"n_rows":59,"n_cols":7,"rows_kept":59,"cut":false,"hidden":false,"merged":[[47,2,47,4],[20,1,20,4],[43,4,43,5],[44,4,44,5]]}
[{"$f":"MAI_2022!C5","v":"Mai_2022"}]
[]
[null,"Jours de pluie + de 2mm",null,null,"Jours de soleil + de 4h"]
[]
[]
[]
[]
[]
[31,null,null,31,null,31]
[0,null,null,0,null,0]
[{"$f":"C51","v":0},null,null,{"$f":"C50","v":21},null,{"$f":"C58","v":{"$error":"#REF!"}}]
[{"$f":"A9-A10-A11","v":31},null,null,{"$f":"D9-D10-D11","v":10},null,{"$f":"F9-F10-F11","v":{"$error":"#REF!"}}]
[]
[]
[]
[]
[]
[]
[]
[]
[null,{"$f":"NOW()","v":"2022-05-22T20:22:19.440"}]
[]
[null,"Heures de pluie",null,null,"Heures de soleil"]
[]
[]
[]
[]
[]
[2.5,null,null,22.083333333333332]
["00:00:00",null,null,"00:00:00",null,22.083333333333332]
{"$rows_left_out":30}
{"sheet":"CONSOLE","index":4,"n_rows":34,"n_cols":11,"rows_kept":34,"cut":false,"hidden":false,"merged":[[15,0,15,1]]}
[null,null,"Marées",null,"https://marine.meteoconsult.fr/meteo-marine/horaires-maree-la-tranche-sur-mer-1083-0.php"]
[]
[null,null,null,null,null,null,"Marée haute","11;46"]
[null,null,null,null,"                       Températures                                   Lune                             Chaleur solaire = T°+2°                   Conditions                         Vitesse du vent",null,"Marée haute","*****"]
[]
[null,null,null,null,null,null,"Coeff",57]
[null,null,null,null,null,null,null,"*****"]
[]
[null,null,null,null,null,null,"Marée basse","4;16"]
[null,null,null,null,null,null,"Marée basse","16;48"]
[null,null,null,null,null,null,null,null,null,null," "]
[]
[null,null,null,null,null,null,"T° de l'eau",17.5]
[null,null,null,null,"       Température ressentie                                                                                                                                                          Vent en rafale :"]
["Liste",null,null,null,"                                                                                Dernière mise à jour :                                                               Vent moyen :",null,"Heures Soleil","06:25:00"]
["Orageux",null,null,null,"                                                                                                                                                                                  Pluie",null,null,"21:39:00"]
[null,null,null,null,"                                               Heures des marées                                                                            Statistiques                                                Journée                       Mois                        Année",null,"Total","15:14:00"]
["Ensoleillé"]
["Peux nuageux",null,null,null,null,null,"T° extérieure",{"$f":"INDEX(RELEVÉS!$B9:$B50000,COUNTA(RELEVÉS!$B9:$B50000))","v":27.2}]
["Nuageux",null,null,null,null,null,"T° ressentie",{"$f":"INDEX(RELEVÉS!$D9:$D50000,COUNTA(RELEVÉS!$D9:$D50000))","v":28.6}]
["Très nuageux"]
["Petite pluie",null,null,null,null,null,"Vent journée",{"$f":"RELEVÉS!Q5+5","v":23.4}]
["Grosse pluie",null,null,null,null,null,"Vent moyen",{"$f":"RELEVÉS!U5+5","v":5}]
["Orageux",null,null,null,null,null,"Vent console",22]
["Brouillard",null,null,null,null,null,"Vent rafale",{"$f":"H24+10","v":32}]
["Neige"]
["Nuit dégagée"]
["Nuit Nuageuse"]
[]
[]
{"$rows_left_out":5}
{"sheet":"GRAPHIQUES","index":5,"n_rows":21,"n_cols":9,"rows_kept":21,"cut":false,"hidden":false,"merged":[]}
[null,null,"                            Dernière mise à jour le :",null,null,{"$f":"NOW()","v":"2022-05-22T20:22:19.430"}]
[null,null,"Température extérieure",null,null," ",null,null,"Température Mini et Maxi extérieure"]
[]
[]
[]
[null,null,"Précipitations",null,null,null,null,null,"Précipitations"]
[]
[]
[]
[null,null,"Vitesse du vent de la journée",null,null,null,null,null,"Vitesse du vent"]
[]
[]
[null,null,"Vitesse du vent"]
[]
[]
[null,null,null,null,null,null,null,null,"Nombre d'heures de soleil"]
[]
[]
[]
[]
[null,null,"Chaleur solaire"]