{"text_format":"1","workbook":"xlsx","n_sheets":6,"sheets":["RELEVÉS","AVRIL_2022","MINI-MAXI","MOIS","CONSOLE","GRAPHIQUES"],"not_rendered":{"charts":23,"images":57,"macros":1,"external_links":0,"defined_names":2,"comments":0,"pivot_tables":0},"unopened":[],"bounds":{"document_bytes":16777216,"sheet_cells":100000,"rows_first":2000,"rows_last":500,"rows_between":2000,"halvings":0,"cell_chars":16384,"cell_head_chars":4096},"cells_cut":0,"cells_raw":0,"read":"whole","date_system":"1900"}

{"sheet":"RELEVÉS","index":0,"n_rows":1450,"n_cols":49,"rows_kept":1450,"cut":false,"hidden":false,"merged":[[1,27,1,35]]}
["08:48:00",null,null,null,null,null,null,null,null,null,"J",null,null,"N",null,null,"W",null,null,null,null,null,null,null,null,null,null,null,null,null,null,null,null,null,null,null,null,"AG",null,null,"AK",null,null,null,null,null,null,"AX","AX"]
[null,"Pression mini",null,null,"Pression maxi",null,null,"Température ressentie",null,null,"Température mini",null,null,"Température maxi",null,null,"Vent en Km/h",null,null,null,null,null,null,null,null,null,null,"Humidité H%",null,null,null,null,null,null,null,null,null,"Pluie",null,null,"Temps de pluie",null,null,null,null,null,null,"Sonde Soleil"]
[null,"mini",null,"heure","maxi",null,"heure","mini",null,"heure","maxi",null,"heure","maxi",null,"heure","maxi",null,"Heure",null,"Moyenne",null,null,"Sens",null,"Sens",null,"Mini",null,"Heure",null,"Maxi",null,"Heure",null,"Moy","mm",null,"Heure",null,"AK",null,null,null,null,null,null,{"$f":"W1450/60/1440","v":0.32777777777777778}]
[null,null,null,null,null,null,null,null,null,null,null,null,null,null,null,null,null,null,null,null,null,null,null,null,null,null,null,null,null,null,null,null,null,null,null,null,null,null,null,null,"0 à 7h",null,"7 à 12h",null," 12 à 19h",null,"19h à 24h"]
[null,{"$f":"MIN(H9:H1448)","v":1021.9},null,{"$f":"VLOOKUP($B5,$H$9:$Q$1448,10,0)","v":"00:01:00"},{"$f":"MAX(H9:H1448)","v":1025.5999999999999},null,{"$f":"VLOOKUP($E5,$H$9:$Q$1448,10,0)","v":"11:29:00"},{"$f":"MIN($D$9:$D$1448)","v":-2.1},null,{"$f":"VLOOKUP($H5,$D$9:$Q$1448,14,0)","v":"07:55:00"},{"$f":"MIN($B$9:$B$1448)","v":0.9},null,{"$f":"VLOOKUP($K5,$B$9:$Q$1448,16,0)","v":"07:49:00"},{"$f":"MAX(B9:B1448)","v":10},null,{"$f":"VLOOKUP($N5,$B$9:$Q$1448,16,0)","v":"15:25:00"},{"$f":"MAX($E$9:$F$1448)","v":23.8},null,{"$f":"VLOOKUP($Q5,$F$9:$Q$1448,12,0)","v":"11:56:00"},null,{"$f":"AVERAGE(E9:E1448)","v":6.6736680327868756},null,null,null,null,"ONO",null,{"$f":"MIN(C9:C1448)","v":40},null,{"$f":"VLOOKUP($AB5,$C$9:$Q$1448,14,0)","v":16.2},null,{"$f":"MAX(C9:C1448)","v":83},null,{"$f":"VLOOKUP($AF5,$C$9:$Q$1448,15,0)","v":"07:29:00"},null,{"$f":"AVERAGE(C9:C1448)","v":69.820696721311478},{"$f":"K1450","v":0},null,{"$f":"(U1450/60)/1440","v":"00:00:00"},null,{"$f":"AO6+AQ6","v":"00:00:00"},null,null,null,{"$f":"AS6+AU6","v":"00:00:00"}]
[null,null,null,null,null,null,null,null,null,null,null,null,null,null,null,null,null,null,null,null,null,null,null,null,null,null,null,null,null,null,null,null,null,null,null,null,null,null,null,null,{"$f":"SUM(U9:U428)/60/1440","v":"00:00:00"},null,{"$f":"SUM(U429:U728)/60/1440","v":"00:00:00"},null,{"$f":"SUM(U729:U1148)/60/1440","v":"00:00:00"},null,{"$f":"SUM(U1148:U1448)/60/1440","v":"00:00:00"}]
[null,"5","6","8","9","10","11","13","14","15","16"]
[null,"T° Ext","H% Ext","Ressentie","Vent","Rafale","Sens","Pression","Lux","Pluie 1h","Jour","Semaine","Mois","Année","CH1","CH2","Heures","Date","Maxi","Graph","Pluie",null,"Soleil",null,null,null,null,null,null,null,null,null,null,null,null,null,"Fin",null,"Début",null,null,null,"Soleil"]
[null,2.8,82,0.7,7.6,9.4,329,1022.4,0,0,0,1.8,0,98.6,1.3,1.7,"00:00:00","20220402",null,null,null,null,null,null,null,"N",null,null,null,0,0]
[null,2.8,82,0.1,9.6999999999999993,14.8,278,1021.9,0,0,0,1.8,0,98.6,1.3,1.7,"00:01:00",null,null,null,{"$f":"IF(J10>0,60,\"\")","v":""},null,null,null,null,"N",null,0,null,11,22]
[null,2.8,82,1.2,6.1,7.2,348,1022.3,0,0,0,1.8,0,98.6,1.3,1.7,"00:02:00",null,null,null,{"$f":"IF(J11>0,60,\"\")","v":""},null,null,null,null,"NNE",null,22.5,null,{"$f":"AB11+$AD$10","v":33.5},45,null,null,null,null,null,null,null,"Aide mémoire"]
[null,2.8,82,0.2,9.4,11.2,330,1022.2,0,0,0,1.8,0,98.6,1.3,1.7,"00:03:00",null,null,null,{"$f":"IF(J12>0,60,\"\")","v":""},null,null,null,null,"NE",null,45,null,56,67,null,null,null,null,null,"Pluie",null,"=SOMME(K9:K1448)"]
[null,2.8,82,-0.6,13.3,16.600000000000001,272,1022.1,0,0,0,1.8,0,98.6,1.3,1.7,"00:04:00",null,null,null,"",null,null,null,null,"ENE",null,67.5,null,78.5,90,null,null,null,null,null,"Pluie",null,"=K1450"]
[null,2.8,82,2.8,4.7,5.4,265,1022.3,0,0,0,1.8,0,98.6,1.3,1.7,"00:05:00",null,null,null,"",null,null,null,null,null,null,90,null,101,112,null,null,null,null,null,"Commentaires",null,null,null,"=SOMME(U9:U1448)"]
[null,2.8,82,0.8,7.2,11.2,276,1022.3,0,0,0,1.8,0,98.6,1.2,1.7,"00:06:00",null,null,null,"",null,null,null,null,"ESE",null,112.5,null,123.5,135,null,null,null,null,null,"Soleil",null,"=SOMME(W9:W1448)"]
[null,2.7,82,-0.4,11.2,14.8,310,1022.1,0,0,0,1.8,0,98.6,1.2,1.7,"00:07:00",null,null,null,"",null,null,null,null,"SSE",null,135,null,146,157,null,null,null,null,null,"Soleil",null,"=W1450/60/1440"]
[null,2.7,82,0.4,7.9,11.2,306,1022.1,0,0,0,1.8,0,98.6,1.2,1.7,"00:08:00",null,null,null,"",null,null,null,null,"SE",null,157.5,null,168.5,180]
[null,2.7,82,0,9.6999999999999993,13,293,1022.2,0,0,0,1.8,0,98.6,1.2,1.7,"00:09:00",null,null,null,"",null,null,null,null,"S",null,180,null,191,202]
[null,2.7,82,-0.5,11.9,16.600000000000001,287,1022.4,0,0,0,1.8,0,98.6,1.2,1.7,"00:10:00",null,null,null,"",null,null,null,null,"SSO",null,202.5,null,213.5,225]
[null,2.7,82,-0.3,10.8,14.8,308,1022.1,0,0,0,1.8,0,98.6,1.2,1.7,"00:11:00",null,null,null,"",null,null,null,null,"SO",null,225,null,236,247]
[null,2.7,82,-1.3,16.600000000000001,22,267,1022.3,0,0,0,1.8,0,98.6,1.2,1.7,"00:12:00",null,null,null,"",null,null,null,null,"OSO",null,247.5,null,258.5,270]
[null,2.7,81,-0.4,11.5,16.600000000000001,287,1022.2,0,0,0,1.8,0,98.6,1.2,1.7,"00:13:00",null,null,null,"",null,null,null,null,"O",null,270,null,281,292]
[null,2.7,81,-1.3,16.600000000000001,20.2,299,1022.1,0,0,0,1.8,0,98.6,1.2,1.7,"00:14:00",null,null,null,"",null,null,null,null,"ONO",null,292.5,null,303.5,315]
[null,2.8,81,-0.2,10.8,18.399999999999999,304,1022.3,0,0,0,1.8,0,98.6,1.2,1.7,"00:15:00",null,null,null,"",null,null,null,null,"NO",null,315,null,326,337]
[null,2.8,80,0.1,9.6999999999999993,16.600000000000001,281,1022.3,0,0,0,1.8,0,98.6,1.2,1.8,"00:16:00",null,null,null,"",null,null,null,null,"NNO",null,337.5,null,348.5,349]
[null,2.8,80,0.5,8.3000000000000007,14.8,298,1022.3,0,0,0,1.8,0,98.6,1.2,1.8,"00:17:00",null,null,null,"",null,null,null,null,"N",null,349,null,360]
[null,2.8,80,-0.3,11.5,16.600000000000001,285,1022.1,0,0,0,1.8,0,98.6,1.2,1.8,"00:18:00",null,null,null,""]
[null,2.8,80,-0.5,12.2,16.600000000000001,308,1022.3,0,0,0,1.8,0,98.6,1.2,1.8,"00:19:00",null,null,null,"",null,null,null,null,null,null,null,null,{"$f":"INDEX($Z$9:$Z$26,IF(ISNA(MATCH($AD$30,$AD$9:$AD$26,0)),MATCH($AD$30,$AD$9:$AD$26,1)+1,MATCH($AD$30,$AD$9:$AD$26,0)),1)","v":"NNO"}]
[null,2.8,80,-0.6,13.3,20.2,279,1022.3,0,0,0,1.8,0,98.6,1.2,1.8,"00:20:00",null,null,null,"",null,null,null,null,null,null,{"$f":"SUM(AB32:AB47)","v":1},null,{"$f":"MAX(AB32:AB47)","v":0.21428571428571427},null,{"$f":"SUM(AF32:AF47)","v":42}]
[null,2.8,80,-0.5,12.2,16.600000000000001,294,1022.4,0,0,0,1.8,0,98.6,1.2,1.8,"00:21:00",null,null,null,"",null,null,null,null,null,null,null,null,{"$f":"VLOOKUP(AD29,AB32:AD47,AD31,0)","v":337}]
{"$rows_left_out":1421}
{"sheet":"AVRIL_2022","index":1,"n_rows":84,"n_cols":67,"rows_kept":84,"cut":false,"hidden":false,"merged":[[4,23,4,25],[6,46,6,47],[8,20,8,21],[6,2,6,3],[6,20,6,21],[8,2,8,3],[6,29,6,30],[4,9,4,15]]}
[null,null,null,null,null,null,null,null,null,null,null,null,null,null,null,null,null,null,null,null,null,null,null,null,null,null,null,null,null,null,null,null,null,null,null,null,null,null,null,null,null,null,null,null,null,null,null,null,null,null,null,null,null,"La Rochelle","http://www.meteociel.fr/climatologie/villes.php?code=7316&mois=4&annee=2022",null,null,null,null,null,null,null,null,null,null,"Ephéméride","http://www.ephemeride.com/calendrier/solaire/19/horaires-du-soleil.html"]
[]
[null,null,null,null,null,null,null,null,null,null,null,null,null,null,null,null,null,null,null,null,null,null,null,null,null,null,null,null,null,{"$f":"$C$5","v":"Avril_2022"},null,null,"Hauteur de pluie en mm",null,null,null,"Temps de précipitations par 1/4 de journée",null,null,null,null,null,null,null,null,null,{"$f":"$C$5","v":"Avril_2022"},null,null,"Chaleur solaire",null,null,null,"Marées","https://marine.meteoconsult.fr/meteo-marine/horaires-maree-la-tranche-sur-mer-1083-0.php"]
[]
[null,null,"Avril_2022",null,null,"Mise à jour",null,"le",null,{"$f":"NOW()","v":"2022-04-02T16:44:37.840"},null,null,null,null,null,null,null,null,null,null,{"$f":"C5","v":"Avril_2022"},null,null,{"$f":"NOW()","v":"2022-04-02T16:44:37.840"},null,null,null,null,null,"Mise à jour",null,null,{"$f":"SUM($AG$11:$AG$59)","v":0},null,{"$f":"SUM($AI$11:$AI$71)","v":0},null,{"$f":"SUM(AK$11:AK$71)","v":0},null,{"$f":"SUM(AM$11:AM$71)","v":0},null,{"$f":"SUM(AO$11:AO$71)","v":0},null,{"$f":"SUM(AQ$11:AQ$71)","v":0},null,null,null,"Mise à jour",null,null,{"$f":"SUM(AX$11:AX$59)","v":0.48749999999999999},null,null,null,"T° de l'eau","https://fr.surf-forecast.com/breaks/La-Tranchesur-Mer/seatemp",null,null,null,null,null,null,null,null,null,null,"meteofloralies","https://www.wunderground.com/dashboard/pws/ILATRA6"]
[]
[null,null,"Températures",null,null,{"$f":"MIN(F11:F59)","v":-2.1},null,{"$f":"VLOOKUP($F$7,$F$11:$V$71,17,0)","v":"2022-04-01"},null,{"$f":"MIN($J$11:$J$71)","v":1.8},null,{"$f":"VLOOKUP($J$7,$J$11:$V$71,13,0)","v":"2022-04-01"},null,{"$f":"MAX(N11:N59)","v":10},null,{"$f":"VLOOKUP($N$7,$N$11:$V$71,9,0)","v":"2022-04-01"},null,null,null,null,"Mise à jour",null,null,"Maxi",null,null,null,null,null,{"$f":"TODAY()","v":"2022-04-02"},null,null,{"$f":"VLOOKUP($AG$9,$AG$11:$AV$71,16,0)","v":"2022-04-01"},null,{"$f":"VLOOKUP($AI$9,$AI$11:$AV$71,14,0)","v":"2022-04-01"},null,"Pluie AM",null,"Pluie AM",null,"Pluie AP",null,"Pluie AP",null,null,null,{"$f":"TODAY()","v":"2022-04-02"},null,null,{"$f":"VLOOKUP($AX$9,$AX$11:$BB$71,5,0)","v":"2022-04-01"}]
[]
[null,null,null,null,null,"Ressentie",null,{"$f":"VLOOKUP($F$7,$H$11:$P$71,3,0)","v":{"$error":"#N/A"}},null,"Mini",null,{"$f":"VLOOKUP($J$7,$J$11:$L$71,3,0)","v":"04:34:00"},null,"Maxi",null,{"$f":"VLOOKUP($N$7,$N$11:$P$71,3,0)","v":"16:06:00"},null,null,null,null,"Vitesse du vent",null,null,{"$f":"MAX($X$11:$X$71)","v":42.1},null,{"$f":"VLOOKUP($X$9,$X$11:$AE$71,8,0)","v":"2022-04-01"},null,null,null,{"$f":"BB9+AG5","v":98.6},"Année",null,{"$f":"MAX($AG$11:$AG$59)","v":0},null,{"$f":"MAX($AI$11:AI$71)","v":0},null,"de 0 à 6h59",null,"7h à 11h59",null,"12h à 18h59",null,"19h à 23h59",null,null,null,"Soleil de l'Année",{"$f":"BC9+AX5","v":16.887500000000003},null,{"$f":"MAX($AX$11:$AX$71)","v":0.48749999999999999},null,null,null,98.6,16.400000000000002]
[]
[null,null,{"$f":"PROPER(TEXT(D11,\"JJJJ\"))","v":"Vendredi"},"2022-04-01",null,-2.1,null,0.218055555555556,null,1.8,null,0.19027777777777799,null,10,null,0.67083333333333295,null,null,null,null,{"$f":"$C11","v":"Vendredi"},{"$f":"$D11","v":"2022-04-01"},null,42.1,null,"19:41:00",null,null,null,{"$f":"$C11","v":"Vendredi"},{"$f":"$D11","v":"2022-04-01"},null,0,null,"00:00:00",null,"00:00:00",null,"00:00:00",null,"00:00:00",null,"00:00:00",null,null,null,{"$f":"$C11","v":"Vendredi"},{"$f":"$D11","v":"2022-04-01"},null,"11:42:00",null,null,1,{"$f":"D11","v":"2022-04-01"},{"$f":"$C11","v":"Vendredi"}]
[]
[null,null,{"$f":"PROPER(TEXT(D13,\"JJJJ\"))","v":"Samedi"},{"$f":"$D11+1","v":"2022-04-02"},null,null,null,null,null,null,null,null,null,null,null,null,null,null,null,null,{"$f":"$C13","v":"Samedi"},{"$f":"$D13","v":"2022-04-02"},null,null,null,null,null,null,null,{"$f":"$C13","v":"Samedi"},{"$f":"$D13","v":"2022-04-02"},null,null,null,null,null,null,null,null,null,null,null,null,null,null,null,{"$f":"$C13","v":"Samedi"},{"$f":"$D13","v":"2022-04-02"},null,null,null,null,2,{"$f":"D13","v":"2022-04-02"},{"$f":"$C13","v":"Samedi"}]
[]
[null,null,{"$f":"PROPER(TEXT(D15,\"JJJJ\"))","v":"Dimanche"},{"$f":"$D13+1","v":"2022-04-03"},null,null,null,null,null,null,null,null,null,null,null,null,null,null,null,null,{"$f":"$C15","v":"Dimanche"},{"$f":"$D15","v":"2022-04-03"},null,null,null,null,null,null,null,{"$f":"$C15","v":"Dimanche"},{"$f":"$D15","v":"2022-04-03"},null,null,null,null,null,null,null,null,null,null,null,null,null,null,null,{"$f":"$C15","v":"Dimanche"},{"$f":"$D15","v":"2022-04-03"},null,null,null,null,3,{"$f":"D15","v":"2022-04-03"},{"$f":"$C15","v":"Dimanche"}]
[]
[null,null,{"$f":"PROPER(TEXT(D17,\"JJJJ\"))","v":"Lundi"},{"$f":"$D15+1","v":"2022-04-04"},null,null,null,null,null,null,null,null,null,null,null,null,null,null,null,null,{"$f":"$C17","v":"Lundi"},{"$f":"$D17","v":"2022-04-04"},null,null,null,null,null,null,null,{"$f":"$C17","v":"Lundi"},{"$f":"$D17","v":"2022-04-04"},null,null,null,null,null,null,null,null,null,null,null,null,null,null,null,{"$f":"$C17","v":"Lundi"},{"$f":"$D17","v":"2022-04-04"},null,null,null,null,4,{"$f":"D17","v":"2022-04-04"},{"$f":"$C17","v":"Lundi"}]
[]
[null,null,{"$f":"PROPER(TEXT(D19,\"JJJJ\"))","v":"Mardi"},{"$f":"$D17+1","v":"2022-04-05"},null,null,null,null,null,null,null,null,null,null,null,null,null,null,null,null,{"$f":"$C19","v":"Mardi"},{"$f":"$D19","v":"2022-04-05"},null,null,null,null,null,null,null,{"$f":"$C19","v":"Mardi"},{"$f":"$D19","v":"2022-04-05"},null,null,null,null,null,null,null,null,null,null,null,null,null,null,null,{"$f":"$C19","v":"Mardi"},{"$f":"$D19","v":"2022-04-05"},null,null,null,null,5,{"$f":"D19","v":"2022-04-05"},{"$f":"$C19","v":"Mardi"}]
[]
[null,null,{"$f":"PROPER(TEXT(D21,\"JJJJ\"))","v":"Mercredi"},{"$f":"$D19+1","v":"2022-04-06"},null,null,null,null,null,null,null,null,null,null,null,null,null,null,null,null,{"$f":"$C21","v":"Mercredi"},{"$f":"$D21","v":"2022-04-06"},null,null,null,null,null,null,null,{"$f":"$C21","v":"Mercredi"},{"$f":"$D21","v":"2022-04-06"},null,null,null,null,null,null,null,null,null,null,null,null,null,null,null,{"$f":"$C21","v":"Mercredi"},{"$f":"$D21","v":"2022-04-06"},null,null,null,null,6,{"$f":"D21","v":"2022-04-06"},{"$f":"$C21","v":"Mercredi"}]
[]
[null,null,{"$f":"PROPER(TEXT(D23,\"JJJJ\"))","v":"Jeudi"},{"$f":"$D21+1","v":"2022-04-07"},null,null,null,null,null,null,null,null,null,null,null,null,null,null,null,null,{"$f":"$C23","v":"Jeudi"},{"$f":"$D23","v":"2022-04-07"},null,null,null,null,null,null,null,{"$f":"$C23","v":"Jeudi"},{"$f":"$D23","v":"2022-04-07"},null,null,null,null,null,null,null,null,null,null,null,null,null,null,null,{"$f":"$C23","v":"Jeudi"},{"$f":"$D23","v":"2022-04-07"},null,null,null,null,7,{"$f":"D23","v":"2022-04-07"},{"$f":"$C23","v":"Jeudi"}]
[]
[null,null,{"$f":"PROPER(TEXT(D25,\"JJJJ\"))","v":"Vendredi"},{"$f":"$D23+1","v":"2022-04-08"},null,null,null,null,null,null,null,null,null,null,null,null,null,null,null,null,{"$f":"$C25","v":"Vendredi"},{"$f":"$D25","v":"2022-04-08"},null,null,null,null,null,null,null,{"$f":"$C25","v":"Vendredi"},{"$f":"$D25","v":"2022-04-08"},null,null,null,null,null,null,null,null,null,null,null,null,null,null,null,{"$f":"$C25","v":"Vendredi"},{"$f":"$D25","v":"2022-04-08"},null,null,null,null,8,{"$f":"D25","v":"2022-04-08"},{"$f":"$C25","v":"Vendredi"}]
[]
[null,null,{"$f":"PROPER(TEXT(D27,\"JJJJ\"))","v":"Samedi"},{"$f":"$D25+1","v":"2022-04-09"},null,null,null,null,null,null,null,null,null,null,null,null,null,null,null,null,{"$f":"$C27","v":"Samedi"},{"$f":"$D27","v":"2022-04-09"},null,null,null,null,null,null,null,{"$f":"$C27","v":"Samedi"},{"$f":"$D27","v":"2022-04-09"},null,null,null,null,null,null,null,null,null,null,null,null,null,null,null,{"$f":"$C27","v":"Samedi"},{"$f":"$D27","v":"2022-04-09"},null,null,null,null,9,{"$f":"D27","v":"2022-04-09"},{"$f":"$C27","v":"Samedi"}]
[]
[null,null,{"$f":"PROPER(TEXT(D29,\"JJJJ\"))","v":"Dimanche"},{"$f":"$D27+1","v":"2022-04-10"},null,null,null,null,null,null,null,null,null,null,null,null,null,null,null,null,{"$f":"$C29","v":"Dimanche"},{"$f":"$D29","v":"2022-04-10"},null,null,null,null,null,null,null,{"$f":"$C29","v":"Dimanche"},{"$f":"$D29","v":"2022-04-10"},null,null,null,null,null,null,null,null,null,null,null,null,null,null,null,{"$f":"$C29","v":"Dimanche"},{"$f":"$D29","v":"2022-04-10"},null,null,null,null,10,{"$f":"D29","v":"2022-04-10"},{"$f":"$C29","v":"Dimanche"}]
[]
{"$rows_left_out":55}
{"sheet":"MINI-MAXI","index":2,"n_rows":21,"n_cols":9,"rows_kept":21,"cut":false,"hidden":false,"merged":[[15,0,15,1],[16,0,16,1],[5,10,5,11],[1,5,1,7],[20,3,20,5]]}
[{"$f":"AVRIL_2022!C5","v":"Avril_2022"}]
[null,null,null,null,null,null,null,null,"1900-05-24"]
[null,null,null,"Pluie Maxi Jour et total mois",null,null,"Températures Mini et Maxi",null,{"$f":"I1-940","v":-940}]
[null,null,null,null,null,"Vent maxi",null,null,3]
[null,null,null,null,null,null,null,null,{"$f":"I2-I3-I4","v":1082}]
["Jour","Mois",null,"__200    "]
[null,null,null,"__180    ",{"$f":"INDIRECT($A$1&\"!$W9\")","v":"00:00:00"},null,null,null,{"$f":"AVRIL_2022!J7","v":1.8}]
[null,null,null,"__160    ",132,null,null,null,145]
[{"$f":"INDIRECT($A$1&\"!$AG5\")","v":0},{"$f":"INDIRECT($A$1&\"!$AG9\")","v":0},null,"__140    ",{"$f":"INDIRECT($A$1&\"!$X$9\")","v":42.1},null,null,null,{"$f":"I7-940","v":-938.2}]
[200,200,null,"__120    ",2,null,null,null,3]
[{"$f":"100*(1-(A9/A10))","v":100},{"$f":"100*(1-(B9/B10))","v":100},null,"__100    ",{"$f":"E8-E9-E10","v":87.9},null,null,null,{"$f":"I8-I9-I10","v":1080.2}]
[{"$f":"20*A11/100","v":20},{"$f":"20*B11/100","v":20},null,"__80   ",null,"Soleil maxi"]
[17,28,null,"__60   "]
[{"$f":"(A10/100)*(1+(2*A10/100))/2","v":5},{"$f":"(B10/100)*(1+(2*B10/100))/2","v":5},null,"__40   ",null,null,null,null,"22:00:00"]
[null,null,null,"_20 ",null,null,null,null,"00:00:00"]
[{"$f":"INDIRECT($A1&\"!$AG9\")","v":0},null,null,null,null,null,null,null,{"$f":"AVRIL_2022!$AX$9","v":"11:42:00"}]
[{"$f":"INDIRECT($A$1&\"!$AG9\")","v":0},null,null,{"$f":"AVRIL_2022!AG7","v":"2022-04-01"},null,null,null,null,{"$f":"I14-I16","v":"10:18:00"}]
[]
[]
[]
[null,null,null,{"$f":"NOW()","v":"2022-04-02T16:44:37.840"},null,null,{"$f":"AVRIL_2022!L7","v":"2022-04-01"},{"$f":"AVRIL_2022!P7","v":"2022-04-01"}]

{"sheet":"MOIS","index":3,"n_rows":59,"n_cols":7,"rows_kept":59,"cut":false,"hidden":false,"merged":[[47,2,47,4],[20,1,20,4],[43,4,43,5],[44,4,44,5]]}
[{"$f":"AVRIL_2022!C5","v":"Avril_2022"}]
[]
[null,"Jours de pluie + de 2mm",null,null,"Jours de soleil + de 4h"]
[]
[]
[]
[]
[]
[31,null,null,31,null,31]
[0,null,null,0,null,0]
[{"$f":"C51","v":0},null,null,{"$f":"C50","v":1},null,{"$f":"C58","v":{"$error":"#REF!"}}]
[{"$f":"A9-A10-A11","v":31},null,null,{"$f":"D9-D10-D11","v":30},null,{"$f":"F9-F10-F11","v":{"$error":"#REF!"}}]
[]
[]
[]
[]
[]
[]
[]
[]
[null,{"$f":"NOW()","v":"2022-04-02T16:44:37.840"}]
[]
[null,"Heures de pluie",null,null,"Heures de soleil"]
[]
[]
[]
[]
[]
[2.5,null,null,22.083333333333332]
["00:00:00",null,null,"00:00:00",null,22.083333333333332]
{"$rows_left_out":30}
{"sheet":"CONSOLE","index":4,"n_rows":31,"n_cols":11,"rows_kept":31,"cut":false,"hidden":false,"merged":[]}
[null,null,"Marées",null,"https://marine.meteoconsult.fr/meteo-marine/horaires-maree-la-tranche-sur-mer-1083-0.php"]
[]
[null,null,null,null,null,null,"Marée haute","06h08"]
[null,null,null,null,"                       Températures                                   Lune                             Chaleur solaire= T°+2°                    Conditions                 Vent après mise à jour",null,"Marée haute","18h18"]
[]
[null,null,null,null,null,null,"Coeff",98]
[null,null,null,null,null,null,null,97]
[]
[null,null,null,null,null,null,"Marée basse","00h16"]
[null,null,null,null,null,null,"Marée basse","12h34"]
[null,null,null,null,null,null,null,null,null,null," "]
[]
[null,null,null,null,null,null,"T° de l'eau",11]
[null,null,null,null,"       Température ressentie                                                                                                                                                                 Vent maxi :"]
[null,null,null,null,"                                                                                Dernière mise à jour :",null,"Heures Soleil","07h43"]
[null,null,null,null,"                                                                                                                                                                                  Pluie",null,null,"20h35"]
[null,null,null,null,"                                               Heures des marées                                                                            Statistiques                                                Journée                       Mois                        Année"]
[null,null,null,null,null,null,null,"Ancienne Fx","Nouvelle Fx","Relevés"]
[null,null,null,null,null,null,"T° extérieure",{"$f":"INDEX(RELEVÉS!$B9:$B50000,COUNTA(RELEVÉS!$B9:$B50000))","v":9.5},{"$f":"VLOOKUP(9^9,RELEVÉS!$B:$B,1,TRUE)","v":9.5},9.5,"ok"]
[null,null,null,null,null,null,"T° ressentie",{"$f":"INDEX(RELEVÉS!$D9:$D50000,COUNTA(RELEVÉS!$D9:$D50000))","v":0},{"$f":"VLOOKUP(9^9,RELEVÉS!$D:$D,1,TRUE)","v":-0.2},8.5,"?"]
[null,null,null,null,null,null,"Vent",{"$f":"INDEX(RELEVÉS!$F9:$F50000,COUNTA(RELEVÉS!$F9:$F50000))","v":0},{"$f":"VLOOKUP(9^9,RELEVÉS!$F:$F,1,TRUE)","v":23.8},5.4,"?"]
[null,null,null,null,null,null,"Vent maxi",23.8]
[]
[]
[]
[]
[]
[]
[]
[]
{"$rows_left_out":2}
{"sheet":"GRAPHIQUES","index":5,"n_rows":21,"n_cols":9,"rows_kept":21,"cut":false,"hidden":false,"merged":[]}
[null,null,"                            Dernière mise à jour le :",null,null,{"$f":"NOW()","v":"2022-04-02T16:44:37.840"}]
[null,null,"Température extérieure",null,null," ",null,null,"Température Mini et Maxi extérieure"]
[]
[]
[]
[null,null,"Précipitations",null,null,null,null,null,"Précipitations"]
[]
[]
[]
[null,null,"Vitesse du vent de la journée",null,null,null,null,null,"Vitesse du vent"]
[]
[]
[null,null,"Vitesse du vent"]
[]
[]
[null,null,null,null,null,null,null,null,"Nombre d'heures de soleil"]
[]
[]
[]
[]
[null,null,"Chaleur solaire"]