{"text_format":"1","workbook":"xlsx","n_sheets":41,"sheets":["notice","formulaire de saisie","1","2","3","4","5","6","7","8","9","10","11","12","13","14","15","16","17","18","19","20","21","22","23","24","25","26","27","28","29","30","31"," RECAP MOIS PERSONNEL","RECAP MOIS MATERIEL","RECAP MOIS PRODUCTION","GNR ET ELEMENTS DE PROD","ACHATS","liste","Modèle vide","RAZ_Globale"],"not_rendered":{"charts":0,"images":3,"macros":1,"external_links":0,"defined_names":409,"comments":0,"pivot_tables":0},"unopened":[],"bounds":{"document_bytes":16777216,"sheet_cells":100000,"rows_first":2000,"rows_last":500,"rows_between":2000,"halvings":0,"cell_chars":16384,"cell_head_chars":4096},"cells_cut":0,"cells_raw":0,"read":"whole","date_system":"1900"}

{"sheet":"notice","index":0,"n_rows":0,"n_cols":0,"rows_kept":0,"cut":false,"hidden":false,"merged":[]}

{"sheet":"formulaire de saisie","index":1,"n_rows":88,"n_cols":17,"rows_kept":88,"cut":false,"hidden":false,"merged":[[0,0,0,16],[62,2,62,3],[62,6,62,8],[62,10,62,12],[63,0,63,1],[52,14,52,16],[7,15,7,16],[8,16,9,16],[63,2,63,3],[5,0,5,1],[57,0,57,16],[6,0,6,16],[35,0,35,16],[62,14,62,16],[60,6,60,16],[37,4,37,11],[87,1,87,3],[69,0,69,1],[69,2,69,3],[78,3,79,3],[68,10,68,11],[68,0,68,1],[68,2,68,3],[77,1,77,12],[78,5,78,7],[78,8,79,12],[78,1,79,1],[78,2,79,2],[78,4,79,4],[72,1,72,16],[67,0,67,1],[67,2,67,3],[8,4,8,11],[8,15,9,15],[66,2,66,3],[64,0,64,1],[65,0,65,1],[66,0,66,1],[51,8,51,11],[53,8,53,11],[55,8,55,11],[64,2,64,3],[65,2,65,3]]}
["RAPPORT JOURNALIER"]
[]
["DATE",null,null,"RESP PROD","Denis MARESCOT",null,"Site","Osselle",null,"météo"]
[]
[null,null,null,null,null,null,null,"heures de prod prévues"]
["SELECTION NOM DE LA FEUILLE",null,26]
["PERSONNEL"]
[null,null,null,null,null,null,null,null,null,null,null,null,null,null,null,"TOTAL &\nCONTRÔLE"]
[null,null,null,null,"AFFECTATION",null,null,null,null,null,null,null,null,null,null,"TOTAL","CONT"]
[null,null,"H/j",null,null,"Nbr/H",null,null,"Nbr/H",null,null,"Nbr/H"]
["NOM","CRETIN Brigitte",null,null,null,null,null,null,null,null,null,null,null,null,null,{"$f":"F11+I11+L11-C11","v":0},{"$f":"IF(F11+I11+L11=C11,\"OK\",\"FAUX\")","v":"OK"}]
[]
["NOM","DORKELD Didier",null,null,null,null,null,null,null,null,null,null,null,null,null,{"$f":"F13+I13+L13-C13","v":0},{"$f":"IF(F13+I13+L13=C13,\"OK\",\"FAUX\")","v":"OK"}]
[]
["NOM",null,null,null,null,null,null,null,null,null,null,null,null,null,null,{"$f":"F15+I15+L15-C15","v":0},{"$f":"IF(F15+I15+L15=C15,\"OK\",\"FAUX\")","v":"OK"}]
[]
["NOM",null,null,null,null,null,null,null,null,null,null,null,null,null,null,{"$f":"F17+I17+L17-C17","v":0},{"$f":"IF(F17+I17+L17=C17,\"OK\",\"FAUX\")","v":"OK"}]
[]
["NOM",null,null,null,null,null,null,null,null,null,null,null,null,null,null,{"$f":"F19+I19+L19-C19","v":0},{"$f":"IF(F19+I19+L19=C19,\"OK\",\"FAUX\")","v":"OK"}]
[]
["NOM",null,null,null,null,null,null,null,null,null,null,null,null,null,null,{"$f":"F21+I21+L21-C21","v":0},{"$f":"IF(F21+I21+L21=C21,\"OK\",\"FAUX\")","v":"OK"}]
[]
["NOM",null,null,null,null,null,null,null,null,null,null,null,null,null,null,{"$f":"F23+I23+L23-C23","v":0},{"$f":"IF(F23+I23+L23=C23,\"OK\",\"FAUX\")","v":"OK"}]
[]
["NOM",null,null,null,null,null,null,null,null,null,null,null,null,null,null,{"$f":"F25+I25+L25-C25","v":0},{"$f":"IF(F25+I25+L25=C25,\"OK\",\"FAUX\")","v":"OK"}]
[]
["NOM",null,null,null,null,null,null,null,null,null,null,null,null,null,null,{"$f":"F27+I27+L27-C27","v":0},{"$f":"IF(F27+I27+L27=C27,\"OK\",\"FAUX\")","v":"OK"}]
[]
["NOM",null,null,null,null,null,null,null,null,null,null,null,null,null,null,{"$f":"F29+I29+L29-C29","v":0},{"$f":"IF(F29+I29+L29=C29,\"OK\",\"FAUX\")","v":"OK"}]
[]
["NOM",null,null,null,null,null,null,null,null,null,null,null,null,null,null,{"$f":"F31+I31+L31-C31","v":0},{"$f":"IF(F31+I31+L31=C31,\"OK\",\"FAUX\")","v":"OK"}]
[]
["NOM",null,null,null,null,null,null,null,null,null,null,null,null,null,null,{"$f":"F33+I33+L33-C33","v":0},{"$f":"IF(F33+I33+L33=C33,\"OK\",\"FAUX\")","v":"OK"}]
[]
[]
["MATERIEL"]
[]
[null,null,null,null,"AFFECTATION",null,null,null,null,null,null,null,null,"GNR"]
[null,null,"compteur\nmatin","compteur\nsoir"]
["ENGIN","Chargeur L566 - D3101014",null,"16764",null,null,null,null,null,null,null,null,null,null,null,{"$f":"IF(D40=0,0,IF(D40-C40>24,1,D40-C40))","v":1},{"$f":"IF(F40+I40+L40=P40,\"OK\",\"FAUX\")","v":"FAUX"}]
[]
["ENGIN","Chargeur 966G - D3102742",null,"2427",null,null,null,null,null,null,null,null,null,null,null,{"$f":"IF(D42=0,0,IF(D42-C42>24,1,D42-C42))","v":1},{"$f":"IF(F42+I42+L42=P42,\"OK\",\"FAUX\")","v":"FAUX"}]
[]
["ENGIN","CAMION MERCEDES OSSELLE-P2100552",null,null,null,null,null,null,null,null,null,null,null,null,null,{"$f":"IF(D44=0,0,IF(D44-C44>24,1,D44-C44))","v":0},"OK"]
[]
["ENGIN",null,null,null,null,null,null,null,null,null,null,null,null,null,null,{"$f":"IF(D46=0,0,IF(D46-C46>24,1,D46-C46))","v":0},"OK"]
[]
["ENGIN",null,null,null,null,null,null,null,null,null,null,null,null,null,null,{"$f":"IF(D48=0,0,IF(D48-C48>24,1,D48-C48))","v":0},{"$f":"IF(F48+I48+L48=P48,\"OK\",\"FAUX\")","v":"OK"}]
[]
["ENGIN",null,null,null,null,null,null,null,null,null,null,null,null,null,null,{"$f":"IF(D50=0,0,IF(D50-C50>24,1,D50-C50))","v":0},{"$f":"IF(F50+I50+L50=P50,\"OK\",\"FAUX\")","v":"OK"}]
[]
["VHL LIAISON","Minipelle SV17 - oss - D1002929",null,"2291",null,"GNR"]
[]
["VHL LIAISON","Manitou M30 - C8100689",null,"7146",null,"GNR"]
[]
["VHL LIAISON",null,null,null,null,"GNR"]
[]
["PRODUCTION"]
[]
[]
[null,"HEURES DE PRODUCTION",null,null,null,null,"PRODUCTION - FABRICATION"]
[]
[null,null,"COMPTEUR HORAIRE",null,"HEURE DE FONCTIONNEMENT",null,"PRIMAIRE",null,null,null,"SECONDAIRE",null,null,null,"TERTIAIRE"]
["PRIMAIRE (Production Plaine)"]
["SECONDAIRE (Production Bascule  Tunnel)",null,null,null,null,null,"ALIM PLAINE ",null,null,null,"FABRICATION","0/4SCL",null,null,"CONCASSES","0/2C"]
["TERTIAIRE (frabrication concassée)",null,null,null,null,null,"ALIM BASCULE TUNNEL",null,null,null,"FABRICATION","M0/16",null,null,"CONCASSES","2/4C"]
["Compteur d'eau",null,null,null,null,null,null,null,null,null,"FABRICATION","M0/8",null,null,"CONCASSES","4/6C"]
[null,null,null,null,null,null,null,null,null,null,null,null,null,null,"CONCASSES","4/10C"]
[null,null,null,null,null,null,null,null,null,null,"BIG BAG",null,null,null,"CONCASSES","6/10C"]
[null,null,null,null,null,null,null,null,null,null,null,null,null,null,"CONCASSES","22/80"]
[null,null,null,null,null,null,null,null,null,null,null,null,null,null,"CONCASSES","0/4C CHEM"]
[]
[null,"ACHATS"]
[]
[null,"PRODUIT","TONNAGE",null,"PRODUIT","TONNAGE",null,"PRODUIT","TONNAGE"]
[]
[]
[null,"ARRETS"]
[null,"Horamètre","CIRCUIT","MACHINE","CAUSE","DUREE (en mn)",null,null,"COMMENTAIRES"]
[null,null,null,null,null,"Panne","Entretien","AUTRE"]
[]
[]
[]
[]
[]
[]
[]
[null,"OBSERVATION : Garder une trace d'un fait précis"]

{"sheet":"1","index":2,"n_rows":78,"n_cols":14,"rows_kept":78,"cut":false,"hidden":false,"merged":[[77,0,77,2],[0,0,0,11],[26,1,26,6],[51,0,51,2],[51,3,51,5],[51,6,51,8],[67,0,67,11],[68,0,69,0],[68,1,69,1],[68,2,69,2],[68,3,69,3],[68,4,68,6],[68,7,69,11]]}
["RAPPORT JOURNALIER"]
[]
["DATE :","2020-10-01"]
["EXPLOITATION DE:","Osselle",null,"RESPONSABLE",null,"METEO"]
[null,null,null,"Denis MARESCOT",null,"Pluie"]
[]
[null,null,null,"H DE PRODUCTIONS PREVUES",8]
["POINTAGE PERSONNEL"]
[]
["NOM PRENOM","AFFECTATION","Nombre\nd'heure","AFFECTATION","Nombre\nd'heure","AFFECTATION","Nombre\nd'heure","TOTAL HORAIRE JOUR"]
["CRETIN Brigitte","Bascule 200200",8,null,null,null,null,{"$f":"C11+E11+G11","v":8}]
["DORKELD Didier","Sur Engin Chargement client",5,"210258 Travaux divers sans engins",3,null,null,{"$f":"C12+E12+G12","v":8}]
["HOLTZ Mathieu","Sur Engin Destockage",7,"210258 Travaux divers sans engins",1,null,null,{"$f":"C13+E13+G13","v":8}]
[null,null,null,null,null,null,null,0]
[null,null,null,null,null,null,null,0]
[null,null,null,null,null,null,null,0]
[null,null,null,null,null,null,null,{"$f":"C17+E17+G17","v":0}]
[null,null,null,null,null,null,null,{"$f":"C18+E18+G18","v":0}]
[null,null,null,null,null,null,null,{"$f":"C19+E19+G19","v":0}]
[null,null,null,null,null,null,null,0]
[null,null,null,null,null,null,null,0]
[null,null,null,null,null,null,null,0]
[]
["POINTAGE MATERIEL"]
[]
["ENGINS DE PRODUCTION"]
["TYPE","AFFECTATION HORAIRE",null,null,null,null,null,"TOTAL\n HORAIRE JOUR","GNR","HORAMETRE \nMATIN","HORAMETRE \nSOIR","CONTRÔLE"]
["Chargeur L566 - D3101014","CHARGEMENT CLIENT /200200",5,null,null,null,null,{"$f":"C28+E28+G28","v":5},null,"16743","16748",{"$f":"IF(K28-J28=H28,\"OK\",\"FAUX\")","v":"OK"}]
["Chargeur 966G - D3102742","DESTOCKAGE/200308",7,null,null,null,null,{"$f":"C29+E29+G29","v":7},193,"2386","2393",{"$f":"IF(K29-J29=H29,\"OK\",\"FAUX\")","v":"OK"}]
["CAMION MERCEDES OSSELLE-P2100552",null,null,null,null,null,null,0,null,null,null,"OK"]
[null,null,null,null,null,null,null,0,null,null,null,"OK"]
[null,null,null,null,null,null,null,0,null,null,null,"OK"]
[null,null,null,null,null,null,null,0,null,null,null,"OK"]
[]
["VEHICULES DE LIAISON","HORAMETRE MATIN","SOIR","GNR","HEURE\n FONTIONNEMENT"]
["Minipelle SV17 - oss - D1002929","2291","2291",null,{"$f":"C36-B36","v":0}]
["Manitou M30 - C8100689","7139","7139",null,{"$f":"C37-B37","v":0}]
[null,null,null,null,0]
[]
[]
["RAPPORT DE PRODUCTION "]
[]
[null,"COMPTEUR HORAIRE","H/FONCT"]
["PRIMAIRE (Production Plaine)"]
["SECONDAIRE (Production Bascule  Tunnel)",11934,6]
["TERTIAIRE (frabrication concassée)"]
["BIG BAG"]
["Compteur d'eau"]
[]
[]
[null,null,null,null,"BIG BAG"]
["PRIMAIRE",null,null,"SECONDAIRE",null,null,"TERTIAIRE"]
["ALIMENTATION","Tout venant Brut",509,"FABRICATION","0/4SCL",null,"CONCASSES","0/2C"]
["Plaine","Tout venant Brut",null,"FABRICATION","M0/16",null,"CONCASSES","2/4C"]
["T120","Tout venant écreté",{"$f":"C54*0.95","v":0},"FABRICATION","M0/8",null,"CONCASSES","4/6C"]
["Débit mesuré en T/h","GRANULOMETRIE","TONNAGES",null,"GRANULOMETRIE","TONNAGES","CONCASSES","4/10C"]
[50,"04 NATUREL",{"$f":"C53*D57","v":111.98},0.22,"SABLE 0/4R",{"$f":"C57-(F53*'GNR ET ELEMENTS DE PROD'!L10)-('1'!F54*'GNR ET ELEMENTS DE PROD'!L7)","v":111.98},"CONCASSES","6/10C"]
[36,"4/8R",{"$f":"C53*D58","v":81.44},0.16,"4/8R",{"$f":"C58","v":81.44},"CONCASSES"]
[42,"8/16R",{"$f":"C53*D59","v":91.61999999999999},0.18,"8/16R",{"$f":"C59-F54*'GNR ET ELEMENTS DE PROD'!N7","v":91.61999999999999},"CONCASSES"]
[32,"11/22R",{"$f":"C53*D60","v":71.260000000000005},0.14000000000000001,"11/22R",{"$f":"C60","v":71.260000000000005},"CONCASSES","0/4C",{"$f":"-F54*'GNR ET ELEMENTS DE PROD'!K7-F53*'GNR ET ELEMENTS DE PROD'!K10","v":0},null,null,null,null,""]
[68,"22/80",{"$f":"C53*D61","v":152.69999999999999},0.3,"22/80",{"$f":"C63-I55-I5-ABS(I57)","v":0},"CONCASSES","6,3/10",{"$f":"+-'GNR ET ELEMENTS DE PROD'!M7*F54","v":0},null,null,null,null,""]
[{"$f":"SUM(A57:B61)","v":228},null,{"$f":"SUM(C57:C61)","v":509},null,null,{"$f":"SUM(F57:F61)","v":356.3},null,null,{"$f":"SUM(I53:I61)","v":0},null,null,null,null,""]
[]
["ACHATS"]
[]
[]
[null,null,null,null,null,null,null,null,null,null,null,null,null,""]
["ARRETS",null,null,null,null,null,null,null,null,null,null,null,null,""]
["Horamètre","CIRCUIT","MACHINE","CAUSE","DUREE (en mn)",null,null,"COMMENTAIRES",null,null,null,null,null,""]
[null,null,null,null,"Panne","Entretien","AUTRE",null,null,null,null,null,null,""]
[null,null,null,null,null,null,null,null,null,null,null,null,null,""]
[null,null,null,null,null,null,null,null,null,null,null,null,null,""]
[null,null,null,null,null,null,null,null,null,null,null,null,null,""]
[]
[]
[]
[]
["Observations\n  (pour garder une trace d'un fait particulier)"]

{"sheet":"2","index":3,"n_rows":78,"n_cols":14,"rows_kept":78,"cut":false,"hidden":false,"merged":[[0,0,0,11],[26,1,26,6],[51,0,51,2],[51,3,51,5],[51,6,51,8]]}
["RAPPORT JOURNALIER"]
[]
["DATE :","2020-10-02"]
["EXPLOITATION DE:","Osselle",null,"RESPONSABLE",null,"METEO"]
[null,null,null,"Denis MARESCOT",null,"Pluie"]
[]
[null,null,null,"H DE PRODUCTIONS PREVUES",7]
["POINTAGE PERSONNEL"]
[]
["NOM PRENOM","AFFECTATION","Nombre\nd'heure","AFFECTATION","Nombre\nd'heure","AFFECTATION","Nombre\nd'heure","TOTAL HORAIRE JOUR"]
["CRETIN Brigitte","Bascule 200200",7,null,null,null,null,{"$f":"C11+E11+G11","v":7}]
["DORKELD Didier","Sur Engin Chargement client",3,"210258 Travaux divers sans engins",4,null,null,{"$f":"C12+E12+G12","v":7}]
[null,null,null,null,null,null,null,{"$f":"C13+E13+G13","v":0}]
[null,null,null,null,null,null,null,0]
[null,null,null,null,null,null,null,0]
[null,null,null,null,null,null,null,0]
[null,null,null,null,null,null,null,{"$f":"C17+E17+G17","v":0}]
[null,null,null,null,null,null,null,{"$f":"C18+E18+G18","v":0}]
[null,null,null,null,null,null,null,{"$f":"C19+E19+G19","v":0}]
[null,null,null,null,null,null,null,0]
[null,null,null,null,null,null,null,0]
[null,null,null,null,null,null,null,0]
[]
["POINTAGE MATERIEL"]
[]
["ENGINS DE PRODUCTION"]
["TYPE","AFFECTATION HORAIRE",null,null,null,null,null,"TOTAL\n HORAIRE JOUR","GNR","HORAMETRE \nMATIN","HORAMETRE \nSOIR","CONTRÔLE"]
["Chargeur L566 - D3101014",null,null,null,null,null,null,{"$f":"C28+E28+G28","v":0},null,"16748","16748",{"$f":"IF(K28-J28=H28,\"OK\",\"FAUX\")","v":"OK"}]
["Chargeur 966G - D3102742","CHARGEMENT CLIENT /200200",3,null,null,null,null,{"$f":"C29+E29+G29","v":3},null,"2393","2396",{"$f":"IF(K29-J29=H29,\"OK\",\"FAUX\")","v":"OK"}]
["CAMION MERCEDES OSSELLE-P2100552",null,null,null,null,null,null,0,null,null,null,"OK"]
[null,null,null,null,null,null,null,0,null,null,null,"OK"]
[null,null,null,null,null,null,null,0,null,null,null,"OK"]
[null,null,null,null,null,null,null,0,null,null,null,"OK"]
[]
["VEHICULES DE LIAISON","HORAMETRE MATIN","SOIR","GNR","HEURE\n FONTIONNEMENT"]
["Minipelle SV17 - oss - D1002929","2291","2291",null,{"$f":"C36-B36","v":0}]
["Manitou M30 - C8100689","7139","7139",null,{"$f":"C37-B37","v":0}]
[null,null,null,null,0]
[]
[]
["RAPPORT DE PRODUCTION "]
[]
[null,"COMPTEUR HORAIRE","H/FONCT"]
["PRIMAIRE (Production Plaine)"]
["SECONDAIRE (Production Bascule  Tunnel)"]
["TERTIAIRE (frabrication concassée)"]
["BIG BAG"]
["Compteur d'eau"]
[]
[]
[null,null,null,null,"BIG BAG"]
["PRIMAIRE",null,null,"SECONDAIRE",null,null,"TERTIAIRE"]
["ALIMENTATION","Tout venant Brut",null,"FABRICATION","0/4SCL",null,"CONCASSES","0/2C"]
["Plaine","Tout venant Brut",null,"FABRICATION","M0/16",null,"CONCASSES","2/4C"]
["T120","Tout venant écreté",{"$f":"C54*0.95","v":0},"FABRICATION","M0/8",null,"CONCASSES","4/6C"]
["Débit mesuré en T/h","GRANULOMETRIE","TONNAGES",null,"GRANULOMETRIE","TONNAGES","CONCASSES","4/10C"]
[50,"04 NATUREL",{"$f":"C53*D57","v":0},0.22,"SABLE 0/4R",{"$f":"C57-(F53*'GNR ET ELEMENTS DE PROD'!L10)-('2'!F54*'GNR ET ELEMENTS DE PROD'!L7)","v":0},"CONCASSES","6/10C"]
[36,"4/8R",{"$f":"C53*D58","v":0},0.16,"4/8R",{"$f":"C58","v":0},"CONCASSES"]
[42,"8/16R",{"$f":"C53*D59","v":0},0.18,"8/16R",{"$f":"C59-F54*'GNR ET ELEMENTS DE PROD'!N7","v":0},"CONCASSES"]
[32,"11/22R",{"$f":"C53*D60","v":0},0.14000000000000001,"11/22R",{"$f":"C60","v":0},"CONCASSES","0/4C",{"$f":"-F54*'GNR ET ELEMENTS DE PROD'!K7-F53*'GNR ET ELEMENTS DE PROD'!K10","v":0},null,null,null,null,""]
[68,"22/80",{"$f":"C53*D61","v":0},0.3,"22/80",{"$f":"C63-I55-I5-ABS(I57)","v":0},"CONCASSES","6,3/10",{"$f":"+-'GNR ET ELEMENTS DE PROD'!M7*F54","v":0},null,null,null,null,""]
[{"$f":"SUM(A57:B61)","v":228},null,{"$f":"SUM(C57:C61)","v":0},null,null,{"$f":"SUM(F57:F61)","v":0},null,null,{"$f":"SUM(I53:I61)","v":0},null,null,null,null,""]
[]
["ACHATS"]
[]
[]
[null,null,null,null,null,null,null,null,null,null,null,null,null,""]
["ARRETS",null,null,null,null,null,null,null,null,null,null,null,null,""]
["Horamètre","CIRCUIT","MACHINE","CAUSE","DUREE (en mn)",null,null,"COMMENTAIRES",null,null,null,null,null,""]
[null,null,null,null,"Panne","Entretien","AUTRE",null,null,null,null,null,null,""]
[null,null,null,null,null,null,null,null,null,null,null,null,null,""]
[null,null,null,null,null,null,null,null,null,null,null,null,null,""]
[null,null,null,null,null,null,null,null,null,null,null,null,null,""]
[]
[]
[]
[]
["Observations\n  (pour garder une trace d'un fait particulier)"]

{"sheet":"3","index":4,"n_rows":78,"n_cols":14,"rows_kept":78,"cut":false,"hidden":false,"merged":[[0,0,0,11],[26,1,26,6],[51,0,51,2],[51,3,51,5],[51,6,51,8]]}
["RAPPORT JOURNALIER"]
[]
["DATE :","2020-10-03"]
["EXPLOITATION DE:","Osselle",null,"RESPONSABLE",null,"METEO"]
[null,null,null,"Denis MARESCOT",null,"Pluie"]
[]
[null,null,null,"H DE PRODUCTIONS PREVUES",7]
["POINTAGE PERSONNEL"]
[]
["NOM PRENOM","AFFECTATION","Nombre\nd'heure","AFFECTATION","Nombre\nd'heure","AFFECTATION","Nombre\nd'heure","TOTAL HORAIRE JOUR"]
["CRETIN Brigitte","Bascule 200200",7,null,null,null,null,{"$f":"C11+E11+G11","v":7}]
["DORKELD Didier","Sur Engin Chargement client",3,"210258 Travaux divers sans engins",4,null,null,{"$f":"C12+E12+G12","v":7}]
[null,null,null,null,null,null,null,{"$f":"C13+E13+G13","v":0}]
[null,null,null,null,null,null,null,0]
[null,null,null,null,null,null,null,0]
[null,null,null,null,null,null,null,0]
[null,null,null,null,null,null,null,{"$f":"C17+E17+G17","v":0}]
[null,null,null,null,null,null,null,{"$f":"C18+E18+G18","v":0}]
[null,null,null,null,null,null,null,{"$f":"C19+E19+G19","v":0}]
[null,null,null,null,null,null,null,0]
[null,null,null,null,null,null,null,0]
[null,null,null,null,null,null,null,0]
[]
["POINTAGE MATERIEL"]
[]
["ENGINS DE PRODUCTION"]
["TYPE","AFFECTATION HORAIRE",null,null,null,null,null,"TOTAL\n HORAIRE JOUR","GNR","HORAMETRE \nMATIN","HORAMETRE \nSOIR","CONTRÔLE"]
["Chargeur L566 - D3101014",null,null,null,null,null,null,{"$f":"C28+E28+G28","v":0},null,"16748","16748",{"$f":"IF(K28-J28=H28,\"OK\",\"FAUX\")","v":"OK"}]
["Chargeur 966G - D3102742","CHARGEMENT CLIENT /200200",3,null,null,null,null,{"$f":"C29+E29+G29","v":3},null,"2393","2396",{"$f":"IF(K29-J29=H29,\"OK\",\"FAUX\")","v":"OK"}]
["CAMION MERCEDES OSSELLE-P2100552",null,null,null,null,null,null,0,null,null,null,"OK"]
[null,null,null,null,null,null,null,0,null,null,null,"OK"]
[null,null,null,null,null,null,null,0,null,null,null,"OK"]
[null,null,null,null,null,null,null,0,null,null,null,"OK"]
[]
["VEHICULES DE LIAISON","HORAMETRE MATIN","SOIR","GNR","HEURE\n FONTIONNEMENT"]
["Minipelle SV17 - oss - D1002929","2291","2291",null,{"$f":"C36-B36","v":0}]
["Manitou M30 - C8100689","7139","7139",null,{"$f":"C37-B37","v":0}]
[null,null,null,null,0]
[]
[]
["RAPPORT DE PRODUCTION "]
[]
[null,"COMPTEUR HORAIRE","H/FONCT"]
["PRIMAIRE (Production Plaine)"]
["SECONDAIRE (Production Bascule  Tunnel)"]
["TERTIAIRE (frabrication concassée)"]
["BIG BAG"]
["Compteur d'eau"]
[]
[]
[null,null,null,null,"BIG BAG"]
["PRIMAIRE",null,null,"SECONDAIRE",null,null,"TERTIAIRE"]
["ALIMENTATION","Tout venant Brut",null,"FABRICATION","0/4SCL",null,"CONCASSES","0/2C"]
["Plaine","Tout venant Brut",null,"FABRICATION","M0/16",null,"CONCASSES","2/4C"]
["T120","Tout venant écreté",{"$f":"C54*0.95","v":0},"FABRICATION","M0/8",null,"CONCASSES","4/6C"]
["Débit mesuré en T/h","GRANULOMETRIE","TONNAGES",null,"GRANULOMETRIE","TONNAGES","CONCASSES","4/10C"]
[50,"04 NATUREL",{"$f":"C53*D57","v":0},0.22,"SABLE 0/4R",{"$f":"C57-(F53*'GNR ET ELEMENTS DE PROD'!L10)-('3'!F54*'GNR ET ELEMENTS DE PROD'!L7)","v":0},"CONCASSES","6/10C"]
[36,"4/8R",{"$f":"C53*D58","v":0},0.16,"4/8R",{"$f":"C58","v":0},"CONCASSES"]
[42,"8/16R",{"$f":"C53*D59","v":0},0.18,"8/16R",{"$f":"C59-F54*'GNR ET ELEMENTS DE PROD'!N7","v":0},"CONCASSES"]
[32,"11/22R",{"$f":"C53*D60","v":0},0.14000000000000001,"11/22R",{"$f":"C60","v":0},"CONCASSES","0/4C",{"$f":"-F54*'GNR ET ELEMENTS DE PROD'!K7-F53*'GNR ET ELEMENTS DE PROD'!K10","v":0},null,null,null,null,""]
[68,"22/80",{"$f":"C53*D61","v":0},0.3,"22/80",{"$f":"C63-I55-I5-ABS(I57)","v":0},"CONCASSES","6,3/10",{"$f":"+-'GNR ET ELEMENTS DE PROD'!M7*F54","v":0},null,null,null,null,""]
[{"$f":"SUM(A57:B61)","v":228},null,{"$f":"SUM(C57:C61)","v":0},null,null,{"$f":"SUM(F57:F61)","v":0},null,null,{"$f":"SUM(I53:I61)","v":0},null,null,null,null,""]
[]
["ACHATS"]
[]
[]
[null,null,null,null,null,null,null,null,null,null,null,null,null,""]
["ARRETS",null,null,null,null,null,null,null,null,null,null,null,null,""]
["Horamètre","CIRCUIT","MACHINE","CAUSE","DUREE (en mn)",null,null,"COMMENTAIRES",null,null,null,null,null,""]
[null,null,null,null,"Panne","Entretien","AUTRE",null,null,null,null,null,null,""]
[null,null,null,null,null,null,null,null,null,null,null,null,null,""]
[null,null,null,null,null,null,null,null,null,null,null,null,null,""]
[null,null,null,null,null,null,null,null,null,null,null,null,null,""]
[]
[]
[]
[]
["Observations\n  (pour garder une trace d'un fait particulier)"]

{"sheet":"4","index":5,"n_rows":78,"n_cols":14,"rows_kept":78,"cut":false,"hidden":false,"merged":[[0,0,0,11],[26,1,26,6],[51,0,51,2],[51,3,51,5],[51,6,51,8]]}
["RAPPORT JOURNALIER"]
[]
["DATE :","2020-10-04"]
["EXPLOITATION DE:","Osselle",null,"RESPONSABLE",null,"METEO"]
[null,null,null,"Denis MARESCOT",null,"Pluie"]
[]
[null,null,null,"H DE PRODUCTIONS PREVUES",7]
["POINTAGE PERSONNEL"]
[]
["NOM PRENOM","AFFECTATION","Nombre\nd'heure","AFFECTATION","Nombre\nd'heure","AFFECTATION","Nombre\nd'heure","TOTAL HORAIRE JOUR"]
["CRETIN Brigitte","Bascule 200200",7,null,null,null,null,{"$f":"C11+E11+G11","v":7}]
["DORKELD Didier","Sur Engin Chargement client",3,"210258 Travaux divers sans engins",4,null,null,{"$f":"C12+E12+G12","v":7}]
[null,null,null,null,null,null,null,{"$f":"C13+E13+G13","v":0}]
[null,null,null,null,null,null,null,0]
[null,null,null,null,null,null,null,0]
[null,null,null,null,null,null,null,0]
[null,null,null,null,null,null,null,{"$f":"C17+E17+G17","v":0}]
[null,null,null,null,null,null,null,{"$f":"C18+E18+G18","v":0}]
[null,null,null,null,null,null,null,{"$f":"C19+E19+G19","v":0}]
[null,null,null,null,null,null,null,0]
[null,null,null,null,null,null,null,0]
[null,null,null,null,null,null,null,0]
[]
["POINTAGE MATERIEL"]
[]
["ENGINS DE PRODUCTION"]
["TYPE","AFFECTATION HORAIRE",null,null,null,null,null,"TOTAL\n HORAIRE JOUR","GNR","HORAMETRE \nMATIN","HORAMETRE \nSOIR","CONTRÔLE"]
["Chargeur L566 - D3101014",null,null,null,null,null,null,{"$f":"C28+E28+G28","v":0},null,"16748","16748",{"$f":"IF(K28-J28=H28,\"OK\",\"FAUX\")","v":"OK"}]
["Chargeur 966G - D3102742","CHARGEMENT CLIENT /200200",3,null,null,null,null,{"$f":"C29+E29+G29","v":3},null,"2393","2396",{"$f":"IF(K29-J29=H29,\"OK\",\"FAUX\")","v":"OK"}]
["CAMION MERCEDES OSSELLE-P2100552",null,null,null,null,null,null,0,null,null,null,"OK"]
[null,null,null,null,null,null,null,0,null,null,null,"OK"]
[null,null,null,null,null,null,null,0,null,null,null,"OK"]
[null,null,null,null,null,null,null,0,null,null,null,"OK"]
[]
["VEHICULES DE LIAISON","HORAMETRE MATIN","SOIR","GNR","HEURE\n FONTIONNEMENT"]
["Minipelle SV17 - oss - D1002929","2291","2291",null,{"$f":"C36-B36","v":0}]
["Manitou M30 - C8100689","7139","7139",null,{"$f":"C37-B37","v":0}]
[null,null,null,null,0]
[]
[]
["RAPPORT DE PRODUCTION "]
[]
[null,"COMPTEUR HORAIRE","H/FONCT"]
["PRIMAIRE (Production Plaine)"]
["SECONDAIRE (Production Bascule  Tunnel)"]
["TERTIAIRE (frabrication concassée)"]
["BIG BAG"]
["Compteur d'eau"]
[]
[]
[null,null,null,null,"BIG BAG"]
["PRIMAIRE",null,null,"SECONDAIRE",null,null,"TERTIAIRE"]
["ALIMENTATION","Tout venant Brut",null,"FABRICATION","0/4SCL",null,"CONCASSES","0/2C"]
["Plaine","Tout venant Brut",null,"FABRICATION","M0/16",null,"CONCASSES","2/4C"]
["T120","Tout venant écreté",{"$f":"C54*0.95","v":0},"FABRICATION","M0/8",null,"CONCASSES","4/6C"]
["Débit mesuré en T/h","GRANULOMETRIE","TONNAGES",null,"GRANULOMETRIE","TONNAGES","CONCASSES","4/10C"]
[50,"04 NATUREL",{"$f":"C53*D57","v":0},0.22,"SABLE 0/4R",{"$f":"C57-(F53*'GNR ET ELEMENTS DE PROD'!L10)-('4'!F54*'GNR ET ELEMENTS DE PROD'!L7)","v":0},"CONCASSES","6/10C"]
[36,"4/8R",{"$f":"C53*D58","v":0},0.16,"4/8R",{"$f":"C58","v":0},"CONCASSES"]
[42,"8/16R",{"$f":"C53*D59","v":0},0.18,"8/16R",{"$f":"C59-F54*'GNR ET ELEMENTS DE PROD'!N7","v":0},"CONCASSES"]
[32,"11/22R",{"$f":"C53*D60","v":0},0.14000000000000001,"11/22R",{"$f":"C60","v":0},"CONCASSES","0/4C",{"$f":"-F54*'GNR ET ELEMENTS DE PROD'!K7-F53*'GNR ET ELEMENTS DE PROD'!K10","v":0},null,null,null,null,""]
[68,"22/80",{"$f":"C53*D61","v":0},0.3,"22/80",{"$f":"C63-I55-I5-ABS(I57)","v":0},"CONCASSES","6,3/10",{"$f":"+-'GNR ET ELEMENTS DE PROD'!M7*F54","v":0},null,null,null,null,""]
[{"$f":"SUM(A57:B61)","v":228},null,{"$f":"SUM(C57:C61)","v":0},null,null,{"$f":"SUM(F57:F61)","v":0},null,null,{"$f":"SUM(I53:I61)","v":0},null,null,null,null,""]
[]
["ACHATS"]
[]
[]
[null,null,null,null,null,null,null,null,null,null,null,null,null,""]
["ARRETS",null,null,null,null,null,null,null,null,null,null,null,null,""]
["Horamètre","CIRCUIT","MACHINE","CAUSE","DUREE (en mn)",null,null,"COMMENTAIRES",null,null,null,null,null,""]
[null,null,null,null,"Panne","Entretien","AUTRE",null,null,null,null,null,null,""]
[null,null,null,null,null,null,null,null,null,null,null,null,null,""]
[null,null,null,null,null,null,null,null,null,null,null,null,null,""]
[null,null,null,null,null,null,null,null,null,null,null,null,null,""]
[]
[]
[]
[]
["Observations\n  (pour garder une trace d'un fait particulier)"]

{"sheet":"5","index":6,"n_rows":78,"n_cols":14,"rows_kept":78,"cut":false,"hidden":false,"merged":[[0,0,0,11],[26,1,26,6],[51,0,51,2],[51,3,51,5],[51,6,51,8]]}
["RAPPORT JOURNALIER"]
[]
["DATE :","2020-10-05"]
["EXPLOITATION DE:","Osselle",null,"RESPONSABLE",null,"METEO"]
[null,null,null,"Denis MARESCOT",null,"Pluie"]
[]
[null,null,null,"H DE PRODUCTIONS PREVUES",8]
["POINTAGE PERSONNEL"]
[]
["NOM PRENOM","AFFECTATION","Nombre\nd'heure","AFFECTATION","Nombre\nd'heure","AFFECTATION","Nombre\nd'heure","TOTAL HORAIRE JOUR"]
[null,null,null,null,null,null,null,{"$f":"C11+E11+G11","v":0}]
["DORKELD Didier","Sur Engin Chargement client",2,"210258 Travaux divers sans engins",6,null,null,{"$f":"C12+E12+G12","v":8}]
["HOLTZ Mathieu","Install secondaire  210256",1.5,"Sur Engin Destockage",4,null,null,{"$f":"C13+E13+G13","v":5.5}]
["LEBRUN Martial","Bascule 200200",8,null,null,null,null,8]
[null,null,null,null,null,null,null,0]
[null,null,null,null,null,null,null,0]
[null,null,null,null,null,null,null,{"$f":"C17+E17+G17","v":0}]
[null,null,null,null,null,null,null,{"$f":"C18+E18+G18","v":0}]
[null,null,null,null,null,null,null,{"$f":"C19+E19+G19","v":0}]
[null,null,null,null,null,null,null,0]
[null,null,null,null,null,null,null,0]
[null,null,null,null,null,null,null,0]
[]
["POINTAGE MATERIEL"]
[]
["ENGINS DE PRODUCTION"]
["TYPE","AFFECTATION HORAIRE",null,null,null,null,null,"TOTAL\n HORAIRE JOUR","GNR","HORAMETRE \nMATIN","HORAMETRE \nSOIR","CONTRÔLE"]
["Chargeur L566 - D3101014","CHARGEMENT CLIENT /200200",2,null,null,null,null,{"$f":"C28+E28+G28","v":2},150,"16748","16750",{"$f":"IF(K28-J28=H28,\"OK\",\"FAUX\")","v":"OK"}]
["Chargeur 966G - D3102742","DESTOCKAGE/200308",4,null,null,null,null,{"$f":"C29+E29+G29","v":4},null,"2396","2400",{"$f":"IF(K29-J29=H29,\"OK\",\"FAUX\")","v":"OK"}]
["CAMION MERCEDES OSSELLE-P2100552",null,null,null,null,null,null,0,null,null,null,"OK"]
[null,null,null,null,null,null,null,0,null,null,null,"OK"]
[null,null,null,null,null,null,null,0,null,null,null,"OK"]
[null,null,null,null,null,null,null,0,null,null,null,"OK"]
[]
["VEHICULES DE LIAISON","HORAMETRE MATIN","SOIR","GNR","HEURE\n FONTIONNEMENT"]
["Minipelle SV17 - oss - D1002929","2291","2291",null,{"$f":"C36-B36","v":0}]
["Manitou M30 - C8100689","7139","7139",null,{"$f":"C37-B37","v":0}]
[null,null,null,null,0]
[]
[]
["RAPPORT DE PRODUCTION "]
[]
[null,"COMPTEUR HORAIRE","H/FONCT"]
["PRIMAIRE (Production Plaine)"]
["SECONDAIRE (Production Bascule  Tunnel)",11939,4]
["TERTIAIRE (frabrication concassée)"]
["BIG BAG"]
["Compteur d'eau"]
[]
[]
[null,null,null,null,"BIG BAG"]
["PRIMAIRE",null,null,"SECONDAIRE",null,null,"TERTIAIRE"]
["ALIMENTATION","Tout venant Brut",283,"FABRICATION","0/4SCL",null,"CONCASSES","0/2C"]
["Plaine","Tout venant Brut",null,"FABRICATION","M0/16",null,"CONCASSES","2/4C"]
["T120","Tout venant écreté",{"$f":"C54*0.95","v":0},"FABRICATION","M0/8",null,"CONCASSES","4/6C"]
["Débit mesuré en T/h","GRANULOMETRIE","TONNAGES",null,"GRANULOMETRIE","TONNAGES","CONCASSES","4/10C"]
[50,"04 NATUREL",{"$f":"C53*D57","v":62.26},0.22,"SABLE 0/4R",{"$f":"C57-(F53*'GNR ET ELEMENTS DE PROD'!L10)-('5'!F54*'GNR ET ELEMENTS DE PROD'!L7)","v":62.26},"CONCASSES","6/10C"]
[36,"4/8R",{"$f":"C53*D58","v":45.28},0.16,"4/8R",{"$f":"C58","v":45.28},"CONCASSES"]
[42,"8/16R",{"$f":"C53*D59","v":50.94},0.18,"8/16R",{"$f":"C59-F54*'GNR ET ELEMENTS DE PROD'!N7","v":50.94},"CONCASSES"]
[32,"11/22R",{"$f":"C53*D60","v":39.620000000000005},0.14000000000000001,"11/22R",{"$f":"C60","v":39.620000000000005},"CONCASSES","0/4C",{"$f":"-F54*'GNR ET ELEMENTS DE PROD'!K7-F53*'GNR ET ELEMENTS DE PROD'!K10","v":0},null,null,null,null,""]
[68,"22/80",{"$f":"C53*D61","v":84.899999999999991},0.3,"22/80",{"$f":"C63-I55-I5-ABS(I57)","v":0},"CONCASSES","6,3/10",{"$f":"+-'GNR ET ELEMENTS DE PROD'!M7*F54","v":0},null,null,null,null,""]
[{"$f":"SUM(A57:B61)","v":228},null,{"$f":"SUM(C57:C61)","v":283},null,null,{"$f":"SUM(F57:F61)","v":198.1},null,null,{"$f":"SUM(I53:I61)","v":0},null,null,null,null,""]
[]
["ACHATS"]
[]
[]
[null,null,null,null,null,null,null,null,null,null,null,null,null,""]
["ARRETS",null,null,null,null,null,null,null,null,null,null,null,null,""]
["Horamètre","CIRCUIT","MACHINE","CAUSE","DUREE (en mn)",null,null,"COMMENTAIRES",null,null,null,null,null,""]
[null,null,null,null,"Panne","Entretien","AUTRE",null,null,null,null,null,null,""]
[null,null,null,null,null,null,null,null,null,null,null,null,null,""]
[null,null,null,null,null,null,null,null,null,null,null,null,null,""]
[null,null,null,null,null,null,null,null,null,null,null,null,null,""]
[]
[]
[]
[]
["Observations\n  (pour garder une trace d'un fait particulier)"]

{"sheet":"6","index":7,"n_rows":78,"n_cols":14,"rows_kept":78,"cut":false,"hidden":false,"merged":[[0,0,0,11],[26,1,26,6],[51,0,51,2],[51,3,51,5],[51,6,51,8]]}
["RAPPORT JOURNALIER"]
[]
["DATE :","2020-10-06"]
["EXPLOITATION DE:","Osselle",null,"RESPONSABLE",null,"METEO"]
[null,null,null,"Denis MARESCOT",null,"Humide"]
[]
[null,null,null,"H DE PRODUCTIONS PREVUES",8]
["POINTAGE PERSONNEL"]
[]
["NOM PRENOM","AFFECTATION","Nombre\nd'heure","AFFECTATION","Nombre\nd'heure","AFFECTATION","Nombre\nd'heure","TOTAL HORAIRE JOUR"]
[null,null,null,null,null,null,null,{"$f":"C11+E11+G11","v":0}]
["DORKELD Didier","Sur Engin Chargement client",2,"210258 Travaux divers sans engins",6,null,null,{"$f":"C12+E12+G12","v":8}]
["HOLTZ Mathieu","Sur Engin Destockage",4,"Install secondaire  210256",4,null,null,{"$f":"C13+E13+G13","v":8}]
["LEBRUN Martial","Bascule 200200",8,null,null,null,null,8]
[null,null,null,null,null,null,null,0]
[null,null,null,null,null,null,null,0]
[null,null,null,null,null,null,null,{"$f":"C17+E17+G17","v":0}]
[null,null,null,null,null,null,null,{"$f":"C18+E18+G18","v":0}]
[null,null,null,null,null,null,null,{"$f":"C19+E19+G19","v":0}]
[null,null,null,null,null,null,null,0]
[null,null,null,null,null,null,null,0]
[null,null,null,null,null,null,null,0]
[]
["POINTAGE MATERIEL"]
[]
["ENGINS DE PRODUCTION"]
["TYPE","AFFECTATION HORAIRE",null,null,null,null,null,"TOTAL\n HORAIRE JOUR","GNR","HORAMETRE \nMATIN","HORAMETRE \nSOIR","CONTRÔLE"]
["Chargeur L566 - D3101014","CHARGEMENT CLIENT /200200",2,null,null,null,null,{"$f":"C28+E28+G28","v":2},null,"16750","16752",{"$f":"IF(K28-J28=H28,\"OK\",\"FAUX\")","v":"OK"}]
["Chargeur 966G - D3102742","DESTOCKAGE/200308",4,null,null,null,null,{"$f":"C29+E29+G29","v":4},null,"2400","2404",{"$f":"IF(K29-J29=H29,\"OK\",\"FAUX\")","v":"OK"}]
["CAMION MERCEDES OSSELLE-P2100552",null,null,null,null,null,null,0,null,null,null,"OK"]
[null,null,null,null,null,null,null,0,null,null,null,"OK"]
[null,null,null,null,null,null,null,0,null,null,null,"OK"]
[null,null,null,null,null,null,null,0,null,null,null,"OK"]
[]
["VEHICULES DE LIAISON","HORAMETRE MATIN","SOIR","GNR","HEURE\n FONTIONNEMENT"]
["Minipelle SV17 - oss - D1002929","2291","2291",null,{"$f":"C36-B36","v":0}]
["Manitou M30 - C8100689","7139","7139",null,{"$f":"C37-B37","v":0}]
[null,null,null,null,0]
[]
[]
["RAPPORT DE PRODUCTION "]
[]
[null,"COMPTEUR HORAIRE","H/FONCT"]
["PRIMAIRE (Production Plaine)"]
["SECONDAIRE (Production Bascule  Tunnel)",11941,2]
["TERTIAIRE (frabrication concassée)"]
["BIG BAG"]
["Compteur d'eau"]
[]
[]
[null,null,null,null,"BIG BAG"]
["PRIMAIRE",null,null,"SECONDAIRE",null,null,"TERTIAIRE"]
["ALIMENTATION","Tout venant Brut",135,"FABRICATION","0/4SCL",null,"CONCASSES","0/2C"]
["Plaine","Tout venant Brut",null,"FABRICATION","M0/16",null,"CONCASSES","2/4C"]
["T120","Tout venant écreté",{"$f":"C54*0.95","v":0},"FABRICATION","M0/8",null,"CONCASSES","4/6C"]
["Débit mesuré en T/h","GRANULOMETRIE","TONNAGES",null,"GRANULOMETRIE","TONNAGES","CONCASSES","4/10C"]
[50,"04 NATUREL",{"$f":"C53*D57","v":29.7},0.22,"SABLE 0/4R",{"$f":"C57-(F53*'GNR ET ELEMENTS DE PROD'!L10)-('6'!F54*'GNR ET ELEMENTS DE PROD'!L7)","v":29.7},"CONCASSES","6/10C"]
[36,"4/8R",{"$f":"C53*D58","v":21.6},0.16,"4/8R",{"$f":"C58","v":21.6},"CONCASSES"]
[42,"8/16R",{"$f":"C53*D59","v":24.3},0.18,"8/16R",{"$f":"C59-F54*'GNR ET ELEMENTS DE PROD'!N7","v":24.3},"CONCASSES"]
[32,"11/22R",{"$f":"C53*D60","v":18.900000000000002},0.14000000000000001,"11/22R",{"$f":"C60","v":18.900000000000002},"CONCASSES","0/4C",{"$f":"-F54*'GNR ET ELEMENTS DE PROD'!K7-F53*'GNR ET ELEMENTS DE PROD'!K10","v":0},null,null,null,null,""]
[68,"22/80",{"$f":"C53*D61","v":40.5},0.3,"22/80",{"$f":"C63-I55-I5-ABS(I57)","v":0},"CONCASSES","6,3/10",{"$f":"+-'GNR ET ELEMENTS DE PROD'!M7*F54","v":0},null,null,null,null,""]
[{"$f":"SUM(A57:B61)","v":228},null,{"$f":"SUM(C57:C61)","v":135},null,null,{"$f":"SUM(F57:F61)","v":94.5},null,null,{"$f":"SUM(I53:I61)","v":0},null,null,null,null,""]
[]
["ACHATS"]
[]
[]
[null,null,null,null,null,null,null,null,null,null,null,null,null,""]
["ARRETS",null,null,null,null,null,null,null,null,null,null,null,null,""]
["Horamètre","CIRCUIT","MACHINE","CAUSE","DUREE (en mn)",null,null,"COMMENTAIRES",null,null,null,null,null,""]
[null,null,null,null,"Panne","Entretien","AUTRE",null,null,null,null,null,null,""]
[null,null,null,null,null,null,null,null,null,null,null,null,null,""]
[null,null,null,null,null,null,null,null,null,null,null,null,null,""]
[null,null,null,null,null,null,null,null,null,null,null,null,null,""]
[]
[]
[]
[]
["Observations\n  (pour garder une trace d'un fait particulier)"]

{"sheet":"7","index":8,"n_rows":78,"n_cols":14,"rows_kept":78,"cut":false,"hidden":false,"merged":[[0,0,0,11],[26,1,26,6],[51,0,51,2],[51,3,51,5],[51,6,51,8]]}
["RAPPORT JOURNALIER"]
[]
["DATE :","2020-10-07"]
["EXPLOITATION DE:","Osselle",null,"RESPONSABLE",null,"METEO"]
[null,null,null,"Denis MARESCOT",null,"Humide"]
[]
[null,null,null,"H DE PRODUCTIONS PREVUES",8]
["POINTAGE PERSONNEL"]
[]
["NOM PRENOM","AFFECTATION","Nombre\nd'heure","AFFECTATION","Nombre\nd'heure","AFFECTATION","Nombre\nd'heure","TOTAL HORAIRE JOUR"]
[null,null,null,null,null,null,null,{"$f":"C11+E11+G11","v":0}]
["DORKELD Didier","Sur Engin Chargement client",2,"210258 Travaux divers sans engins",6,null,null,{"$f":"C12+E12+G12","v":8}]
["HOLTZ Mathieu","Sur Engin Travaux divers site",2,"210258 Travaux divers sans engins",6,null,null,{"$f":"C13+E13+G13","v":8}]
["LEBRUN Martial","Bascule 200200",8,null,null,null,null,8]
[null,null,null,null,null,null,null,0]
[null,null,null,null,null,null,null,0]
[null,null,null,null,null,null,null,{"$f":"C17+E17+G17","v":0}]
[null,null,null,null,null,null,null,{"$f":"C18+E18+G18","v":0}]
[null,null,null,null,null,null,null,{"$f":"C19+E19+G19","v":0}]
[null,null,null,null,null,null,null,0]
[null,null,null,null,null,null,null,0]
[null,null,null,null,null,null,null,0]
[]
["POINTAGE MATERIEL"]
[]
["ENGINS DE PRODUCTION"]
["TYPE","AFFECTATION HORAIRE",null,null,null,null,null,"TOTAL\n HORAIRE JOUR","GNR","HORAMETRE \nMATIN","HORAMETRE \nSOIR","CONTRÔLE"]
["Chargeur L566 - D3101014","TRAVAUX DIVERS SUR PISTE 200950",2,null,null,null,null,{"$f":"C28+E28+G28","v":2},100,"16752","16754",{"$f":"IF(K28-J28=H28,\"OK\",\"FAUX\")","v":"OK"}]
["Chargeur 966G - D3102742","TRAVAUX DECH/210402",2,null,null,null,null,{"$f":"C29+E29+G29","v":2},150,"2404","2406",{"$f":"IF(K29-J29=H29,\"OK\",\"FAUX\")","v":"OK"}]
["CAMION MERCEDES OSSELLE-P2100552",null,null,null,null,null,null,0,null,null,null,"OK"]
[null,null,null,null,null,null,null,0,null,null,null,"OK"]
[null,null,null,null,null,null,null,0,null,null,null,"OK"]
[null,null,null,null,null,null,null,0,null,null,null,"OK"]
[]
["VEHICULES DE LIAISON","HORAMETRE MATIN","SOIR","GNR","HEURE\n FONTIONNEMENT"]
["Minipelle SV17 - oss - D1002929","2291","2291",null,{"$f":"C36-B36","v":0}]
["Manitou M30 - C8100689","7139","7141",null,{"$f":"C37-B37","v":2}]
[null,null,null,null,0]
[]
[]
["RAPPORT DE PRODUCTION "]
[]
[null,"COMPTEUR HORAIRE","H/FONCT"]
["PRIMAIRE (Production Plaine)"]
["SECONDAIRE (Production Bascule  Tunnel)"]
["TERTIAIRE (frabrication concassée)"]
["BIG BAG"]
["Compteur d'eau"]
[]
[]
[null,null,null,null,"BIG BAG"]
["PRIMAIRE",null,null,"SECONDAIRE",null,null,"TERTIAIRE"]
["ALIMENTATION","Tout venant Brut",null,"FABRICATION","0/4SCL",null,"CONCASSES","0/2C"]
["Plaine","Tout venant Brut",null,"FABRICATION","M0/16",null,"CONCASSES","2/4C"]
["T120","Tout venant écreté",{"$f":"C54*0.95","v":0},"FABRICATION","M0/8",null,"CONCASSES","4/6C"]
["Débit mesuré en T/h","GRANULOMETRIE","TONNAGES",null,"GRANULOMETRIE","TONNAGES","CONCASSES","4/10C"]
[50,"04 NATUREL",{"$f":"C53*D57","v":0},0.22,"SABLE 0/4R",{"$f":"C57-(F53*'GNR ET ELEMENTS DE PROD'!L10)-('7'!F54*'GNR ET ELEMENTS DE PROD'!L7)","v":0},"CONCASSES","6/10C"]
[36,"4/8R",{"$f":"C53*D58","v":0},0.16,"4/8R",{"$f":"C58","v":0},"CONCASSES","22/80",57.62]
[42,"8/16R",{"$f":"C53*D59","v":0},0.18,"8/16R",{"$f":"C59-F54*'GNR ET ELEMENTS DE PROD'!N7","v":0},"CONCASSES","0/4C",29.82]
[32,"11/22R",{"$f":"C53*D60","v":0},0.14000000000000001,"11/22R",{"$f":"C60","v":0},"CONCASSES","0/4C",{"$f":"-F54*'GNR ET ELEMENTS DE PROD'!K7-F53*'GNR ET ELEMENTS DE PROD'!K10","v":0},null,null,null,null,""]
[68,"22/80",{"$f":"C53*D61","v":0},0.3,"22/80",{"$f":"C63-I55-I5-ABS(I57)","v":0},"CONCASSES","6,3/10",{"$f":"+-'GNR ET ELEMENTS DE PROD'!M7*F54","v":0},null,null,null,null,""]
[{"$f":"SUM(A57:B61)","v":228},null,{"$f":"SUM(C57:C61)","v":0},null,null,{"$f":"SUM(F57:F61)","v":0},null,null,{"$f":"SUM(I53:I61)","v":87.44},null,null,null,null,""]
[]
["ACHATS"]
[]
[]
[null,null,null,null,null,null,null,null,null,null,null,null,null,""]
["ARRETS",null,null,null,null,null,null,null,null,null,null,null,null,""]
["Horamètre","CIRCUIT","MACHINE","CAUSE","DUREE (en mn)",null,null,"COMMENTAIRES",null,null,null,null,null,""]
[null,null,null,null,"Panne","Entretien","AUTRE",null,null,null,null,null,null,""]
[null,null,null,null,null,null,null,null,null,null,null,null,null,""]
[null,null,null,null,null,null,null,null,null,null,null,null,null,""]
[null,null,null,null,null,null,null,null,null,null,null,null,null,""]
[]
[]
[]
[]
["Observations\n  (pour garder une trace d'un fait particulier)"]

{"sheet":"8","index":9,"n_rows":78,"n_cols":14,"rows_kept":78,"cut":false,"hidden":false,"merged":[[0,0,0,11],[26,1,26,6],[51,0,51,2],[51,3,51,5],[51,6,51,8]]}
["RAPPORT JOURNALIER"]
[]
["DATE :","2020-10-08"]
["EXPLOITATION DE:","Osselle",null,"RESPONSABLE",null,"METEO"]
[null,null,null,"Denis MARESCOT",null,"Humide"]
[]
[null,null,null,"H DE PRODUCTIONS PREVUES",8]
["POINTAGE PERSONNEL"]
[]
["NOM PRENOM","AFFECTATION","Nombre\nd'heure","AFFECTATION","Nombre\nd'heure","AFFECTATION","Nombre\nd'heure","TOTAL HORAIRE JOUR"]
["CRETIN Brigitte",null,null,null,null,null,null,{"$f":"C11+E11+G11","v":0}]
["DORKELD Didier","Sur Engin Chargement client",2,"210258 Travaux divers sans engins",6,null,null,{"$f":"C12+E12+G12","v":8}]
["HOLTZ Mathieu","Sur Engin Destockage",5,"Install secondaire  210256",3,null,null,{"$f":"C13+E13+G13","v":8}]
["LEBRUN Martial","Bascule 200200",8,null,null,null,null,8]
[null,null,null,null,null,null,null,0]
[null,null,null,null,null,null,null,0]
[null,null,null,null,null,null,null,{"$f":"C17+E17+G17","v":0}]
[null,null,null,null,null,null,null,{"$f":"C18+E18+G18","v":0}]
[null,null,null,null,null,null,null,{"$f":"C19+E19+G19","v":0}]
[null,null,null,null,null,null,null,0]
[null,null,null,null,null,null,null,0]
[null,null,null,null,null,null,null,0]
[]
["POINTAGE MATERIEL"]
[]
["ENGINS DE PRODUCTION"]
["TYPE","AFFECTATION HORAIRE",null,null,null,null,null,"TOTAL\n HORAIRE JOUR","GNR","HORAMETRE \nMATIN","HORAMETRE \nSOIR","CONTRÔLE"]
["Chargeur L566 - D3101014","CHARGEMENT CLIENT /200200",2,null,null,null,null,{"$f":"C28+E28+G28","v":2},null,"16754","16756",{"$f":"IF(K28-J28=H28,\"OK\",\"FAUX\")","v":"OK"}]
["Chargeur 966G - D3102742","DESTOCKAGE/200308",5,null,null,null,null,{"$f":"C29+E29+G29","v":5},null,"2406","2411",{"$f":"IF(K29-J29=H29,\"OK\",\"FAUX\")","v":"OK"}]
["CAMION MERCEDES OSSELLE-P2100552",null,null,null,null,null,null,0,null,null,null,"OK"]
[null,null,null,null,null,null,null,0,null,null,null,"OK"]
[null,null,null,null,null,null,null,0,null,null,null,"OK"]
[null,null,null,null,null,null,null,0,null,null,null,"OK"]
[]
["VEHICULES DE LIAISON","HORAMETRE MATIN","SOIR","GNR","HEURE\n FONTIONNEMENT"]
["Minipelle SV17 - oss - D1002929","2291","2291",null,{"$f":"C36-B36","v":0}]
["Manitou M30 - C8100689","7141","7141",null,{"$f":"C37-B37","v":0}]
[null,null,null,null,0]
[]
[]
["RAPPORT DE PRODUCTION "]
[]
[null,"COMPTEUR HORAIRE","H/FONCT"]
["PRIMAIRE (Production Plaine)"]
["SECONDAIRE (Production Bascule  Tunnel)"]
["TERTIAIRE (frabrication concassée)"]
["BIG BAG"]
["Compteur d'eau"]
[]
[]
[null,null,null,null,"BIG BAG"]
["PRIMAIRE",null,null,"SECONDAIRE",null,null,"TERTIAIRE"]
["ALIMENTATION","Tout venant Brut",null,"FABRICATION","0/4SCL",null,"CONCASSES","0/2C"]
["Plaine","Tout venant Brut",null,"FABRICATION","M0/16",null,"CONCASSES","2/4C"]
["T120","Tout venant écreté",{"$f":"C54*0.95","v":0},"FABRICATION","M0/8",null,"CONCASSES","4/6C"]
["Débit mesuré en T/h","GRANULOMETRIE","TONNAGES",null,"GRANULOMETRIE","TONNAGES","CONCASSES","4/10C",266.24]
[50,"04 NATUREL",{"$f":"C53*D57","v":0},0.22,"SABLE 0/4R",{"$f":"C57-(F53*'GNR ET ELEMENTS DE PROD'!L10)-('8'!F54*'GNR ET ELEMENTS DE PROD'!L7)","v":0},"CONCASSES","6/10C"]
[36,"4/8R",{"$f":"C53*D58","v":0},0.16,"4/8R",{"$f":"C58","v":0},"CONCASSES",null,428.28]
[42,"8/16R",{"$f":"C53*D59","v":0},0.18,"8/16R",{"$f":"C59-F54*'GNR ET ELEMENTS DE PROD'!N7","v":0},"CONCASSES",null,109.38]
[32,"11/22R",{"$f":"C53*D60","v":0},0.14000000000000001,"11/22R",{"$f":"C60","v":0},"CONCASSES","0/4C",{"$f":"-F54*'GNR ET ELEMENTS DE PROD'!K7-F53*'GNR ET ELEMENTS DE PROD'!K10","v":0},null,null,null,null,""]
[68,"22/80",{"$f":"C53*D61","v":0},0.3,"22/80",{"$f":"C63-I55-I5-ABS(I57)","v":0},"CONCASSES","6,3/10",{"$f":"+-'GNR ET ELEMENTS DE PROD'!M7*F54","v":0},null,null,null,null,""]
[{"$f":"SUM(A57:B61)","v":228},null,{"$f":"SUM(C57:C61)","v":0},null,null,{"$f":"SUM(F57:F61)","v":0},null,null,{"$f":"SUM(I53:I61)","v":803.9},null,null,null,null,""]
[]
["ACHATS"]
[]
[]
[null,null,null,null,null,null,null,null,null,null,null,null,null,""]
["ARRETS",null,null,null,null,null,null,null,null,null,null,null,null,""]
["Horamètre","CIRCUIT","MACHINE","CAUSE","DUREE (en mn)",null,null,"COMMENTAIRES",null,null,null,null,null,""]
[null,null,null,null,"Panne","Entretien","AUTRE",null,null,null,null,null,null,""]
[null,null,null,null,null,null,null,null,null,null,null,null,null,""]
[null,null,null,null,null,null,null,null,null,null,null,null,null,""]
[null,null,null,null,null,null,null,null,null,null,null,null,null,""]
[]
[]
[]
[]
["Observations\n  (pour garder une trace d'un fait particulier)"]

{"sheet":"9","index":10,"n_rows":78,"n_cols":14,"rows_kept":78,"cut":false,"hidden":false,"merged":[[0,0,0,11],[26,1,26,6],[51,0,51,2],[51,3,51,5],[51,6,51,8]]}
["RAPPORT JOURNALIER"]
[]
["DATE :","2020-10-09"]
["EXPLOITATION DE:","Osselle",null,"RESPONSABLE",null,"METEO"]
[null,null,null,"Denis MARESCOT"]
[]
[null,null,null,"H DE PRODUCTIONS PREVUES",7]
["POINTAGE PERSONNEL"]
[]
["NOM PRENOM","AFFECTATION","Nombre\nd'heure","AFFECTATION","Nombre\nd'heure","AFFECTATION","Nombre\nd'heure","TOTAL HORAIRE JOUR"]
["CRETIN Brigitte",null,null,null,null,null,null,{"$f":"C11+E11+G11","v":0}]
["DORKELD Didier","210258 Travaux divers sans engins",3,"Sur Engin Chargement client",3,"Sur Engin Travaux divers site",1,{"$f":"C12+E12+G12","v":7}]
["HOLTZ Mathieu","Install secondaire  210256",3.5,"Sur Engin Destockage",3.5,null,null,{"$f":"C13+E13+G13","v":7}]
["LEBRUN Martial","Bascule 200200",7,null,null,null,null,7]
[null,null,null,null,null,null,null,0]
[null,null,null,null,null,null,null,0]
[null,null,null,null,null,null,null,{"$f":"C17+E17+G17","v":0}]
[null,null,null,null,null,null,null,{"$f":"C18+E18+G18","v":0}]
[null,null,null,null,null,null,null,{"$f":"C19+E19+G19","v":0}]
[null,null,null,null,null,null,null,0]
[null,null,null,null,null,null,null,0]
[null,null,null,null,null,null,null,0]
[]
["POINTAGE MATERIEL"]
[]
["ENGINS DE PRODUCTION"]
["TYPE","AFFECTATION HORAIRE",null,null,null,null,null,"TOTAL\n HORAIRE JOUR","GNR","HORAMETRE \nMATIN","HORAMETRE \nSOIR","CONTRÔLE"]
["Chargeur L566 - D3101014","TRAVAUX DIVERS SUR PISTE 200950",1,"CHARGEMENT CLIENT /200200",3,null,null,{"$f":"C28+E28+G28","v":4},null,"16756","16760",{"$f":"IF(K28-J28=H28,\"OK\",\"FAUX\")","v":"OK"}]
["Chargeur 966G - D3102742","TRAVAUX DIVERS SUR PISTE 200950",1,"DESTOCKAGE/200308",4,null,null,{"$f":"C29+E29+G29","v":5},150,"2411","2416",{"$f":"IF(K29-J29=H29,\"OK\",\"FAUX\")","v":"OK"}]
["CAMION MERCEDES OSSELLE-P2100552",null,null,null,null,null,null,0,null,null,null,"OK"]
[null,null,null,null,null,null,null,0,null,null,null,"OK"]
[null,null,null,null,null,null,null,0,null,null,null,"OK"]
[null,null,null,null,null,null,null,0,null,null,null,"OK"]
[]
["VEHICULES DE LIAISON","HORAMETRE MATIN","SOIR","GNR","HEURE\n FONTIONNEMENT"]
["Minipelle SV17 - oss - D1002929","2291","2291",null,{"$f":"C36-B36","v":0}]
["Manitou M30 - C8100689","7141","7141",null,{"$f":"C37-B37","v":0}]
[null,null,null,null,0]
[]
[]
["RAPPORT DE PRODUCTION "]
[]
[null,"COMPTEUR HORAIRE","H/FONCT"]
["PRIMAIRE (Production Plaine)"]
["SECONDAIRE (Production Bascule  Tunnel)",11846,7]
["TERTIAIRE (frabrication concassée)"]
["BIG BAG"]
["Compteur d'eau"]
[]
[]
[null,null,null,null,"BIG BAG"]
["PRIMAIRE",null,null,"SECONDAIRE",null,null,"TERTIAIRE"]
["ALIMENTATION","Tout venant Brut",381,"FABRICATION","0/4SCL",null,"CONCASSES","0/2C"]
["Plaine","Tout venant Brut",null,"FABRICATION","M0/16",null,"CONCASSES","2/4C"]
["T120","Tout venant écreté",{"$f":"C54*0.95","v":0},"FABRICATION","M0/8",null,"CONCASSES","4/6C"]
["Débit mesuré en T/h","GRANULOMETRIE","TONNAGES",null,"GRANULOMETRIE","TONNAGES","CONCASSES","4/10C",181.86]
[50,"04 NATUREL",{"$f":"C53*D57","v":83.820000000000007},0.22,"SABLE 0/4R",{"$f":"C57-(F53*'GNR ET ELEMENTS DE PROD'!L10)-('9'!F54*'GNR ET ELEMENTS DE PROD'!L7)","v":83.820000000000007},"CONCASSES","6/10C"]
[36,"4/8R",{"$f":"C53*D58","v":60.96},0.16,"4/8R",{"$f":"C58","v":60.96},"CONCASSES","22/80",381.54]
[42,"8/16R",{"$f":"C53*D59","v":68.58},0.18,"8/16R",{"$f":"C59-F54*'GNR ET ELEMENTS DE PROD'!N7","v":68.58},"CONCASSES","0/4C",234.84]
[32,"11/22R",{"$f":"C53*D60","v":53.34},0.14000000000000001,"11/22R",{"$f":"C60","v":53.34},"CONCASSES","0/4C",{"$f":"-F54*'GNR ET ELEMENTS DE PROD'!K7-F53*'GNR ET ELEMENTS DE PROD'!K10","v":0},null,null,null,null,""]
[68,"22/80",{"$f":"C53*D61","v":114.3},0.3,"22/80",{"$f":"C63-I55-I5-ABS(I57)","v":0},"CONCASSES","6,3/10",{"$f":"+-'GNR ET ELEMENTS DE PROD'!M7*F54","v":0},null,null,null,null,""]
[{"$f":"SUM(A57:B61)","v":228},null,{"$f":"SUM(C57:C61)","v":381.00000000000006},null,null,{"$f":"SUM(F57:F61)","v":266.70000000000005},null,null,{"$f":"SUM(I53:I61)","v":798.24000000000012},null,null,null,null,""]
[]
["ACHATS"]
[]
[]
[null,null,null,null,null,null,null,null,null,null,null,null,null,""]
["ARRETS",null,null,null,null,null,null,null,null,null,null,null,null,""]
["Horamètre","CIRCUIT","MACHINE","CAUSE","DUREE (en mn)",null,null,"COMMENTAIRES",null,null,null,null,null,""]
[null,null,null,null,"Panne","Entretien","AUTRE",null,null,null,null,null,null,""]
[null,null,null,null,null,null,null,null,null,null,null,null,null,""]
[null,null,null,null,null,null,null,null,null,null,null,null,null,""]
[null,null,null,null,null,null,null,null,null,null,null,null,null,""]
[]
[]
[]
[]
["Observations\n  (pour garder une trace d'un fait particulier)"]

{"sheet":"10","index":11,"n_rows":78,"n_cols":14,"rows_kept":78,"cut":false,"hidden":false,"merged":[[0,0,0,11],[26,1,26,6],[51,0,51,2],[51,3,51,5],[51,6,51,8]]}
["RAPPORT JOURNALIER"]
[]
["DATE :"]
["EXPLOITATION DE:",null,null,"RESPONSABLE",null,"METEO"]
[]
[]
[null,null,null,"H DE PRODUCTIONS PREVUES"]
["POINTAGE PERSONNEL"]
[]
["NOM PRENOM","AFFECTATION","Nombre\nd'heure","AFFECTATION","Nombre\nd'heure","AFFECTATION","Nombre\nd'heure","TOTAL HORAIRE JOUR"]
[null,null,null,null,null,null,null,{"$f":"C11+E11+G11","v":0}]
[null,null,null,null,null,null,null,{"$f":"C12+E12+G12","v":0}]
[null,null,null,null,null,null,null,{"$f":"C13+E13+G13","v":0}]
[null,null,null,null,null,null,null,0]
[null,null,null,null,null,null,null,0]
[null,null,null,null,null,null,null,0]
[null,null,null,null,null,null,null,{"$f":"C17+E17+G17","v":0}]
[null,null,null,null,null,null,null,{"$f":"C18+E18+G18","v":0}]
[null,null,null,null,null,null,null,{"$f":"C19+E19+G19","v":0}]
[null,null,null,null,null,null,null,0]
[null,null,null,null,null,null,null,0]
[null,null,null,null,null,null,null,0]
[]
["POINTAGE MATERIEL"]
[]
["ENGINS DE PRODUCTION"]
["TYPE","AFFECTATION HORAIRE",null,null,null,null,null,"TOTAL\n HORAIRE JOUR","GNR","HORAMETRE \nMATIN","HORAMETRE \nSOIR","CONTRÔLE"]
[null,null,null,null,null,null,null,{"$f":"C28+E28+G28","v":0},null,null,null,{"$f":"IF(K28-J28=H28,\"OK\",\"FAUX\")","v":"OK"}]
[null,null,null,null,null,null,null,{"$f":"C29+E29+G29","v":0},null,null,null,{"$f":"IF(K29-J29=H29,\"OK\",\"FAUX\")","v":"OK"}]
[null,null,null,null,null,null,null,0,null,null,null,"OK"]
[null,null,null,null,null,null,null,0,null,null,null,"OK"]
[null,null,null,null,null,null,null,0,null,null,null,"OK"]
[null,null,null,null,null,null,null,0,null,null,null,"OK"]
[]
["VEHICULES DE LIAISON","HORAMETRE MATIN","SOIR","GNR","HEURE\n FONTIONNEMENT"]
[null,null,null,null,{"$f":"C36-B36","v":0}]
[null,null,null,null,{"$f":"C37-B37","v":0}]
[null,null,null,null,0]
[]
[]
["RAPPORT DE PRODUCTION "]
[]
[null,"COMPTEUR HORAIRE","H/FONCT"]
["PRIMAIRE (Production Plaine)"]
["SECONDAIRE (Production Bascule  Tunnel)"]
["TERTIAIRE (frabrication concassée)"]
["BIG BAG"]
["Compteur d'eau"]
[]
[]
[null,null,null,null,"BIG BAG"]
["PRIMAIRE",null,null,"SECONDAIRE",null,null,"TERTIAIRE"]
["ALIMENTATION","Tout venant Brut",null,"FABRICATION","0/4SCL",null,"CONCASSES","0/2C"]
["Plaine","Tout venant Brut",null,"FABRICATION","M0/16",null,"CONCASSES","2/4C"]
["T120","Tout venant écreté",{"$f":"C54*0.95","v":0},"FABRICATION","M0/8",null,"CONCASSES","4/6C"]
["Débit mesuré en T/h","GRANULOMETRIE","TONNAGES",null,"GRANULOMETRIE","TONNAGES","CONCASSES","4/10C"]
[50,"04 NATUREL",{"$f":"C53*D57","v":0},0.22,"SABLE 0/4R",{"$f":"C57-(F53*'GNR ET ELEMENTS DE PROD'!L10)-('10'!F54*'GNR ET ELEMENTS DE PROD'!L7)","v":0},"CONCASSES","6/10C"]
[36,"4/8R",{"$f":"C53*D58","v":0},0.16,"4/8R",{"$f":"C58","v":0},"CONCASSES"]
[42,"8/16R",{"$f":"C53*D59","v":0},0.18,"8/16R",{"$f":"C59-F54*'GNR ET ELEMENTS DE PROD'!N7","v":0},"CONCASSES"]
[32,"11/22R",{"$f":"C53*D60","v":0},0.14000000000000001,"11/22R",{"$f":"C60","v":0},"CONCASSES","0/4C",{"$f":"-F54*'GNR ET ELEMENTS DE PROD'!K7-F53*'GNR ET ELEMENTS DE PROD'!K10","v":0},null,null,null,null,""]
[68,"22/80",{"$f":"C53*D61","v":0},0.3,"22/80",{"$f":"C63-I55-I5-ABS(I57)","v":0},"CONCASSES","6,3/10",{"$f":"+-'GNR ET ELEMENTS DE PROD'!M7*F54","v":0},null,null,null,null,""]
[{"$f":"SUM(A57:B61)","v":228},null,{"$f":"SUM(C57:C61)","v":0},null,null,{"$f":"SUM(F57:F61)","v":0},null,null,{"$f":"SUM(I53:I61)","v":0},null,null,null,null,""]
[]
["ACHATS"]
[]
[]
[null,null,null,null,null,null,null,null,null,null,null,null,null,""]
["ARRETS",null,null,null,null,null,null,null,null,null,null,null,null,""]
["Horamètre","CIRCUIT","MACHINE","CAUSE","DUREE (en mn)",null,null,"COMMENTAIRES",null,null,null,null,null,""]
[null,null,null,null,"Panne","Entretien","AUTRE",null,null,null,null,null,null,""]
[null,null,null,null,null,null,null,null,null,null,null,null,null,""]
[null,null,null,null,null,null,null,null,null,null,null,null,null,""]
[null,null,null,null,null,null,null,null,null,null,null,null,null,""]
[]
[]
[]
[]
["Observations\n  (pour garder une trace d'un fait particulier)"]

{"sheet":"11","index":12,"n_rows":78,"n_cols":14,"rows_kept":78,"cut":false,"hidden":false,"merged":[[0,0,0,11],[26,1,26,6],[51,0,51,2],[51,3,51,5],[51,6,51,8]]}
["RAPPORT JOURNALIER"]
[]
["DATE :"]
["EXPLOITATION DE:",null,null,"RESPONSABLE",null,"METEO"]
[]
[]
[null,null,null,"H DE PRODUCTIONS PREVUES"]
["POINTAGE PERSONNEL"]
[]
["NOM PRENOM","AFFECTATION","Nombre\nd'heure","AFFECTATION","Nombre\nd'heure","AFFECTATION","Nombre\nd'heure","TOTAL HORAIRE JOUR"]
[null,null,null,null,null,null,null,{"$f":"C11+E11+G11","v":0}]
[null,null,null,null,null,null,null,{"$f":"C12+E12+G12","v":0}]
[null,null,null,null,null,null,null,{"$f":"C13+E13+G13","v":0}]
[null,null,null,null,null,null,null,0]
[null,null,null,null,null,null,null,0]
[null,null,null,null,null,null,null,0]
[null,null,null,null,null,null,null,{"$f":"C17+E17+G17","v":0}]
[null,null,null,null,null,null,null,{"$f":"C18+E18+G18","v":0}]
[null,null,null,null,null,null,null,{"$f":"C19+E19+G19","v":0}]
[null,null,null,null,null,null,null,0]
[null,null,null,null,null,null,null,0]
[null,null,null,null,null,null,null,0]
[]
["POINTAGE MATERIEL"]
[]
["ENGINS DE PRODUCTION"]
["TYPE","AFFECTATION HORAIRE",null,null,null,null,null,"TOTAL\n HORAIRE JOUR","GNR","HORAMETRE \nMATIN","HORAMETRE \nSOIR","CONTRÔLE"]
[null,null,null,null,null,null,null,{"$f":"C28+E28+G28","v":0},null,null,null,{"$f":"IF(K28-J28=H28,\"OK\",\"FAUX\")","v":"OK"}]
[null,null,null,null,null,null,null,{"$f":"C29+E29+G29","v":0},null,null,null,{"$f":"IF(K29-J29=H29,\"OK\",\"FAUX\")","v":"OK"}]
[null,null,null,null,null,null,null,0,null,null,null,"OK"]
[null,null,null,null,null,null,null,0,null,null,null,"OK"]
[null,null,null,null,null,null,null,0,null,null,null,"OK"]
[null,null,null,null,null,null,null,0,null,null,null,"OK"]
[]
["VEHICULES DE LIAISON","HORAMETRE MATIN","SOIR","GNR","HEURE\n FONTIONNEMENT"]
[null,null,null,null,{"$f":"C36-B36","v":0}]
[null,null,null,null,{"$f":"C37-B37","v":0}]
[null,null,null,null,0]
[]
[]
["RAPPORT DE PRODUCTION "]
[]
[null,"COMPTEUR HORAIRE","H/FONCT"]
["PRIMAIRE (Production Plaine)"]
["SECONDAIRE (Production Bascule  Tunnel)"]
["TERTIAIRE (frabrication concassée)"]
["BIG BAG"]
["Compteur d'eau"]
[]
[]
[null,null,null,null,"BIG BAG"]
["PRIMAIRE",null,null,"SECONDAIRE",null,null,"TERTIAIRE"]
["ALIMENTATION","Tout venant Brut",null,"FABRICATION","0/4SCL",null,"CONCASSES","0/2C"]
["Plaine","Tout venant Brut",null,"FABRICATION","M0/16",null,"CONCASSES","2/4C"]
["T120","Tout venant écreté",{"$f":"C54*0.95","v":0},"FABRICATION","M0/8",null,"CONCASSES","4/6C"]
["Débit mesuré en T/h","GRANULOMETRIE","TONNAGES",null,"GRANULOMETRIE","TONNAGES","CONCASSES","4/10C"]
[50,"04 NATUREL",{"$f":"C53*D57","v":0},0.22,"SABLE 0/4R",{"$f":"C57-(F53*'GNR ET ELEMENTS DE PROD'!L10)-('11'!F54*'GNR ET ELEMENTS DE PROD'!L7)","v":0},"CONCASSES","6/10C"]
[36,"4/8R",{"$f":"C53*D58","v":0},0.16,"4/8R",{"$f":"C58","v":0},"CONCASSES"]
[42,"8/16R",{"$f":"C53*D59","v":0},0.18,"8/16R",{"$f":"C59-F54*'GNR ET ELEMENTS DE PROD'!N7","v":0},"CONCASSES"]
[32,"11/22R",{"$f":"C53*D60","v":0},0.14000000000000001,"11/22R",{"$f":"C60","v":0},"CONCASSES","0/4C",{"$f":"-F54*'GNR ET ELEMENTS DE PROD'!K7-F53*'GNR ET ELEMENTS DE PROD'!K10","v":0},null,null,null,null,""]
[68,"22/80",{"$f":"C53*D61","v":0},0.3,"22/80",{"$f":"C63-I55-I5-ABS(I57)","v":0},"CONCASSES","6,3/10",{"$f":"+-'GNR ET ELEMENTS DE PROD'!M7*F54","v":0},null,null,null,null,""]
[{"$f":"SUM(A57:B61)","v":228},null,{"$f":"SUM(C57:C61)","v":0},null,null,{"$f":"SUM(F57:F61)","v":0},null,null,{"$f":"SUM(I53:I61)","v":0},null,null,null,null,""]
[]
["ACHATS"]
[]
[]
[null,null,null,null,null,null,null,null,null,null,null,null,null,""]
["ARRETS",null,null,null,null,null,null,null,null,null,null,null,null,""]
["Horamètre","CIRCUIT","MACHINE","CAUSE","DUREE (en mn)",null,null,"COMMENTAIRES",null,null,null,null,null,""]
[null,null,null,null,"Panne","Entretien","AUTRE",null,null,null,null,null,null,""]
[null,null,null,null,null,null,null,null,null,null,null,null,null,""]
[null,null,null,null,null,null,null,null,null,null,null,null,null,""]
[null,null,null,null,null,null,null,null,null,null,null,null,null,""]
[]
[]
[]
[]
["Observations\n  (pour garder une trace d'un fait particulier)"]

{"sheet":"12","index":13,"n_rows":78,"n_cols":14,"rows_kept":78,"cut":false,"hidden":false,"merged":[[0,0,0,11],[26,1,26,6],[51,0,51,2],[51,3,51,5],[51,6,51,8]]}
["RAPPORT JOURNALIER"]
[]
["DATE :","2020-10-12"]
["EXPLOITATION DE:","Osselle",null,"RESPONSABLE",null,"METEO"]
[null,null,null,"Denis MARESCOT"]
[]
[null,null,null,"H DE PRODUCTIONS PREVUES",8]
["POINTAGE PERSONNEL"]
[]
["NOM PRENOM","AFFECTATION","Nombre\nd'heure","AFFECTATION","Nombre\nd'heure","AFFECTATION","Nombre\nd'heure","TOTAL HORAIRE JOUR"]
["CRETIN Brigitte","Bascule 200200",8,null,null,null,null,{"$f":"C11+E11+G11","v":8}]
["DORKELD Didier","210258 Travaux divers sans engins",3,"Sur Engin Chargement client",5,null,null,{"$f":"C12+E12+G12","v":8}]
[null,null,null,null,null,null,null,{"$f":"C13+E13+G13","v":0}]
[null,null,null,null,null,null,null,0]
[null,null,null,null,null,null,null,0]
[null,null,null,null,null,null,null,0]
[null,null,null,null,null,null,null,{"$f":"C17+E17+G17","v":0}]
[null,null,null,null,null,null,null,{"$f":"C18+E18+G18","v":0}]
[null,null,null,null,null,null,null,{"$f":"C19+E19+G19","v":0}]
[null,null,null,null,null,null,null,0]
[null,null,null,null,null,null,null,0]
[null,null,null,null,null,null,null,0]
[]
["POINTAGE MATERIEL"]
[]
["ENGINS DE PRODUCTION"]
["TYPE","AFFECTATION HORAIRE",null,null,null,null,null,"TOTAL\n HORAIRE JOUR","GNR","HORAMETRE \nMATIN","HORAMETRE \nSOIR","CONTRÔLE"]
["Chargeur L566 - D3101014","TRAVAUX DIVERS SUR PISTE 200950",3,null,null,null,null,{"$f":"C28+E28+G28","v":3},305,"16760","16763",{"$f":"IF(K28-J28=H28,\"OK\",\"FAUX\")","v":"OK"}]
["Chargeur 966G - D3102742","CHARGEMENT CLIENT /200200",3,null,null,null,null,{"$f":"C29+E29+G29","v":3},null,"2416","2419",{"$f":"IF(K29-J29=H29,\"OK\",\"FAUX\")","v":"OK"}]
["CAMION MERCEDES OSSELLE-P2100552",null,null,null,null,null,null,0,null,null,null,"OK"]
[null,null,null,null,null,null,null,0,null,null,null,"OK"]
[null,null,null,null,null,null,null,0,null,null,null,"OK"]
[null,null,null,null,null,null,null,0,null,null,null,"OK"]
[]
["VEHICULES DE LIAISON","HORAMETRE MATIN","SOIR","GNR","HEURE\n FONTIONNEMENT"]
["Minipelle SV17 - oss - D1002929","2291","2291",null,{"$f":"C36-B36","v":0}]
["Manitou M30 - C8100689","7141","7141",null,{"$f":"C37-B37","v":0}]
[null,null,null,null,0]
[]
[]
["RAPPORT DE PRODUCTION "]
[]
[null,"COMPTEUR HORAIRE","H/FONCT"]
["PRIMAIRE (Production Plaine)"]
["SECONDAIRE (Production Bascule  Tunnel)"]
["TERTIAIRE (frabrication concassée)"]
["BIG BAG"]
["Compteur d'eau"]
[]
[]
[null,null,null,null,"BIG BAG"]
["PRIMAIRE",null,null,"SECONDAIRE",null,null,"TERTIAIRE"]
["ALIMENTATION","Tout venant Brut",null,"FABRICATION","0/4SCL",null,"CONCASSES","0/2C"]
["Plaine","Tout venant Brut",null,"FABRICATION","M0/16",null,"CONCASSES","2/4C"]
["T120","Tout venant écreté",{"$f":"C54*0.95","v":0},"FABRICATION","M0/8",null,"CONCASSES","4/6C"]
["Débit mesuré en T/h","GRANULOMETRIE","TONNAGES",null,"GRANULOMETRIE","TONNAGES","CONCASSES","4/10C"]
[50,"04 NATUREL",{"$f":"C53*D57","v":0},0.22,"SABLE 0/4R",{"$f":"C57-(F53*'GNR ET ELEMENTS DE PROD'!L10)-('12'!F54*'GNR ET ELEMENTS DE PROD'!L7)","v":0},"CONCASSES","6/10C"]
[36,"4/8R",{"$f":"C53*D58","v":0},0.16,"4/8R",{"$f":"C58","v":0},"CONCASSES","22/80",237.08]
[42,"8/16R",{"$f":"C53*D59","v":0},0.18,"8/16R",{"$f":"C59-F54*'GNR ET ELEMENTS DE PROD'!N7","v":0},"CONCASSES","0/4C CHEM",206.48]
[32,"11/22R",{"$f":"C53*D60","v":0},0.14000000000000001,"11/22R",{"$f":"C60","v":0},"CONCASSES","0/4C",{"$f":"-F54*'GNR ET ELEMENTS DE PROD'!K7-F53*'GNR ET ELEMENTS DE PROD'!K10","v":0},null,null,null,null,""]
[68,"22/80",{"$f":"C53*D61","v":0},0.3,"22/80",{"$f":"C63-I55-I5-ABS(I57)","v":0},"CONCASSES","6,3/10",{"$f":"+-'GNR ET ELEMENTS DE PROD'!M7*F54","v":0},null,null,null,null,""]
[{"$f":"SUM(A57:B61)","v":228},null,{"$f":"SUM(C57:C61)","v":0},null,null,{"$f":"SUM(F57:F61)","v":0},null,null,{"$f":"SUM(I53:I61)","v":443.56},null,null,null,null,""]
[]
["ACHATS"]
[]
[]
[null,null,null,null,null,null,null,null,null,null,null,null,null,""]
["ARRETS",null,null,null,null,null,null,null,null,null,null,null,null,""]
["Horamètre","CIRCUIT","MACHINE","CAUSE","DUREE (en mn)",null,null,"COMMENTAIRES",null,null,null,null,null,""]
[null,null,null,null,"Panne","Entretien","AUTRE",null,null,null,null,null,null,""]
[null,null,null,null,null,null,null,null,null,null,null,null,null,""]
[null,null,null,null,null,null,null,null,null,null,null,null,null,""]
[null,null,null,null,null,null,null,null,null,null,null,null,null,""]
[]
[]
[]
[]
["Observations\n  (pour garder une trace d'un fait particulier)"]

{"sheet":"13","index":14,"n_rows":78,"n_cols":14,"rows_kept":78,"cut":false,"hidden":false,"merged":[[0,0,0,11],[26,1,26,6],[51,0,51,2],[51,3,51,5],[51,6,51,8]]}
["RAPPORT JOURNALIER"]
[]
["DATE :","2020-10-13"]
["EXPLOITATION DE:","Osselle",null,"RESPONSABLE",null,"METEO"]
[null,null,null,"Denis MARESCOT"]
[]
[null,null,null,"H DE PRODUCTIONS PREVUES",8]
["POINTAGE PERSONNEL"]
[]
["NOM PRENOM","AFFECTATION","Nombre\nd'heure","AFFECTATION","Nombre\nd'heure","AFFECTATION","Nombre\nd'heure","TOTAL HORAIRE JOUR"]
["CRETIN Brigitte","Bascule 200200",8,null,null,null,null,{"$f":"C11+E11+G11","v":8}]
["DORKELD Didier","210258 Travaux divers sans engins",2,"Sur Engin Chargement client",6,null,null,{"$f":"C12+E12+G12","v":8}]
[null,null,null,null,null,null,null,{"$f":"C13+E13+G13","v":0}]
[null,null,null,null,null,null,null,0]
[null,null,null,null,null,null,null,0]
[null,null,null,null,null,null,null,0]
[null,null,null,null,null,null,null,{"$f":"C17+E17+G17","v":0}]
[null,null,null,null,null,null,null,{"$f":"C18+E18+G18","v":0}]
[null,null,null,null,null,null,null,{"$f":"C19+E19+G19","v":0}]
[null,null,null,null,null,null,null,0]
[null,null,null,null,null,null,null,0]
[null,null,null,null,null,null,null,0]
[]
["POINTAGE MATERIEL"]
[]
["ENGINS DE PRODUCTION"]
["TYPE","AFFECTATION HORAIRE",null,null,null,null,null,"TOTAL\n HORAIRE JOUR","GNR","HORAMETRE \nMATIN","HORAMETRE \nSOIR","CONTRÔLE"]
["Chargeur L566 - D3101014",null,null,null,null,null,null,{"$f":"C28+E28+G28","v":0},null,"16763","16763",{"$f":"IF(K28-J28=H28,\"OK\",\"FAUX\")","v":"OK"}]
["Chargeur 966G - D3102742","CHARGEMENT CLIENT /200200",3,null,null,null,null,{"$f":"C29+E29+G29","v":3},null,"2419","2422",{"$f":"IF(K29-J29=H29,\"OK\",\"FAUX\")","v":"OK"}]
["CAMION MERCEDES OSSELLE-P2100552",null,null,null,null,null,null,0,null,null,null,"OK"]
[null,null,null,null,null,null,null,0,null,null,null,"OK"]
[null,null,null,null,null,null,null,0,null,null,null,"OK"]
[null,null,null,null,null,null,null,0,null,null,null,"OK"]
[]
["VEHICULES DE LIAISON","HORAMETRE MATIN","SOIR","GNR","HEURE\n FONTIONNEMENT"]
["Minipelle SV17 - oss - D1002929","2291","2291",null,{"$f":"C36-B36","v":0}]
["Manitou M30 - C8100689","7141","7146",null,{"$f":"C37-B37","v":5}]
[null,null,null,null,0]
[]
[]
["RAPPORT DE PRODUCTION "]
[]
[null,"COMPTEUR HORAIRE","H/FONCT"]
["PRIMAIRE (Production Plaine)"]
["SECONDAIRE (Production Bascule  Tunnel)"]
["TERTIAIRE (frabrication concassée)"]
["BIG BAG"]
["Compteur d'eau"]
[]
[]
[null,null,null,null,"BIG BAG"]
["PRIMAIRE",null,null,"SECONDAIRE",null,null,"TERTIAIRE"]
["ALIMENTATION","Tout venant Brut",null,"FABRICATION","0/4SCL",null,"CONCASSES","0/2C"]
["Plaine","Tout venant Brut",null,"FABRICATION","M0/16",null,"CONCASSES","2/4C"]
["T120","Tout venant écreté",{"$f":"C54*0.95","v":0},"FABRICATION","M0/8",null,"CONCASSES","4/6C"]
["Débit mesuré en T/h","GRANULOMETRIE","TONNAGES",null,"GRANULOMETRIE","TONNAGES","CONCASSES","4/10C"]
[50,"04 NATUREL",{"$f":"C53*D57","v":0},0.22,"SABLE 0/4R",{"$f":"C57-(F53*'GNR ET ELEMENTS DE PROD'!L10)-('13'!F54*'GNR ET ELEMENTS DE PROD'!L7)","v":0},"CONCASSES","6/10C"]
[36,"4/8R",{"$f":"C53*D58","v":0},0.16,"4/8R",{"$f":"C58","v":0},"CONCASSES",null,177.76]
[42,"8/16R",{"$f":"C53*D59","v":0},0.18,"8/16R",{"$f":"C59-F54*'GNR ET ELEMENTS DE PROD'!N7","v":0},"CONCASSES",null,61.32]
[32,"11/22R",{"$f":"C53*D60","v":0},0.14000000000000001,"11/22R",{"$f":"C60","v":0},"CONCASSES","0/4C",{"$f":"-F54*'GNR ET ELEMENTS DE PROD'!K7-F53*'GNR ET ELEMENTS DE PROD'!K10","v":0},null,null,null,null,""]
[68,"22/80",{"$f":"C53*D61","v":0},0.3,"22/80",{"$f":"C63-I55-I5-ABS(I57)","v":0},"CONCASSES","6,3/10",{"$f":"+-'GNR ET ELEMENTS DE PROD'!M7*F54","v":0},null,null,null,null,""]
[{"$f":"SUM(A57:B61)","v":228},null,{"$f":"SUM(C57:C61)","v":0},null,null,{"$f":"SUM(F57:F61)","v":0},null,null,{"$f":"SUM(I53:I61)","v":239.07999999999998},null,null,null,null,""]
[]
["ACHATS"]
[]
[]
[null,null,null,null,null,null,null,null,null,null,null,null,null,""]
["ARRETS",null,null,null,null,null,null,null,null,null,null,null,null,""]
["Horamètre","CIRCUIT","MACHINE","CAUSE","DUREE (en mn)",null,null,"COMMENTAIRES",null,null,null,null,null,""]
[null,null,null,null,"Panne","Entretien","AUTRE",null,null,null,null,null,null,""]
[null,null,null,null,null,null,null,null,null,null,null,null,null,""]
[null,null,null,null,null,null,null,null,null,null,null,null,null,""]
[null,null,null,null,null,null,null,null,null,null,null,null,null,""]
[]
[]
[]
[]
["Observations\n  (pour garder une trace d'un fait particulier)"]

{"sheet":"14","index":15,"n_rows":78,"n_cols":14,"rows_kept":78,"cut":false,"hidden":false,"merged":[[0,0,0,11],[26,1,26,6],[51,0,51,2],[51,3,51,5],[51,6,51,8]]}
["RAPPORT JOURNALIER"]
[]
["DATE :","2020-10-14"]
["EXPLOITATION DE:","Osselle",null,"RESPONSABLE",null,"METEO"]
[null,null,null,"Denis MARESCOT"]
[]
[null,null,null,"H DE PRODUCTIONS PREVUES",8]
["POINTAGE PERSONNEL"]
[]
["NOM PRENOM","AFFECTATION","Nombre\nd'heure","AFFECTATION","Nombre\nd'heure","AFFECTATION","Nombre\nd'heure","TOTAL HORAIRE JOUR"]
["CRETIN Brigitte","Bascule 200200",8,null,null,null,null,{"$f":"C11+E11+G11","v":8}]
["DORKELD Didier","210258 Travaux divers sans engins",6,"Sur Engin Chargement client",2,null,null,{"$f":"C12+E12+G12","v":8}]
[null,null,null,null,null,null,null,{"$f":"C13+E13+G13","v":0}]
[null,null,null,null,null,null,null,0]
[null,null,null,null,null,null,null,0]
[null,null,null,null,null,null,null,0]
[null,null,null,null,null,null,null,{"$f":"C17+E17+G17","v":0}]
[null,null,null,null,null,null,null,{"$f":"C18+E18+G18","v":0}]
[null,null,null,null,null,null,null,{"$f":"C19+E19+G19","v":0}]
[null,null,null,null,null,null,null,0]
[null,null,null,null,null,null,null,0]
[null,null,null,null,null,null,null,0]
[]
["POINTAGE MATERIEL"]
[]
["ENGINS DE PRODUCTION"]
["TYPE","AFFECTATION HORAIRE",null,null,null,null,null,"TOTAL\n HORAIRE JOUR","GNR","HORAMETRE \nMATIN","HORAMETRE \nSOIR","CONTRÔLE"]
["Chargeur L566 - D3101014",null,null,null,null,null,null,{"$f":"C28+E28+G28","v":0},null,"16763","16763",{"$f":"IF(K28-J28=H28,\"OK\",\"FAUX\")","v":"OK"}]
["Chargeur 966G - D3102742","CHARGEMENT CLIENT /200200",2,null,null,null,null,{"$f":"C29+E29+G29","v":2},null,"2422","2424",{"$f":"IF(K29-J29=H29,\"OK\",\"FAUX\")","v":"OK"}]
["CAMION MERCEDES OSSELLE-P2100552",null,null,null,null,null,null,0,null,null,null,"OK"]
[null,null,null,null,null,null,null,0,null,null,null,"OK"]
[null,null,null,null,null,null,null,0,null,null,null,"OK"]
[null,null,null,null,null,null,null,0,null,null,null,"OK"]
[]
["VEHICULES DE LIAISON","HORAMETRE MATIN","SOIR","GNR","HEURE\n FONTIONNEMENT"]
["Minipelle SV17 - oss - D1002929","2291","2291",null,{"$f":"C36-B36","v":0}]
["Manitou M30 - C8100689","7141","7146",null,{"$f":"C37-B37","v":5}]
[null,null,null,null,0]
[]
[]
["RAPPORT DE PRODUCTION "]
[]
[null,"COMPTEUR HORAIRE","H/FONCT"]
["PRIMAIRE (Production Plaine)"]
["SECONDAIRE (Production Bascule  Tunnel)"]
["TERTIAIRE (frabrication concassée)"]
["BIG BAG"]
["Compteur d'eau"]
[]
[]
[null,null,null,null,"BIG BAG"]
["PRIMAIRE",null,null,"SECONDAIRE",null,null,"TERTIAIRE"]
["ALIMENTATION","Tout venant Brut",null,"FABRICATION","0/4SCL",null,"CONCASSES","0/2C"]
["Plaine","Tout venant Brut",null,"FABRICATION","M0/16",null,"CONCASSES","2/4C"]
["T120","Tout venant écreté",{"$f":"C54*0.95","v":0},"FABRICATION","M0/8",null,"CONCASSES","4/6C"]
["Débit mesuré en T/h","GRANULOMETRIE","TONNAGES",null,"GRANULOMETRIE","TONNAGES","CONCASSES","4/10C"]
[50,"04 NATUREL",{"$f":"C53*D57","v":0},0.22,"SABLE 0/4R",{"$f":"C57-(F53*'GNR ET ELEMENTS DE PROD'!L10)-('14'!F54*'GNR ET ELEMENTS DE PROD'!L7)","v":0},"CONCASSES","6/10C"]
[36,"4/8R",{"$f":"C53*D58","v":0},0.16,"4/8R",{"$f":"C58","v":0},"CONCASSES"]
[42,"8/16R",{"$f":"C53*D59","v":0},0.18,"8/16R",{"$f":"C59-F54*'GNR ET ELEMENTS DE PROD'!N7","v":0},"CONCASSES"]
[32,"11/22R",{"$f":"C53*D60","v":0},0.14000000000000001,"11/22R",{"$f":"C60","v":0},"CONCASSES","0/4C",{"$f":"-F54*'GNR ET ELEMENTS DE PROD'!K7-F53*'GNR ET ELEMENTS DE PROD'!K10","v":0},null,null,null,null,""]
[68,"22/80",{"$f":"C53*D61","v":0},0.3,"22/80",{"$f":"C63-I55-I5-ABS(I57)","v":0},"CONCASSES","6,3/10",{"$f":"+-'GNR ET ELEMENTS DE PROD'!M7*F54","v":0},null,null,null,null,""]
[{"$f":"SUM(A57:B61)","v":228},null,{"$f":"SUM(C57:C61)","v":0},null,null,{"$f":"SUM(F57:F61)","v":0},null,null,{"$f":"SUM(I53:I61)","v":0},null,null,null,null,""]
[]
["ACHATS"]
[]
[]
[null,null,null,null,null,null,null,null,null,null,null,null,null,""]
["ARRETS",null,null,null,null,null,null,null,null,null,null,null,null,""]
["Horamètre","CIRCUIT","MACHINE","CAUSE","DUREE (en mn)",null,null,"COMMENTAIRES",null,null,null,null,null,""]
[null,null,null,null,"Panne","Entretien","AUTRE",null,null,null,null,null,null,""]
[null,null,null,null,null,null,null,null,null,null,null,null,null,""]
[null,null,null,null,null,null,null,null,null,null,null,null,null,""]
[null,null,null,null,null,null,null,null,null,null,null,null,null,""]
[]
[]
[]
[]
["Observations\n  (pour garder une trace d'un fait particulier)"]

{"sheet":"15","index":16,"n_rows":78,"n_cols":14,"rows_kept":78,"cut":false,"hidden":false,"merged":[[0,0,0,11],[26,1,26,6],[51,0,51,2],[51,3,51,5],[51,6,51,8]]}
["RAPPORT JOURNALIER"]
[]
["DATE :","2020-10-15"]
["EXPLOITATION DE:","Osselle",null,"RESPONSABLE",null,"METEO"]
[null,null,null,"Denis MARESCOT"]
[]
[null,null,null,"H DE PRODUCTIONS PREVUES",8]
["POINTAGE PERSONNEL"]
[]
["NOM PRENOM","AFFECTATION","Nombre\nd'heure","AFFECTATION","Nombre\nd'heure","AFFECTATION","Nombre\nd'heure","TOTAL HORAIRE JOUR"]
["CRETIN Brigitte","Bascule 200200",8,null,null,null,null,{"$f":"C11+E11+G11","v":8}]
["DORKELD Didier","210258 Travaux divers sans engins",6,"Sur Engin Chargement client",2,null,null,{"$f":"C12+E12+G12","v":8}]
[null,null,null,null,null,null,null,{"$f":"C13+E13+G13","v":0}]
[null,null,null,null,null,null,null,0]
[null,null,null,null,null,null,null,0]
[null,null,null,null,null,null,null,0]
[null,null,null,null,null,null,null,{"$f":"C17+E17+G17","v":0}]
[null,null,null,null,null,null,null,{"$f":"C18+E18+G18","v":0}]
[null,null,null,null,null,null,null,{"$f":"C19+E19+G19","v":0}]
[null,null,null,null,null,null,null,0]
[null,null,null,null,null,null,null,0]
[null,null,null,null,null,null,null,0]
[]
["POINTAGE MATERIEL"]
[]
["ENGINS DE PRODUCTION"]
["TYPE","AFFECTATION HORAIRE",null,null,null,null,null,"TOTAL\n HORAIRE JOUR","GNR","HORAMETRE \nMATIN","HORAMETRE \nSOIR","CONTRÔLE"]
["Chargeur L566 - D3101014","TRAVAUX DIVERS SUR PISTE 200950",1,null,null,null,null,{"$f":"C28+E28+G28","v":1},null,"16763","16764",{"$f":"IF(K28-J28=H28,\"OK\",\"FAUX\")","v":"OK"}]
["Chargeur 966G - D3102742","CHARGEMENT CLIENT /200200",1,null,null,null,null,{"$f":"C29+E29+G29","v":1},100,"2424","2425",{"$f":"IF(K29-J29=H29,\"OK\",\"FAUX\")","v":"OK"}]
["CAMION MERCEDES OSSELLE-P2100552",null,null,null,null,null,null,0,null,null,null,"OK"]
[null,null,null,null,null,null,null,0,null,null,null,"OK"]
[null,null,null,null,null,null,null,0,null,null,null,"OK"]
[null,null,null,null,null,null,null,0,null,null,null,"OK"]
[]
["VEHICULES DE LIAISON","HORAMETRE MATIN","SOIR","GNR","HEURE\n FONTIONNEMENT"]
["Minipelle SV17 - oss - D1002929","2291","2291",null,{"$f":"C36-B36","v":0}]
["Manitou M30 - C8100689","7141","7146",null,{"$f":"C37-B37","v":5}]
[null,null,null,null,0]
[]
[]
["RAPPORT DE PRODUCTION "]
[]
[null,"COMPTEUR HORAIRE","H/FONCT"]
["PRIMAIRE (Production Plaine)"]
["SECONDAIRE (Production Bascule  Tunnel)"]
["TERTIAIRE (frabrication concassée)"]
["BIG BAG"]
["Compteur d'eau"]
[]
[]
[null,null,null,null,"BIG BAG"]
["PRIMAIRE",null,null,"SECONDAIRE",null,null,"TERTIAIRE"]
["ALIMENTATION","Tout venant Brut",null,"FABRICATION","0/4SCL",null,"CONCASSES","0/2C"]
["Plaine","Tout venant Brut",null,"FABRICATION","M0/16",null,"CONCASSES","2/4C"]
["T120","Tout venant écreté",{"$f":"C54*0.95","v":0},"FABRICATION","M0/8",null,"CONCASSES","4/6C"]
["Débit mesuré en T/h","GRANULOMETRIE","TONNAGES",null,"GRANULOMETRIE","TONNAGES","CONCASSES","4/10C"]
[50,"04 NATUREL",{"$f":"C53*D57","v":0},0.22,"SABLE 0/4R",{"$f":"C57-(F53*'GNR ET ELEMENTS DE PROD'!L10)-('15'!F54*'GNR ET ELEMENTS DE PROD'!L7)","v":0},"CONCASSES","6/10C"]
[36,"4/8R",{"$f":"C53*D58","v":0},0.16,"4/8R",{"$f":"C58","v":0},"CONCASSES"]
[42,"8/16R",{"$f":"C53*D59","v":0},0.18,"8/16R",{"$f":"C59-F54*'GNR ET ELEMENTS DE PROD'!N7","v":0},"CONCASSES"]
[32,"11/22R",{"$f":"C53*D60","v":0},0.14000000000000001,"11/22R",{"$f":"C60","v":0},"CONCASSES","0/4C",{"$f":"-F54*'GNR ET ELEMENTS DE PROD'!K7-F53*'GNR ET ELEMENTS DE PROD'!K10","v":0},null,null,null,null,""]
[68,"22/80",{"$f":"C53*D61","v":0},0.3,"22/80",{"$f":"C63-I55-I5-ABS(I57)","v":0},"CONCASSES","6,3/10",{"$f":"+-'GNR ET ELEMENTS DE PROD'!M7*F54","v":0},null,null,null,null,""]
[{"$f":"SUM(A57:B61)","v":228},null,{"$f":"SUM(C57:C61)","v":0},null,null,{"$f":"SUM(F57:F61)","v":0},null,null,{"$f":"SUM(I53:I61)","v":0},null,null,null,null,""]
[]
["ACHATS"]
[]
[]
[null,null,null,null,null,null,null,null,null,null,null,null,null,""]
["ARRETS",null,null,null,null,null,null,null,null,null,null,null,null,""]
["Horamètre","CIRCUIT","MACHINE","CAUSE","DUREE (en mn)",null,null,"COMMENTAIRES",null,null,null,null,null,""]
[null,null,null,null,"Panne","Entretien","AUTRE",null,null,null,null,null,null,""]
[null,null,null,null,null,null,null,null,null,null,null,null,null,""]
[null,null,null,null,null,null,null,null,null,null,null,null,null,""]
[null,null,null,null,null,null,null,null,null,null,null,null,null,""]
[]
[]
[]
[]
["Observations\n  (pour garder une trace d'un fait particulier)"]

{"sheet":"16","index":17,"n_rows":78,"n_cols":14,"rows_kept":78,"cut":false,"hidden":false,"merged":[[0,0,0,11],[26,1,26,6],[51,0,51,2],[51,3,51,5],[51,6,51,8]]}
["RAPPORT JOURNALIER"]
[]
["DATE :","2020-10-16"]
["EXPLOITATION DE:","Osselle",null,"RESPONSABLE",null,"METEO"]
[null,null,null,"Denis MARESCOT"]
[]
[null,null,null,"H DE PRODUCTIONS PREVUES",7]
["POINTAGE PERSONNEL"]
[]
["NOM PRENOM","AFFECTATION","Nombre\nd'heure","AFFECTATION","Nombre\nd'heure","AFFECTATION","Nombre\nd'heure","TOTAL HORAIRE JOUR"]
["CRETIN Brigitte","Bascule 200200",7,null,null,null,null,{"$f":"C11+E11+G11","v":7}]
["DORKELD Didier","210258 Travaux divers sans engins",5,"Sur Engin Chargement client",2,null,null,{"$f":"C12+E12+G12","v":7}]
[null,null,null,null,null,null,null,{"$f":"C13+E13+G13","v":0}]
[null,null,null,null,null,null,null,0]
[null,null,null,null,null,null,null,0]
[null,null,null,null,null,null,null,0]
[null,null,null,null,null,null,null,{"$f":"C17+E17+G17","v":0}]
[null,null,null,null,null,null,null,{"$f":"C18+E18+G18","v":0}]
[null,null,null,null,null,null,null,{"$f":"C19+E19+G19","v":0}]
[null,null,null,null,null,null,null,0]
[null,null,null,null,null,null,null,0]
[null,null,null,null,null,null,null,0]
[]
["POINTAGE MATERIEL"]
[]
["ENGINS DE PRODUCTION"]
["TYPE","AFFECTATION HORAIRE",null,null,null,null,null,"TOTAL\n HORAIRE JOUR","GNR","HORAMETRE \nMATIN","HORAMETRE \nSOIR","CONTRÔLE"]
["Chargeur L566 - D3101014",null,null,null,null,null,null,{"$f":"C28+E28+G28","v":0},null,"16764","16764",{"$f":"IF(K28-J28=H28,\"OK\",\"FAUX\")","v":"OK"}]
["Chargeur 966G - D3102742","CHARGEMENT CLIENT /200200",2,null,null,null,null,{"$f":"C29+E29+G29","v":2},null,"2425","2427",{"$f":"IF(K29-J29=H29,\"OK\",\"FAUX\")","v":"OK"}]
["CAMION MERCEDES OSSELLE-P2100552",null,null,null,null,null,null,0,null,null,null,"OK"]
[null,null,null,null,null,null,null,0,null,null,null,"OK"]
[null,null,null,null,null,null,null,0,null,null,null,"OK"]
[null,null,null,null,null,null,null,0,null,null,null,"OK"]
[]
["VEHICULES DE LIAISON","HORAMETRE MATIN","SOIR","GNR","HEURE\n FONTIONNEMENT"]
["Minipelle SV17 - oss - D1002929","2291","2291",null,{"$f":"C36-B36","v":0}]
["Manitou M30 - C8100689","7141","7146",null,{"$f":"C37-B37","v":5}]
["PELLE TP JOLY",null,null,100,0]
[]
[]
["RAPPORT DE PRODUCTION "]
[]
[null,"COMPTEUR HORAIRE","H/FONCT"]
["PRIMAIRE (Production Plaine)"]
["SECONDAIRE (Production Bascule  Tunnel)"]
["TERTIAIRE (frabrication concassée)"]
["BIG BAG"]
["Compteur d'eau"]
[]
[]
[null,null,null,null,"BIG BAG"]
["PRIMAIRE",null,null,"SECONDAIRE",null,null,"TERTIAIRE"]
["ALIMENTATION","Tout venant Brut",null,"FABRICATION","0/4SCL",null,"CONCASSES","0/2C"]
["Plaine","Tout venant Brut",null,"FABRICATION","M0/16",null,"CONCASSES","2/4C"]
["T120","Tout venant écreté",{"$f":"C54*0.95","v":0},"FABRICATION","M0/8",null,"CONCASSES","4/6C"]
["Débit mesuré en T/h","GRANULOMETRIE","TONNAGES",null,"GRANULOMETRIE","TONNAGES","CONCASSES","4/10C"]
[50,"04 NATUREL",{"$f":"C53*D57","v":0},0.22,"SABLE 0/4R",{"$f":"C57-(F53*'GNR ET ELEMENTS DE PROD'!L10)-('16'!F54*'GNR ET ELEMENTS DE PROD'!L7)","v":0},"CONCASSES","6/10C"]
[36,"4/8R",{"$f":"C53*D58","v":0},0.16,"4/8R",{"$f":"C58","v":0},"CONCASSES"]
[42,"8/16R",{"$f":"C53*D59","v":0},0.18,"8/16R",{"$f":"C59-F54*'GNR ET ELEMENTS DE PROD'!N7","v":0},"CONCASSES"]
[32,"11/22R",{"$f":"C53*D60","v":0},0.14000000000000001,"11/22R",{"$f":"C60","v":0},"CONCASSES","0/4C",{"$f":"-F54*'GNR ET ELEMENTS DE PROD'!K7-F53*'GNR ET ELEMENTS DE PROD'!K10","v":0},null,null,null,null,""]
[68,"22/80",{"$f":"C53*D61","v":0},0.3,"22/80",{"$f":"C63-I55-I5-ABS(I57)","v":0},"CONCASSES","6,3/10",{"$f":"+-'GNR ET ELEMENTS DE PROD'!M7*F54","v":0},null,null,null,null,""]
[{"$f":"SUM(A57:B61)","v":228},null,{"$f":"SUM(C57:C61)","v":0},null,null,{"$f":"SUM(F57:F61)","v":0},null,null,{"$f":"SUM(I53:I61)","v":0},null,null,null,null,""]
[]
["ACHATS"]
[]
[]
[null,null,null,null,null,null,null,null,null,null,null,null,null,""]
["ARRETS",null,null,null,null,null,null,null,null,null,null,null,null,""]
["Horamètre","CIRCUIT","MACHINE","CAUSE","DUREE (en mn)",null,null,"COMMENTAIRES",null,null,null,null,null,""]
[null,null,null,null,"Panne","Entretien","AUTRE",null,null,null,null,null,null,""]
[null,null,null,null,null,null,null,null,null,null,null,null,null,""]
[null,null,null,null,null,null,null,null,null,null,null,null,null,""]
[null,null,null,null,null,null,null,null,null,null,null,null,null,""]
[]
[]
[]
[]
["Observations\n  (pour garder une trace d'un fait particulier)"]

{"sheet":"17","index":18,"n_rows":78,"n_cols":14,"rows_kept":78,"cut":false,"hidden":false,"merged":[[0,0,0,11],[26,1,26,6],[51,0,51,2],[51,3,51,5],[51,6,51,8]]}
["RAPPORT JOURNALIER"]
[]
["DATE :"]
["EXPLOITATION DE:",null,null,"RESPONSABLE",null,"METEO"]
[]
[]
[null,null,null,"H DE PRODUCTIONS PREVUES"]
["POINTAGE PERSONNEL"]
[]
["NOM PRENOM","AFFECTATION","Nombre\nd'heure","AFFECTATION","Nombre\nd'heure","AFFECTATION","Nombre\nd'heure","TOTAL HORAIRE JOUR"]
[null,null,null,null,null,null,null,{"$f":"C11+E11+G11","v":0}]
[null,null,null,null,null,null,null,{"$f":"C12+E12+G12","v":0}]
[null,null,null,null,null,null,null,{"$f":"C13+E13+G13","v":0}]
[null,null,null,null,null,null,null,0]
[null,null,null,null,null,null,null,0]
[null,null,null,null,null,null,null,0]
[null,null,null,null,null,null,null,{"$f":"C17+E17+G17","v":0}]
[null,null,null,null,null,null,null,{"$f":"C18+E18+G18","v":0}]
[null,null,null,null,null,null,null,{"$f":"C19+E19+G19","v":0}]
[null,null,null,null,null,null,null,0]
[null,null,null,null,null,null,null,0]
[null,null,null,null,null,null,null,0]
[]
["POINTAGE MATERIEL"]
[]
["ENGINS DE PRODUCTION"]
["TYPE","AFFECTATION HORAIRE",null,null,null,null,null,"TOTAL\n HORAIRE JOUR","GNR","HORAMETRE \nMATIN","HORAMETRE \nSOIR","CONTRÔLE"]
[null,null,null,null,null,null,null,{"$f":"C28+E28+G28","v":0},null,null,null,{"$f":"IF(K28-J28=H28,\"OK\",\"FAUX\")","v":"OK"}]
[null,null,null,null,null,null,null,{"$f":"C29+E29+G29","v":0},null,null,null,{"$f":"IF(K29-J29=H29,\"OK\",\"FAUX\")","v":"OK"}]
[null,null,null,null,null,null,null,0,null,null,null,"OK"]
[null,null,null,null,null,null,null,0,null,null,null,"OK"]
[null,null,null,null,null,null,null,0,null,null,null,"OK"]
[null,null,null,null,null,null,null,0,null,null,null,"OK"]
[]
["VEHICULES DE LIAISON","HORAMETRE MATIN","SOIR","GNR","HEURE\n FONTIONNEMENT"]
[null,null,null,null,{"$f":"C36-B36","v":0}]
[null,null,null,null,{"$f":"C37-B37","v":0}]
[null,null,null,null,0]
[]
[]
["RAPPORT DE PRODUCTION "]
[]
[null,"COMPTEUR HORAIRE","H/FONCT"]
["PRIMAIRE (Production Plaine)"]
["SECONDAIRE (Production Bascule  Tunnel)"]
["TERTIAIRE (frabrication concassée)"]
["BIG BAG"]
["Compteur d'eau"]
[]
[]
[null,null,null,null,"BIG BAG"]
["PRIMAIRE",null,null,"SECONDAIRE",null,null,"TERTIAIRE"]
["ALIMENTATION","Tout venant Brut",null,"FABRICATION","0/4SCL",null,"CONCASSES","0/2C"]
["Plaine","Tout venant Brut",null,"FABRICATION","M0/16",null,"CONCASSES","2/4C"]
["T120","Tout venant écreté",{"$f":"C54*0.95","v":0},"FABRICATION","M0/8",null,"CONCASSES","4/6C"]
["Débit mesuré en T/h","GRANULOMETRIE","TONNAGES",null,"GRANULOMETRIE","TONNAGES","CONCASSES","4/10C"]
[50,"04 NATUREL",{"$f":"C53*D57","v":0},0.22,"SABLE 0/4R",{"$f":"C57-(F53*'GNR ET ELEMENTS DE PROD'!L10)-('17'!F54*'GNR ET ELEMENTS DE PROD'!L7)","v":0},"CONCASSES","6/10C"]
[36,"4/8R",{"$f":"C53*D58","v":0},0.16,"4/8R",{"$f":"C58","v":0},"CONCASSES"]
[42,"8/16R",{"$f":"C53*D59","v":0},0.18,"8/16R",{"$f":"C59-F54*'GNR ET ELEMENTS DE PROD'!N7","v":0},"CONCASSES"]
[32,"11/22R",{"$f":"C53*D60","v":0},0.14000000000000001,"11/22R",{"$f":"C60","v":0},"CONCASSES","0/4C",{"$f":"-F54*'GNR ET ELEMENTS DE PROD'!K7-F53*'GNR ET ELEMENTS DE PROD'!K10","v":0},null,null,null,null,""]
[68,"22/80",{"$f":"C53*D61","v":0},0.3,"22/80",{"$f":"C63-I55-I5-ABS(I57)","v":0},"CONCASSES","6,3/10",{"$f":"+-'GNR ET ELEMENTS DE PROD'!M7*F54","v":0},null,null,null,null,""]
[{"$f":"SUM(A57:B61)","v":228},null,{"$f":"SUM(C57:C61)","v":0},null,null,{"$f":"SUM(F57:F61)","v":0},null,null,{"$f":"SUM(I53:I61)","v":0},null,null,null,null,""]
[]
["ACHATS"]
[]
[]
[null,null,null,null,null,null,null,null,null,null,null,null,null,""]
["ARRETS",null,null,null,null,null,null,null,null,null,null,null,null,""]
["Horamètre","CIRCUIT","MACHINE","CAUSE","DUREE (en mn)",null,null,"COMMENTAIRES",null,null,null,null,null,""]
[null,null,null,null,"Panne","Entretien","AUTRE",null,null,null,null,null,null,""]
[null,null,null,null,null,null,null,null,null,null,null,null,null,""]
[null,null,null,null,null,null,null,null,null,null,null,null,null,""]
[null,null,null,null,null,null,null,null,null,null,null,null,null,""]
[]
[]
[]
[]
["Observations\n  (pour garder une trace d'un fait particulier)"]

{"sheet":"18","index":19,"n_rows":78,"n_cols":14,"rows_kept":78,"cut":false,"hidden":false,"merged":[[0,0,0,11],[26,1,26,6],[51,0,51,2],[51,3,51,5],[51,6,51,8]]}
["RAPPORT JOURNALIER"]
[]
["DATE :"]
["EXPLOITATION DE:",null,null,"RESPONSABLE",null,"METEO"]
[]
[]
[null,null,null,"H DE PRODUCTIONS PREVUES"]
["POINTAGE PERSONNEL"]
[]
["NOM PRENOM","AFFECTATION","Nombre\nd'heure","AFFECTATION","Nombre\nd'heure","AFFECTATION","Nombre\nd'heure","TOTAL HORAIRE JOUR"]
[null,null,null,null,null,null,null,{"$f":"C11+E11+G11","v":0}]
[null,null,null,null,null,null,null,{"$f":"C12+E12+G12","v":0}]
[null,null,null,null,null,null,null,{"$f":"C13+E13+G13","v":0}]
[null,null,null,null,null,null,null,0]
[null,null,null,null,null,null,null,0]
[null,null,null,null,null,null,null,0]
[null,null,null,null,null,null,null,{"$f":"C17+E17+G17","v":0}]
[null,null,null,null,null,null,null,{"$f":"C18+E18+G18","v":0}]
[null,null,null,null,null,null,null,{"$f":"C19+E19+G19","v":0}]
[null,null,null,null,null,null,null,0]
[null,null,null,null,null,null,null,0]
[null,null,null,null,null,null,null,0]
[]
["POINTAGE MATERIEL"]
[]
["ENGINS DE PRODUCTION"]
["TYPE","AFFECTATION HORAIRE",null,null,null,null,null,"TOTAL\n HORAIRE JOUR","GNR","HORAMETRE \nMATIN","HORAMETRE \nSOIR","CONTRÔLE"]
[null,null,null,null,null,null,null,{"$f":"C28+E28+G28","v":0},null,null,null,{"$f":"IF(K28-J28=H28,\"OK\",\"FAUX\")","v":"OK"}]
[null,null,null,null,null,null,null,{"$f":"C29+E29+G29","v":0},null,null,null,{"$f":"IF(K29-J29=H29,\"OK\",\"FAUX\")","v":"OK"}]
[null,null,null,null,null,null,null,0,null,null,null,"OK"]
[null,null,null,null,null,null,null,0,null,null,null,"OK"]
[null,null,null,null,null,null,null,0,null,null,null,"OK"]
[null,null,null,null,null,null,null,0,null,null,null,"OK"]
[]
["VEHICULES DE LIAISON","HORAMETRE MATIN","SOIR","GNR","HEURE\n FONTIONNEMENT"]
[null,null,null,null,{"$f":"C36-B36","v":0}]
[null,null,null,null,{"$f":"C37-B37","v":0}]
[null,null,null,null,0]
[]
[]
["RAPPORT DE PRODUCTION "]
[]
[null,"COMPTEUR HORAIRE","H/FONCT"]
["PRIMAIRE (Production Plaine)"]
["SECONDAIRE (Production Bascule  Tunnel)"]
["TERTIAIRE (frabrication concassée)"]
["BIG BAG"]
["Compteur d'eau"]
[]
[]
[null,null,null,null,"BIG BAG"]
["PRIMAIRE",null,null,"SECONDAIRE",null,null,"TERTIAIRE"]
["ALIMENTATION","Tout venant Brut",null,"FABRICATION","0/4SCL",null,"CONCASSES","0/2C"]
["Plaine","Tout venant Brut",null,"FABRICATION","M0/16",null,"CONCASSES","2/4C"]
["T120","Tout venant écreté",{"$f":"C54*0.95","v":0},"FABRICATION","M0/8",null,"CONCASSES","4/6C"]
["Débit mesuré en T/h","GRANULOMETRIE","TONNAGES",null,"GRANULOMETRIE","TONNAGES","CONCASSES","4/10C"]
[50,"04 NATUREL",{"$f":"C53*D57","v":0},0.22,"SABLE 0/4R",{"$f":"C57-(F53*'GNR ET ELEMENTS DE PROD'!L10)-('18'!F54*'GNR ET ELEMENTS DE PROD'!L7)","v":0},"CONCASSES","6/10C"]
[36,"4/8R",{"$f":"C53*D58","v":0},0.16,"4/8R",{"$f":"C58","v":0},"CONCASSES"]
[42,"8/16R",{"$f":"C53*D59","v":0},0.18,"8/16R",{"$f":"C59-F54*'GNR ET ELEMENTS DE PROD'!N7","v":0},"CONCASSES"]
[32,"11/22R",{"$f":"C53*D60","v":0},0.14000000000000001,"11/22R",{"$f":"C60","v":0},"CONCASSES","0/4C",{"$f":"-F54*'GNR ET ELEMENTS DE PROD'!K7-F53*'GNR ET ELEMENTS DE PROD'!K10","v":0},null,null,null,null,""]
[68,"22/80",{"$f":"C53*D61","v":0},0.3,"22/80",{"$f":"C63-I55-I5-ABS(I57)","v":0},"CONCASSES","6,3/10",{"$f":"+-'GNR ET ELEMENTS DE PROD'!M7*F54","v":0},null,null,null,null,""]
[{"$f":"SUM(A57:B61)","v":228},null,{"$f":"SUM(C57:C61)","v":0},null,null,{"$f":"SUM(F57:F61)","v":0},null,null,{"$f":"SUM(I53:I61)","v":0},null,null,null,null,""]
[]
["ACHATS"]
[]
[]
[null,null,null,null,null,null,null,null,null,null,null,null,null,""]
["ARRETS",null,null,null,null,null,null,null,null,null,null,null,null,""]
["Horamètre","CIRCUIT","MACHINE","CAUSE","DUREE (en mn)",null,null,"COMMENTAIRES",null,null,null,null,null,""]
[null,null,null,null,"Panne","Entretien","AUTRE",null,null,null,null,null,null,""]
[null,null,null,null,null,null,null,null,null,null,null,null,null,""]
[null,null,null,null,null,null,null,null,null,null,null,null,null,""]
[null,null,null,null,null,null,null,null,null,null,null,null,null,""]
[]
[]
[]
[]
["Observations\n  (pour garder une trace d'un fait particulier)"]

{"sheet":"19","index":20,"n_rows":78,"n_cols":14,"rows_kept":78,"cut":false,"hidden":false,"merged":[[0,0,0,11],[26,1,26,6],[51,0,51,2],[51,3,51,5],[51,6,51,8]]}
["RAPPORT JOURNALIER"]
[]
["DATE :"]
["EXPLOITATION DE:",null,null,"RESPONSABLE",null,"METEO"]
[]
[]
[null,null,null,"H DE PRODUCTIONS PREVUES"]
["POINTAGE PERSONNEL"]
[]
["NOM PRENOM","AFFECTATION","Nombre\nd'heure","AFFECTATION","Nombre\nd'heure","AFFECTATION","Nombre\nd'heure","TOTAL HORAIRE JOUR"]
[null,null,null,null,null,null,null,{"$f":"C11+E11+G11","v":0}]
[null,null,null,null,null,null,null,{"$f":"C12+E12+G12","v":0}]
[null,null,null,null,null,null,null,{"$f":"C13+E13+G13","v":0}]
[null,null,null,null,null,null,null,0]
[null,null,null,null,null,null,null,0]
[null,null,null,null,null,null,null,0]
[null,null,null,null,null,null,null,{"$f":"C17+E17+G17","v":0}]
[null,null,null,null,null,null,null,{"$f":"C18+E18+G18","v":0}]
[null,null,null,null,null,null,null,{"$f":"C19+E19+G19","v":0}]
[null,null,null,null,null,null,null,0]
[null,null,null,null,null,null,null,0]
[null,null,null,null,null,null,null,0]
[]
["POINTAGE MATERIEL"]
[]
["ENGINS DE PRODUCTION"]
["TYPE","AFFECTATION HORAIRE",null,null,null,null,null,"TOTAL\n HORAIRE JOUR","GNR","HORAMETRE \nMATIN","HORAMETRE \nSOIR","CONTRÔLE"]
[null,null,null,null,null,null,null,{"$f":"C28+E28+G28","v":0},null,null,null,{"$f":"IF(K28-J28=H28,\"OK\",\"FAUX\")","v":"OK"}]
[null,null,null,null,null,null,null,{"$f":"C29+E29+G29","v":0},null,null,null,{"$f":"IF(K29-J29=H29,\"OK\",\"FAUX\")","v":"OK"}]
[null,null,null,null,null,null,null,0,null,null,null,"OK"]
[null,null,null,null,null,null,null,0,null,null,null,"OK"]
[null,null,null,null,null,null,null,0,null,null,null,"OK"]
[null,null,null,null,null,null,null,0,null,null,null,"OK"]
[]
["VEHICULES DE LIAISON","HORAMETRE MATIN","SOIR","GNR","HEURE\n FONTIONNEMENT"]
[null,null,null,null,{"$f":"C36-B36","v":0}]
[null,null,null,null,{"$f":"C37-B37","v":0}]
[null,null,null,null,0]
[]
[]
["RAPPORT DE PRODUCTION "]
[]
[null,"COMPTEUR HORAIRE","H/FONCT"]
["PRIMAIRE (Production Plaine)"]
["SECONDAIRE (Production Bascule  Tunnel)"]
["TERTIAIRE (frabrication concassée)"]
["BIG BAG"]
["Compteur d'eau"]
[]
[]
[null,null,null,null,"BIG BAG"]
["PRIMAIRE",null,null,"SECONDAIRE",null,null,"TERTIAIRE"]
["ALIMENTATION","Tout venant Brut",null,"FABRICATION","0/4SCL",null,"CONCASSES","0/2C"]
["Plaine","Tout venant Brut",null,"FABRICATION","M0/16",null,"CONCASSES","2/4C"]
["T120","Tout venant écreté",{"$f":"C54*0.95","v":0},"FABRICATION","M0/8",null,"CONCASSES","4/6C"]
["Débit mesuré en T/h","GRANULOMETRIE","TONNAGES",null,"GRANULOMETRIE","TONNAGES","CONCASSES","4/10C"]
[50,"04 NATUREL",{"$f":"C53*D57","v":0},0.22,"SABLE 0/4R",{"$f":"C57-(F53*'GNR ET ELEMENTS DE PROD'!L10)-('19'!F54*'GNR ET ELEMENTS DE PROD'!L7)","v":0},"CONCASSES","6/10C"]
[36,"4/8R",{"$f":"C53*D58","v":0},0.16,"4/8R",{"$f":"C58","v":0},"CONCASSES"]
[42,"8/16R",{"$f":"C53*D59","v":0},0.18,"8/16R",{"$f":"C59-F54*'GNR ET ELEMENTS DE PROD'!N7","v":0},"CONCASSES"]
[32,"11/22R",{"$f":"C53*D60","v":0},0.14000000000000001,"11/22R",{"$f":"C60","v":0},"CONCASSES","0/4C",{"$f":"-F54*'GNR ET ELEMENTS DE PROD'!K7-F53*'GNR ET ELEMENTS DE PROD'!K10","v":0},null,null,null,null,""]
[68,"22/80",{"$f":"C53*D61","v":0},0.3,"22/80",{"$f":"C63-I55-I5-ABS(I57)","v":0},"CONCASSES","6,3/10",{"$f":"+-'GNR ET ELEMENTS DE PROD'!M7*F54","v":0},null,null,null,null,""]
[{"$f":"SUM(A57:B61)","v":228},null,{"$f":"SUM(C57:C61)","v":0},null,null,{"$f":"SUM(F57:F61)","v":0},null,null,{"$f":"SUM(I53:I61)","v":0},null,null,null,null,""]
[]
["ACHATS"]
[]
[]
[null,null,null,null,null,null,null,null,null,null,null,null,null,""]
["ARRETS",null,null,null,null,null,null,null,null,null,null,null,null,""]
["Horamètre","CIRCUIT","MACHINE","CAUSE","DUREE (en mn)",null,null,"COMMENTAIRES",null,null,null,null,null,""]
[null,null,null,null,"Panne","Entretien","AUTRE",null,null,null,null,null,null,""]
[null,null,null,null,null,null,null,null,null,null,null,null,null,""]
[null,null,null,null,null,null,null,null,null,null,null,null,null,""]
[null,null,null,null,null,null,null,null,null,null,null,null,null,""]
[]
[]
[]
[]
["Observations\n  (pour garder une trace d'un fait particulier)"]

{"sheet":"20","index":21,"n_rows":78,"n_cols":14,"rows_kept":78,"cut":false,"hidden":false,"merged":[[0,0,0,11],[26,1,26,6],[51,0,51,2],[51,3,51,5],[51,6,51,8]]}
["RAPPORT JOURNALIER"]
[]
["DATE :"]
["EXPLOITATION DE:",null,null,"RESPONSABLE",null,"METEO"]
[]
[]
[null,null,null,"H DE PRODUCTIONS PREVUES"]
["POINTAGE PERSONNEL"]
[]
["NOM PRENOM","AFFECTATION","Nombre\nd'heure","AFFECTATION","Nombre\nd'heure","AFFECTATION","Nombre\nd'heure","TOTAL HORAIRE JOUR"]
[null,null,null,null,null,null,null,{"$f":"C11+E11+G11","v":0}]
[null,null,null,null,null,null,null,{"$f":"C12+E12+G12","v":0}]
[null,null,null,null,null,null,null,{"$f":"C13+E13+G13","v":0}]
[null,null,null,null,null,null,null,0]
[null,null,null,null,null,null,null,0]
[null,null,null,null,null,null,null,0]
[null,null,null,null,null,null,null,{"$f":"C17+E17+G17","v":0}]
[null,null,null,null,null,null,null,{"$f":"C18+E18+G18","v":0}]
[null,null,null,null,null,null,null,{"$f":"C19+E19+G19","v":0}]
[null,null,null,null,null,null,null,0]
[null,null,null,null,null,null,null,0]
[null,null,null,null,null,null,null,0]
[]
["POINTAGE MATERIEL"]
[]
["ENGINS DE PRODUCTION"]
["TYPE","AFFECTATION HORAIRE",null,null,null,null,null,"TOTAL\n HORAIRE JOUR","GNR","HORAMETRE \nMATIN","HORAMETRE \nSOIR","CONTRÔLE"]
[null,null,null,null,null,null,null,{"$f":"C28+E28+G28","v":0},null,null,null,{"$f":"IF(K28-J28=H28,\"OK\",\"FAUX\")","v":"OK"}]
[null,null,null,null,null,null,null,{"$f":"C29+E29+G29","v":0},null,null,null,{"$f":"IF(K29-J29=H29,\"OK\",\"FAUX\")","v":"OK"}]
[null,null,null,null,null,null,null,0,null,null,null,"OK"]
[null,null,null,null,null,null,null,0,null,null,null,"OK"]
[null,null,null,null,null,null,null,0,null,null,null,"OK"]
[null,null,null,null,null,null,null,0,null,null,null,"OK"]
[]
["VEHICULES DE LIAISON","HORAMETRE MATIN","SOIR","GNR","HEURE\n FONTIONNEMENT"]
[null,null,null,null,{"$f":"C36-B36","v":0}]
[null,null,null,null,{"$f":"C37-B37","v":0}]
[null,null,null,null,0]
[]
[]
["RAPPORT DE PRODUCTION "]
[]
[null,"COMPTEUR HORAIRE","H/FONCT"]
["PRIMAIRE (Production Plaine)"]
["SECONDAIRE (Production Bascule  Tunnel)"]
["TERTIAIRE (frabrication concassée)"]
["BIG BAG"]
["Compteur d'eau"]
[]
[]
[null,null,null,null,"BIG BAG"]
["PRIMAIRE",null,null,"SECONDAIRE",null,null,"TERTIAIRE"]
["ALIMENTATION","Tout venant Brut",null,"FABRICATION","0/4SCL",null,"CONCASSES","0/2C"]
["Plaine","Tout venant Brut",null,"FABRICATION","M0/16",null,"CONCASSES","2/4C"]
["T120","Tout venant écreté",{"$f":"C54*0.95","v":0},"FABRICATION","M0/8",null,"CONCASSES","4/6C"]
["Débit mesuré en T/h","GRANULOMETRIE","TONNAGES",null,"GRANULOMETRIE","TONNAGES","CONCASSES","4/10C"]
[50,"04 NATUREL",{"$f":"C53*D57","v":0},0.22,"SABLE 0/4R",{"$f":"C57-(F53*'GNR ET ELEMENTS DE PROD'!L10)-('20'!F54*'GNR ET ELEMENTS DE PROD'!L7)","v":0},"CONCASSES","6/10C"]
[36,"4/8R",{"$f":"C53*D58","v":0},0.16,"4/8R",{"$f":"C58","v":0},"CONCASSES"]
[42,"8/16R",{"$f":"C53*D59","v":0},0.18,"8/16R",{"$f":"C59-F54*'GNR ET ELEMENTS DE PROD'!N7","v":0},"CONCASSES"]
[32,"11/22R",{"$f":"C53*D60","v":0},0.14000000000000001,"11/22R",{"$f":"C60","v":0},"CONCASSES","0/4C",{"$f":"-F54*'GNR ET ELEMENTS DE PROD'!K7-F53*'GNR ET ELEMENTS DE PROD'!K10","v":0},null,null,null,null,""]
[68,"22/80",{"$f":"C53*D61","v":0},0.3,"22/80",{"$f":"C63-I55-I5-ABS(I57)","v":0},"CONCASSES","6,3/10",{"$f":"+-'GNR ET ELEMENTS DE PROD'!M7*F54","v":0},null,null,null,null,""]
[{"$f":"SUM(A57:B61)","v":228},null,{"$f":"SUM(C57:C61)","v":0},null,null,{"$f":"SUM(F57:F61)","v":0},null,null,{"$f":"SUM(I53:I61)","v":0},null,null,null,null,""]
[]
["ACHATS"]
[]
[]
[null,null,null,null,null,null,null,null,null,null,null,null,null,""]
["ARRETS",null,null,null,null,null,null,null,null,null,null,null,null,""]
["Horamètre","CIRCUIT","MACHINE","CAUSE","DUREE (en mn)",null,null,"COMMENTAIRES",null,null,null,null,null,""]
[null,null,null,null,"Panne","Entretien","AUTRE",null,null,null,null,null,null,""]
[null,null,null,null,null,null,null,null,null,null,null,null,null,""]
[null,null,null,null,null,null,null,null,null,null,null,null,null,""]
[null,null,null,null,null,null,null,null,null,null,null,null,null,""]
[]
[]
[]
[]
["Observations\n  (pour garder une trace d'un fait particulier)"]

{"sheet":"21","index":22,"n_rows":78,"n_cols":14,"rows_kept":78,"cut":false,"hidden":false,"merged":[[0,0,0,11],[26,1,26,6],[51,0,51,2],[51,3,51,5],[51,6,51,8]]}
["RAPPORT JOURNALIER"]
[]
["DATE :"]
["EXPLOITATION DE:",null,null,"RESPONSABLE",null,"METEO"]
[]
[]
[null,null,null,"H DE PRODUCTIONS PREVUES"]
["POINTAGE PERSONNEL"]
[]
["NOM PRENOM","AFFECTATION","Nombre\nd'heure","AFFECTATION","Nombre\nd'heure","AFFECTATION","Nombre\nd'heure","TOTAL HORAIRE JOUR"]
[null,null,null,null,null,null,null,{"$f":"C11+E11+G11","v":0}]
[null,null,null,null,null,null,null,{"$f":"C12+E12+G12","v":0}]
[null,null,null,null,null,null,null,{"$f":"C13+E13+G13","v":0}]
[null,null,null,null,null,null,null,0]
[null,null,null,null,null,null,null,0]
[null,null,null,null,null,null,null,0]
[null,null,null,null,null,null,null,{"$f":"C17+E17+G17","v":0}]
[null,null,null,null,null,null,null,{"$f":"C18+E18+G18","v":0}]
[null,null,null,null,null,null,null,{"$f":"C19+E19+G19","v":0}]
[null,null,null,null,null,null,null,0]
[null,null,null,null,null,null,null,0]
[null,null,null,null,null,null,null,0]
[]
["POINTAGE MATERIEL"]
[]
["ENGINS DE PRODUCTION"]
["TYPE","AFFECTATION HORAIRE",null,null,null,null,null,"TOTAL\n HORAIRE JOUR","GNR","HORAMETRE \nMATIN","HORAMETRE \nSOIR","CONTRÔLE"]
[null,null,null,null,null,null,null,{"$f":"C28+E28+G28","v":0},null,null,null,{"$f":"IF(K28-J28=H28,\"OK\",\"FAUX\")","v":"OK"}]
[null,null,null,null,null,null,null,{"$f":"C29+E29+G29","v":0},null,null,null,{"$f":"IF(K29-J29=H29,\"OK\",\"FAUX\")","v":"OK"}]
[null,null,null,null,null,null,null,0,null,null,null,"OK"]
[null,null,null,null,null,null,null,0,null,null,null,"OK"]
[null,null,null,null,null,null,null,0,null,null,null,"OK"]
[null,null,null,null,null,null,null,0,null,null,null,"OK"]
[]
["VEHICULES DE LIAISON","HORAMETRE MATIN","SOIR","GNR","HEURE\n FONTIONNEMENT"]
[null,null,null,null,{"$f":"C36-B36","v":0}]
[null,null,null,null,{"$f":"C37-B37","v":0}]
[null,null,null,null,0]
[]
[]
["RAPPORT DE PRODUCTION "]
[]
[null,"COMPTEUR HORAIRE","H/FONCT"]
["PRIMAIRE (Production Plaine)"]
["SECONDAIRE (Production Bascule  Tunnel)"]
["TERTIAIRE (frabrication concassée)"]
["BIG BAG"]
["Compteur d'eau"]
[]
[]
[null,null,null,null,"BIG BAG"]
["PRIMAIRE",null,null,"SECONDAIRE",null,null,"TERTIAIRE"]
["ALIMENTATION","Tout venant Brut",null,"FABRICATION","0/4SCL",null,"CONCASSES","0/2C"]
["Plaine","Tout venant Brut",null,"FABRICATION","M0/16",null,"CONCASSES","2/4C"]
["T120","Tout venant écreté",{"$f":"C54*0.95","v":0},"FABRICATION","M0/8",null,"CONCASSES","4/6C"]
["Débit mesuré en T/h","GRANULOMETRIE","TONNAGES",null,"GRANULOMETRIE","TONNAGES","CONCASSES","4/10C"]
[50,"04 NATUREL",{"$f":"C53*D57","v":0},0.22,"SABLE 0/4R",{"$f":"C57-(F53*'GNR ET ELEMENTS DE PROD'!L10)-('21'!F54*'GNR ET ELEMENTS DE PROD'!L7)","v":0},"CONCASSES","6/10C"]
[36,"4/8R",{"$f":"C53*D58","v":0},0.16,"4/8R",{"$f":"C58","v":0},"CONCASSES"]
[42,"8/16R",{"$f":"C53*D59","v":0},0.18,"8/16R",{"$f":"C59-F54*'GNR ET ELEMENTS DE PROD'!N7","v":0},"CONCASSES"]
[32,"11/22R",{"$f":"C53*D60","v":0},0.14000000000000001,"11/22R",{"$f":"C60","v":0},"CONCASSES","0/4C",{"$f":"-F54*'GNR ET ELEMENTS DE PROD'!K7-F53*'GNR ET ELEMENTS DE PROD'!K10","v":0},null,null,null,null,""]
[68,"22/80",{"$f":"C53*D61","v":0},0.3,"22/80",{"$f":"C63-I55-I5-ABS(I57)","v":0},"CONCASSES","6,3/10",{"$f":"+-'GNR ET ELEMENTS DE PROD'!M7*F54","v":0},null,null,null,null,""]
[{"$f":"SUM(A57:B61)","v":228},null,{"$f":"SUM(C57:C61)","v":0},null,null,{"$f":"SUM(F57:F61)","v":0},null,null,{"$f":"SUM(I53:I61)","v":0},null,null,null,null,""]
[]
["ACHATS"]
[]
[]
[null,null,null,null,null,null,null,null,null,null,null,null,null,""]
["ARRETS",null,null,null,null,null,null,null,null,null,null,null,null,""]
["Horamètre","CIRCUIT","MACHINE","CAUSE","DUREE (en mn)",null,null,"COMMENTAIRES",null,null,null,null,null,""]
[null,null,null,null,"Panne","Entretien","AUTRE",null,null,null,null,null,null,""]
[null,null,null,null,null,null,null,null,null,null,null,null,null,""]
[null,null,null,null,null,null,null,null,null,null,null,null,null,""]
[null,null,null,null,null,null,null,null,null,null,null,null,null,""]
[]
[]
[]
[]
["Observations\n  (pour garder une trace d'un fait particulier)"]

{"sheet":"22","index":23,"n_rows":78,"n_cols":14,"rows_kept":78,"cut":false,"hidden":false,"merged":[[0,0,0,11],[26,1,26,6],[51,0,51,2],[51,3,51,5],[51,6,51,8]]}
["RAPPORT JOURNALIER"]
[]
["DATE :"]
["EXPLOITATION DE:",null,null,"RESPONSABLE",null,"METEO"]
[]
[]
[null,null,null,"H DE PRODUCTIONS PREVUES"]
["POINTAGE PERSONNEL"]
[]
["NOM PRENOM","AFFECTATION","Nombre\nd'heure","AFFECTATION","Nombre\nd'heure","AFFECTATION","Nombre\nd'heure","TOTAL HORAIRE JOUR"]
[null,null,null,null,null,null,null,{"$f":"C11+E11+G11","v":0}]
[null,null,null,null,null,null,null,{"$f":"C12+E12+G12","v":0}]
[null,null,null,null,null,null,null,{"$f":"C13+E13+G13","v":0}]
[null,null,null,null,null,null,null,0]
[null,null,null,null,null,null,null,0]
[null,null,null,null,null,null,null,0]
[null,null,null,null,null,null,null,{"$f":"C17+E17+G17","v":0}]
[null,null,null,null,null,null,null,{"$f":"C18+E18+G18","v":0}]
[null,null,null,null,null,null,null,{"$f":"C19+E19+G19","v":0}]
[null,null,null,null,null,null,null,0]
[null,null,null,null,null,null,null,0]
[null,null,null,null,null,null,null,0]
[]
["POINTAGE MATERIEL"]
[]
["ENGINS DE PRODUCTION"]
["TYPE","AFFECTATION HORAIRE",null,null,null,null,null,"TOTAL\n HORAIRE JOUR","GNR","HORAMETRE \nMATIN","HORAMETRE \nSOIR","CONTRÔLE"]
[null,null,null,null,null,null,null,{"$f":"C28+E28+G28","v":0},null,null,null,{"$f":"IF(K28-J28=H28,\"OK\",\"FAUX\")","v":"OK"}]
[null,null,null,null,null,null,null,{"$f":"C29+E29+G29","v":0},null,null,null,{"$f":"IF(K29-J29=H29,\"OK\",\"FAUX\")","v":"OK"}]
[null,null,null,null,null,null,null,0,null,null,null,"OK"]
[null,null,null,null,null,null,null,0,null,null,null,"OK"]
[null,null,null,null,null,null,null,0,null,null,null,"OK"]
[null,null,null,null,null,null,null,0,null,null,null,"OK"]
[]
["VEHICULES DE LIAISON","HORAMETRE MATIN","SOIR","GNR","HEURE\n FONTIONNEMENT"]
[null,null,null,null,{"$f":"C36-B36","v":0}]
[null,null,null,null,{"$f":"C37-B37","v":0}]
[null,null,null,null,0]
[]
[]
["RAPPORT DE PRODUCTION "]
[]
[null,"COMPTEUR HORAIRE","H/FONCT"]
["PRIMAIRE (Production Plaine)"]
["SECONDAIRE (Production Bascule  Tunnel)"]
["TERTIAIRE (frabrication concassée)"]
["BIG BAG"]
["Compteur d'eau"]
[]
[]
[null,null,null,null,"BIG BAG"]
["PRIMAIRE",null,null,"SECONDAIRE",null,null,"TERTIAIRE"]
["ALIMENTATION","Tout venant Brut",null,"FABRICATION","0/4SCL",null,"CONCASSES","0/2C"]
["Plaine","Tout venant Brut",null,"FABRICATION","M0/16",null,"CONCASSES","2/4C"]
["T120","Tout venant écreté",{"$f":"C54*0.95","v":0},"FABRICATION","M0/8",null,"CONCASSES","4/6C"]
["Débit mesuré en T/h","GRANULOMETRIE","TONNAGES",null,"GRANULOMETRIE","TONNAGES","CONCASSES","4/10C"]
[50,"04 NATUREL",{"$f":"C53*D57","v":0},0.22,"SABLE 0/4R",{"$f":"C57-(F53*'GNR ET ELEMENTS DE PROD'!L10)-('22'!F54*'GNR ET ELEMENTS DE PROD'!L7)","v":0},"CONCASSES","6/10C"]
[36,"4/8R",{"$f":"C53*D58","v":0},0.16,"4/8R",{"$f":"C58","v":0},"CONCASSES"]
[42,"8/16R",{"$f":"C53*D59","v":0},0.18,"8/16R",{"$f":"C59-F54*'GNR ET ELEMENTS DE PROD'!N7","v":0},"CONCASSES"]
[32,"11/22R",{"$f":"C53*D60","v":0},0.14000000000000001,"11/22R",{"$f":"C60","v":0},"CONCASSES","0/4C",{"$f":"-F54*'GNR ET ELEMENTS DE PROD'!K7-F53*'GNR ET ELEMENTS DE PROD'!K10","v":0},null,null,null,null,""]
[68,"22/80",{"$f":"C53*D61","v":0},0.3,"22/80",{"$f":"C63-I55-I5-ABS(I57)","v":0},"CONCASSES","6,3/10",{"$f":"+-'GNR ET ELEMENTS DE PROD'!M7*F54","v":0},null,null,null,null,""]
[{"$f":"SUM(A57:B61)","v":228},null,{"$f":"SUM(C57:C61)","v":0},null,null,{"$f":"SUM(F57:F61)","v":0},null,null,{"$f":"SUM(I53:I61)","v":0},null,null,null,null,""]
[]
["ACHATS"]
[]
[]
[null,null,null,null,null,null,null,null,null,null,null,null,null,""]
["ARRETS",null,null,null,null,null,null,null,null,null,null,null,null,""]
["Horamètre","CIRCUIT","MACHINE","CAUSE","DUREE (en mn)",null,null,"COMMENTAIRES",null,null,null,null,null,""]
[null,null,null,null,"Panne","Entretien","AUTRE",null,null,null,null,null,null,""]
[null,null,null,null,null,null,null,null,null,null,null,null,null,""]
[null,null,null,null,null,null,null,null,null,null,null,null,null,""]
[null,null,null,null,null,null,null,null,null,null,null,null,null,""]
[]
[]
[]
[]
["Observations\n  (pour garder une trace d'un fait particulier)"]

{"sheet":"23","index":24,"n_rows":78,"n_cols":14,"rows_kept":78,"cut":false,"hidden":false,"merged":[[0,0,0,11],[26,1,26,6],[51,0,51,2],[51,3,51,5],[51,6,51,8]]}
["RAPPORT JOURNALIER"]
[]
["DATE :"]
["EXPLOITATION DE:",null,null,"RESPONSABLE",null,"METEO"]
[]
[]
[null,null,null,"H DE PRODUCTIONS PREVUES"]
["POINTAGE PERSONNEL"]
[]
["NOM PRENOM","AFFECTATION","Nombre\nd'heure","AFFECTATION","Nombre\nd'heure","AFFECTATION","Nombre\nd'heure","TOTAL HORAIRE JOUR"]
[null,null,null,null,null,null,null,{"$f":"C11+E11+G11","v":0}]
[null,null,null,null,null,null,null,{"$f":"C12+E12+G12","v":0}]
[null,null,null,null,null,null,null,{"$f":"C13+E13+G13","v":0}]
[null,null,null,null,null,null,null,0]
[null,null,null,null,null,null,null,0]
[null,null,null,null,null,null,null,0]
[null,null,null,null,null,null,null,{"$f":"C17+E17+G17","v":0}]
[null,null,null,null,null,null,null,{"$f":"C18+E18+G18","v":0}]
[null,null,null,null,null,null,null,{"$f":"C19+E19+G19","v":0}]
[null,null,null,null,null,null,null,0]
[null,null,null,null,null,null,null,0]
[null,null,null,null,null,null,null,0]
[]
["POINTAGE MATERIEL"]
[]
["ENGINS DE PRODUCTION"]
["TYPE","AFFECTATION HORAIRE",null,null,null,null,null,"TOTAL\n HORAIRE JOUR","GNR","HORAMETRE \nMATIN","HORAMETRE \nSOIR","CONTRÔLE"]
[null,null,null,null,null,null,null,{"$f":"C28+E28+G28","v":0},null,null,null,{"$f":"IF(K28-J28=H28,\"OK\",\"FAUX\")","v":"OK"}]
[null,null,null,null,null,null,null,{"$f":"C29+E29+G29","v":0},null,null,null,{"$f":"IF(K29-J29=H29,\"OK\",\"FAUX\")","v":"OK"}]
[null,null,null,null,null,null,null,0,null,null,null,"OK"]
[null,null,null,null,null,null,null,0,null,null,null,"OK"]
[null,null,null,null,null,null,null,0,null,null,null,"OK"]
[null,null,null,null,null,null,null,0,null,null,null,"OK"]
[]
["VEHICULES DE LIAISON","HORAMETRE MATIN","SOIR","GNR","HEURE\n FONTIONNEMENT"]
[null,null,null,null,{"$f":"C36-B36","v":0}]
[null,null,null,null,{"$f":"C37-B37","v":0}]
[null,null,null,null,0]
[]
[]
["RAPPORT DE PRODUCTION "]
[]
[null,"COMPTEUR HORAIRE","H/FONCT"]
["PRIMAIRE (Production Plaine)"]
["SECONDAIRE (Production Bascule  Tunnel)"]
["TERTIAIRE (frabrication concassée)"]
["BIG BAG"]
["Compteur d'eau"]
[]
[]
[null,null,null,null,"BIG BAG"]
["PRIMAIRE",null,null,"SECONDAIRE",null,null,"TERTIAIRE"]
["ALIMENTATION","Tout venant Brut",null,"FABRICATION","0/4SCL",null,"CONCASSES","0/2C"]
["Plaine","Tout venant Brut",null,"FABRICATION","M0/16",null,"CONCASSES","2/4C"]
["T120","Tout venant écreté",{"$f":"C54*0.95","v":0},"FABRICATION","M0/8",null,"CONCASSES","4/6C"]
["Débit mesuré en T/h","GRANULOMETRIE","TONNAGES",null,"GRANULOMETRIE","TONNAGES","CONCASSES","4/10C"]
[50,"04 NATUREL",{"$f":"C53*D57","v":0},0.22,"SABLE 0/4R",{"$f":"C57-(F53*'GNR ET ELEMENTS DE PROD'!L10)-('23'!F54*'GNR ET ELEMENTS DE PROD'!L7)","v":0},"CONCASSES","6/10C"]
[36,"4/8R",{"$f":"C53*D58","v":0},0.16,"4/8R",{"$f":"C58","v":0},"CONCASSES"]
[42,"8/16R",{"$f":"C53*D59","v":0},0.18,"8/16R",{"$f":"C59-F54*'GNR ET ELEMENTS DE PROD'!N7","v":0},"CONCASSES"]
[32,"11/22R",{"$f":"C53*D60","v":0},0.14000000000000001,"11/22R",{"$f":"C60","v":0},"CONCASSES","0/4C",{"$f":"-F54*'GNR ET ELEMENTS DE PROD'!K7-F53*'GNR ET ELEMENTS DE PROD'!K10","v":0},null,null,null,null,""]
[68,"22/80",{"$f":"C53*D61","v":0},0.3,"22/80",{"$f":"C63-I55-I5-ABS(I57)","v":0},"CONCASSES","6,3/10",{"$f":"+-'GNR ET ELEMENTS DE PROD'!M7*F54","v":0},null,null,null,null,""]
[{"$f":"SUM(A57:B61)","v":228},null,{"$f":"SUM(C57:C61)","v":0},null,null,{"$f":"SUM(F57:F61)","v":0},null,null,{"$f":"SUM(I53:I61)","v":0},null,null,null,null,""]
[]
["ACHATS"]
[]
[]
[null,null,null,null,null,null,null,null,null,null,null,null,null,""]
["ARRETS",null,null,null,null,null,null,null,null,null,null,null,null,""]
["Horamètre","CIRCUIT","MACHINE","CAUSE","DUREE (en mn)",null,null,"COMMENTAIRES",null,null,null,null,null,""]
[null,null,null,null,"Panne","Entretien","AUTRE",null,null,null,null,null,null,""]
[null,null,null,null,null,null,null,null,null,null,null,null,null,""]
[null,null,null,null,null,null,null,null,null,null,null,null,null,""]
[null,null,null,null,null,null,null,null,null,null,null,null,null,""]
[]
[]
[]
[]
["Observations\n  (pour garder une trace d'un fait particulier)"]

{"sheet":"24","index":25,"n_rows":78,"n_cols":14,"rows_kept":78,"cut":false,"hidden":false,"merged":[[0,0,0,11],[26,1,26,6],[51,0,51,2],[51,3,51,5],[51,6,51,8]]}
["RAPPORT JOURNALIER"]
[]
["DATE :"]
["EXPLOITATION DE:",null,null,"RESPONSABLE",null,"METEO"]
[]
[]
[null,null,null,"H DE PRODUCTIONS PREVUES"]
["POINTAGE PERSONNEL"]
[]
["NOM PRENOM","AFFECTATION","Nombre\nd'heure","AFFECTATION","Nombre\nd'heure","AFFECTATION","Nombre\nd'heure","TOTAL HORAIRE JOUR"]
[null,null,null,null,null,null,null,{"$f":"C11+E11+G11","v":0}]
[null,null,null,null,null,null,null,{"$f":"C12+E12+G12","v":0}]
[null,null,null,null,null,null,null,{"$f":"C13+E13+G13","v":0}]
[null,null,null,null,null,null,null,0]
[null,null,null,null,null,null,null,0]
[null,null,null,null,null,null,null,0]
[null,null,null,null,null,null,null,{"$f":"C17+E17+G17","v":0}]
[null,null,null,null,null,null,null,{"$f":"C18+E18+G18","v":0}]
[null,null,null,null,null,null,null,{"$f":"C19+E19+G19","v":0}]
[null,null,null,null,null,null,null,0]
[null,null,null,null,null,null,null,0]
[null,null,null,null,null,null,null,0]
[]
["POINTAGE MATERIEL"]
[]
["ENGINS DE PRODUCTION"]
["TYPE","AFFECTATION HORAIRE",null,null,null,null,null,"TOTAL\n HORAIRE JOUR","GNR","HORAMETRE \nMATIN","HORAMETRE \nSOIR","CONTRÔLE"]
[null,null,null,null,null,null,null,{"$f":"C28+E28+G28","v":0},null,null,null,{"$f":"IF(K28-J28=H28,\"OK\",\"FAUX\")","v":"OK"}]
[null,null,null,null,null,null,null,{"$f":"C29+E29+G29","v":0},null,null,null,{"$f":"IF(K29-J29=H29,\"OK\",\"FAUX\")","v":"OK"}]
[null,null,null,null,null,null,null,0,null,null,null,"OK"]
[null,null,null,null,null,null,null,0,null,null,null,"OK"]
[null,null,null,null,null,null,null,0,null,null,null,"OK"]
[null,null,null,null,null,null,null,0,null,null,null,"OK"]
[]
["VEHICULES DE LIAISON","HORAMETRE MATIN","SOIR","GNR","HEURE\n FONTIONNEMENT"]
[null,null,null,null,{"$f":"C36-B36","v":0}]
[null,null,null,null,{"$f":"C37-B37","v":0}]
[null,null,null,null,0]
[]
[]
["RAPPORT DE PRODUCTION "]
[]
[null,"COMPTEUR HORAIRE","H/FONCT"]
["PRIMAIRE (Production Plaine)"]
["SECONDAIRE (Production Bascule  Tunnel)"]
["TERTIAIRE (frabrication concassée)"]
["BIG BAG"]
["Compteur d'eau"]
[]
[]
[null,null,null,null,"BIG BAG"]
["PRIMAIRE",null,null,"SECONDAIRE",null,null,"TERTIAIRE"]
["ALIMENTATION","Tout venant Brut",null,"FABRICATION","0/4SCL",null,"CONCASSES","0/2C"]
["Plaine","Tout venant Brut",null,"FABRICATION","M0/16",null,"CONCASSES","2/4C"]
["T120","Tout venant écreté",{"$f":"C54*0.95","v":0},"FABRICATION","M0/8",null,"CONCASSES","4/6C"]
["Débit mesuré en T/h","GRANULOMETRIE","TONNAGES",null,"GRANULOMETRIE","TONNAGES","CONCASSES","4/10C"]
[50,"04 NATUREL",{"$f":"C53*D57","v":0},0.22,"SABLE 0/4R",{"$f":"C57-(F53*'GNR ET ELEMENTS DE PROD'!L10)-('24'!F54*'GNR ET ELEMENTS DE PROD'!L7)","v":0},"CONCASSES","6/10C"]
[36,"4/8R",{"$f":"C53*D58","v":0},0.16,"4/8R",{"$f":"C58","v":0},"CONCASSES"]
[42,"8/16R",{"$f":"C53*D59","v":0},0.18,"8/16R",{"$f":"C59-F54*'GNR ET ELEMENTS DE PROD'!N7","v":0},"CONCASSES"]
[32,"11/22R",{"$f":"C53*D60","v":0},0.14000000000000001,"11/22R",{"$f":"C60","v":0},"CONCASSES","0/4C",{"$f":"-F54*'GNR ET ELEMENTS DE PROD'!K7-F53*'GNR ET ELEMENTS DE PROD'!K10","v":0},null,null,null,null,""]
[68,"22/80",{"$f":"C53*D61","v":0},0.3,"22/80",{"$f":"C63-I55-I5-ABS(I57)","v":0},"CONCASSES","6,3/10",{"$f":"+-'GNR ET ELEMENTS DE PROD'!M7*F54","v":0},null,null,null,null,""]
[{"$f":"SUM(A57:B61)","v":228},null,{"$f":"SUM(C57:C61)","v":0},null,null,{"$f":"SUM(F57:F61)","v":0},null,null,{"$f":"SUM(I53:I61)","v":0},null,null,null,null,""]
[]
["ACHATS"]
[]
[]
[null,null,null,null,null,null,null,null,null,null,null,null,null,""]
["ARRETS",null,null,null,null,null,null,null,null,null,null,null,null,""]
["Horamètre","CIRCUIT","MACHINE","CAUSE","DUREE (en mn)",null,null,"COMMENTAIRES",null,null,null,null,null,""]
[null,null,null,null,"Panne","Entretien","AUTRE",null,null,null,null,null,null,""]
[null,null,null,null,null,null,null,null,null,null,null,null,null,""]
[null,null,null,null,null,null,null,null,null,null,null,null,null,""]
[null,null,null,null,null,null,null,null,null,null,null,null,null,""]
[]
[]
[]
[]
["Observations\n  (pour garder une trace d'un fait particulier)"]

{"sheet":"25","index":26,"n_rows":78,"n_cols":14,"rows_kept":78,"cut":false,"hidden":false,"merged":[[0,0,0,11],[26,1,26,6],[51,0,51,2],[51,3,51,5],[51,6,51,8]]}
["RAPPORT JOURNALIER"]
[]
["DATE :"]
["EXPLOITATION DE:",null,null,"RESPONSABLE",null,"METEO"]
[]
[]
[null,null,null,"H DE PRODUCTIONS PREVUES"]
["POINTAGE PERSONNEL"]
[]
["NOM PRENOM","AFFECTATION","Nombre\nd'heure","AFFECTATION","Nombre\nd'heure","AFFECTATION","Nombre\nd'heure","TOTAL HORAIRE JOUR"]
[null,null,null,null,null,null,null,{"$f":"C11+E11+G11","v":0}]
[null,null,null,null,null,null,null,{"$f":"C12+E12+G12","v":0}]
[null,null,null,null,null,null,null,{"$f":"C13+E13+G13","v":0}]
[null,null,null,null,null,null,null,0]
[null,null,null,null,null,null,null,0]
[null,null,null,null,null,null,null,0]
[null,null,null,null,null,null,null,{"$f":"C17+E17+G17","v":0}]
[null,null,null,null,null,null,null,{"$f":"C18+E18+G18","v":0}]
[null,null,null,null,null,null,null,{"$f":"C19+E19+G19","v":0}]
[null,null,null,null,null,null,null,0]
[null,null,null,null,null,null,null,0]
[null,null,null,null,null,null,null,0]
[]
["POINTAGE MATERIEL"]
[]
["ENGINS DE PRODUCTION"]
["TYPE","AFFECTATION HORAIRE",null,null,null,null,null,"TOTAL\n HORAIRE JOUR","GNR","HORAMETRE \nMATIN","HORAMETRE \nSOIR","CONTRÔLE"]
[null,null,null,null,null,null,null,{"$f":"C28+E28+G28","v":0},null,null,null,{"$f":"IF(K28-J28=H28,\"OK\",\"FAUX\")","v":"OK"}]
[null,null,null,null,null,null,null,{"$f":"C29+E29+G29","v":0},null,null,null,{"$f":"IF(K29-J29=H29,\"OK\",\"FAUX\")","v":"OK"}]
[null,null,null,null,null,null,null,0,null,null,null,"OK"]
[null,null,null,null,null,null,null,0,null,null,null,"OK"]
[null,null,null,null,null,null,null,0,null,null,null,"OK"]
[null,null,null,null,null,null,null,0,null,null,null,"OK"]
[]
["VEHICULES DE LIAISON","HORAMETRE MATIN","SOIR","GNR","HEURE\n FONTIONNEMENT"]
[null,null,null,null,{"$f":"C36-B36","v":0}]
[null,null,null,null,{"$f":"C37-B37","v":0}]
[null,null,null,null,0]
[]
[]
["RAPPORT DE PRODUCTION "]
[]
[null,"COMPTEUR HORAIRE","H/FONCT"]
["PRIMAIRE (Production Plaine)"]
["SECONDAIRE (Production Bascule  Tunnel)"]
["TERTIAIRE (frabrication concassée)"]
["BIG BAG"]
["Compteur d'eau"]
[]
[]
[null,null,null,null,"BIG BAG"]
["PRIMAIRE",null,null,"SECONDAIRE",null,null,"TERTIAIRE"]
["ALIMENTATION","Tout venant Brut",null,"FABRICATION","0/4SCL",null,"CONCASSES","0/2C"]
["Plaine","Tout venant Brut",null,"FABRICATION","M0/16",null,"CONCASSES","2/4C"]
["T120","Tout venant écreté",{"$f":"C54*0.95","v":0},"FABRICATION","M0/8",null,"CONCASSES","4/6C"]
["Débit mesuré en T/h","GRANULOMETRIE","TONNAGES",null,"GRANULOMETRIE","TONNAGES","CONCASSES","4/10C"]
[50,"04 NATUREL",{"$f":"C53*D57","v":0},0.22,"SABLE 0/4R",{"$f":"C57-(F53*'GNR ET ELEMENTS DE PROD'!L10)-('25'!F54*'GNR ET ELEMENTS DE PROD'!L7)","v":0},"CONCASSES","6/10C"]
[36,"4/8R",{"$f":"C53*D58","v":0},0.16,"4/8R",{"$f":"C58","v":0},"CONCASSES"]
[42,"8/16R",{"$f":"C53*D59","v":0},0.18,"8/16R",{"$f":"C59-F54*'GNR ET ELEMENTS DE PROD'!N7","v":0},"CONCASSES"]
[32,"11/22R",{"$f":"C53*D60","v":0},0.14000000000000001,"11/22R",{"$f":"C60","v":0},"CONCASSES","0/4C",{"$f":"-F54*'GNR ET ELEMENTS DE PROD'!K7-F53*'GNR ET ELEMENTS DE PROD'!K10","v":0},null,null,null,null,""]
[68,"22/80",{"$f":"C53*D61","v":0},0.3,"22/80",{"$f":"C63-I55-I5-ABS(I57)","v":0},"CONCASSES","6,3/10",{"$f":"+-'GNR ET ELEMENTS DE PROD'!M7*F54","v":0},null,null,null,null,""]
[{"$f":"SUM(A57:B61)","v":228},null,{"$f":"SUM(C57:C61)","v":0},null,null,{"$f":"SUM(F57:F61)","v":0},null,null,{"$f":"SUM(I53:I61)","v":0},null,null,null,null,""]
[]
["ACHATS"]
[]
[]
[null,null,null,null,null,null,null,null,null,null,null,null,null,""]
["ARRETS",null,null,null,null,null,null,null,null,null,null,null,null,""]
["Horamètre","CIRCUIT","MACHINE","CAUSE","DUREE (en mn)",null,null,"COMMENTAIRES",null,null,null,null,null,""]
[null,null,null,null,"Panne","Entretien","AUTRE",null,null,null,null,null,null,""]
[null,null,null,null,null,null,null,null,null,null,null,null,null,""]
[null,null,null,null,null,null,null,null,null,null,null,null,null,""]
[null,null,null,null,null,null,null,null,null,null,null,null,null,""]
[]
[]
[]
[]
["Observations\n  (pour garder une trace d'un fait particulier)"]

{"sheet":"26","index":27,"n_rows":78,"n_cols":14,"rows_kept":78,"cut":false,"hidden":false,"merged":[[0,0,0,11],[26,1,26,6],[51,0,51,2],[51,3,51,5],[51,6,51,8]]}
["RAPPORT JOURNALIER"]
[]
["DATE :"]
["EXPLOITATION DE:",null,null,"RESPONSABLE",null,"METEO"]
[]
[]
[null,null,null,"H DE PRODUCTIONS PREVUES"]
["POINTAGE PERSONNEL"]
[]
["NOM PRENOM","AFFECTATION","Nombre\nd'heure","AFFECTATION","Nombre\nd'heure","AFFECTATION","Nombre\nd'heure","TOTAL HORAIRE JOUR"]
[null,null,null,null,null,null,null,{"$f":"C11+E11+G11","v":0}]
[null,null,null,null,null,null,null,{"$f":"C12+E12+G12","v":0}]
[null,null,null,null,null,null,null,{"$f":"C13+E13+G13","v":0}]
[null,null,null,null,null,null,null,0]
[null,null,null,null,null,null,null,0]
[null,null,null,null,null,null,null,0]
[null,null,null,null,null,null,null,{"$f":"C17+E17+G17","v":0}]
[null,null,null,null,null,null,null,{"$f":"C18+E18+G18","v":0}]
[null,null,null,null,null,null,null,{"$f":"C19+E19+G19","v":0}]
[null,null,null,null,null,null,null,0]
[null,null,null,null,null,null,null,0]
[null,null,null,null,null,null,null,0]
[]
["POINTAGE MATERIEL"]
[]
["ENGINS DE PRODUCTION"]
["TYPE","AFFECTATION HORAIRE",null,null,null,null,null,"TOTAL\n HORAIRE JOUR","GNR","HORAMETRE \nMATIN","HORAMETRE \nSOIR","CONTRÔLE"]
[null,null,null,null,null,null,null,{"$f":"C28+E28+G28","v":0},null,null,null,{"$f":"IF(K28-J28=H28,\"OK\",\"FAUX\")","v":"OK"}]
[null,null,null,null,null,null,null,{"$f":"C29+E29+G29","v":0},null,null,null,{"$f":"IF(K29-J29=H29,\"OK\",\"FAUX\")","v":"OK"}]
[null,null,null,null,null,null,null,0,null,null,null,"OK"]
[null,null,null,null,null,null,null,0,null,null,null,"OK"]
[null,null,null,null,null,null,null,0,null,null,null,"OK"]
[null,null,null,null,null,null,null,0,null,null,null,"OK"]
[]
["VEHICULES DE LIAISON","HORAMETRE MATIN","SOIR","GNR","HEURE\n FONTIONNEMENT"]
[null,null,null,null,{"$f":"C36-B36","v":0}]
[null,null,null,null,{"$f":"C37-B37","v":0}]
[null,null,null,null,0]
[]
[]
["RAPPORT DE PRODUCTION "]
[]
[null,"COMPTEUR HORAIRE","H/FONCT"]
["PRIMAIRE (Production Plaine)"]
["SECONDAIRE (Production Bascule  Tunnel)"]
["TERTIAIRE (frabrication concassée)"]
["BIG BAG"]
["Compteur d'eau"]
[]
[]
[null,null,null,null,"BIG BAG"]
["PRIMAIRE",null,null,"SECONDAIRE",null,null,"TERTIAIRE"]
["ALIMENTATION","Tout venant Brut",null,"FABRICATION","0/4SCL",null,"CONCASSES","0/2C"]
["Plaine","Tout venant Brut",null,"FABRICATION","M0/16",null,"CONCASSES","2/4C"]
["T120","Tout venant écreté",{"$f":"C54*0.95","v":0},"FABRICATION","M0/8",null,"CONCASSES","4/6C"]
["Débit mesuré en T/h","GRANULOMETRIE","TONNAGES",null,"GRANULOMETRIE","TONNAGES","CONCASSES","4/10C"]
[50,"04 NATUREL",{"$f":"C53*D57","v":0},0.22,"SABLE 0/4R",{"$f":"C57-(F53*'GNR ET ELEMENTS DE PROD'!L10)-('26'!F54*'GNR ET ELEMENTS DE PROD'!L7)","v":0},"CONCASSES","6/10C"]
[36,"4/8R",{"$f":"C53*D58","v":0},0.16,"4/8R",{"$f":"C58","v":0},"CONCASSES"]
[42,"8/16R",{"$f":"C53*D59","v":0},0.18,"8/16R",{"$f":"C59-F54*'GNR ET ELEMENTS DE PROD'!N7","v":0},"CONCASSES"]
[32,"11/22R",{"$f":"C53*D60","v":0},0.14000000000000001,"11/22R",{"$f":"C60","v":0},"CONCASSES","0/4C",{"$f":"-F54*'GNR ET ELEMENTS DE PROD'!K7-F53*'GNR ET ELEMENTS DE PROD'!K10","v":0},null,null,null,null,""]
[68,"22/80",{"$f":"C53*D61","v":0},0.3,"22/80",{"$f":"C63-I55-I5-ABS(I57)","v":0},"CONCASSES","6,3/10",{"$f":"+-'GNR ET ELEMENTS DE PROD'!M7*F54","v":0},null,null,null,null,""]
[{"$f":"SUM(A57:B61)","v":228},null,{"$f":"SUM(C57:C61)","v":0},null,null,{"$f":"SUM(F57:F61)","v":0},null,null,{"$f":"SUM(I53:I61)","v":0},null,null,null,null,""]
[]
["ACHATS"]
[]
[]
[null,null,null,null,null,null,null,null,null,null,null,null,null,""]
["ARRETS",null,null,null,null,null,null,null,null,null,null,null,null,""]
["Horamètre","CIRCUIT","MACHINE","CAUSE","DUREE (en mn)",null,null,"COMMENTAIRES",null,null,null,null,null,""]
[null,null,null,null,"Panne","Entretien","AUTRE",null,null,null,null,null,null,""]
[null,null,null,null,null,null,null,null,null,null,null,null,null,""]
[null,null,null,null,null,null,null,null,null,null,null,null,null,""]
[null,null,null,null,null,null,null,null,null,null,null,null,null,""]
[]
[]
[]
[]
["Observations\n  (pour garder une trace d'un fait particulier)"]

{"sheet":"27","index":28,"n_rows":78,"n_cols":14,"rows_kept":78,"cut":false,"hidden":false,"merged":[[0,0,0,11],[26,1,26,6],[51,0,51,2],[51,3,51,5],[51,6,51,8]]}
["RAPPORT JOURNALIER"]
[]
["DATE :"]
["EXPLOITATION DE:",null,null,"RESPONSABLE",null,"METEO"]
[]
[]
[null,null,null,"H DE PRODUCTIONS PREVUES"]
["POINTAGE PERSONNEL"]
[]
["NOM PRENOM","AFFECTATION","Nombre\nd'heure","AFFECTATION","Nombre\nd'heure","AFFECTATION","Nombre\nd'heure","TOTAL HORAIRE JOUR"]
[null,null,null,null,null,null,null,{"$f":"C11+E11+G11","v":0}]
[null,null,null,null,null,null,null,{"$f":"C12+E12+G12","v":0}]
[null,null,null,null,null,null,null,{"$f":"C13+E13+G13","v":0}]
[null,null,null,null,null,null,null,0]
[null,null,null,null,null,null,null,0]
[null,null,null,null,null,null,null,0]
[null,null,null,null,null,null,null,{"$f":"C17+E17+G17","v":0}]
[null,null,null,null,null,null,null,{"$f":"C18+E18+G18","v":0}]
[null,null,null,null,null,null,null,{"$f":"C19+E19+G19","v":0}]
[null,null,null,null,null,null,null,0]
[null,null,null,null,null,null,null,0]
[null,null,null,null,null,null,null,0]
[]
["POINTAGE MATERIEL"]
[]
["ENGINS DE PRODUCTION"]
["TYPE","AFFECTATION HORAIRE",null,null,null,null,null,"TOTAL\n HORAIRE JOUR","GNR","HORAMETRE \nMATIN","HORAMETRE \nSOIR","CONTRÔLE"]
[null,null,null,null,null,null,null,{"$f":"C28+E28+G28","v":0},null,null,null,{"$f":"IF(K28-J28=H28,\"OK\",\"FAUX\")","v":"OK"}]
[null,null,null,null,null,null,null,{"$f":"C29+E29+G29","v":0},null,null,null,{"$f":"IF(K29-J29=H29,\"OK\",\"FAUX\")","v":"OK"}]
[null,null,null,null,null,null,null,0,null,null,null,"OK"]
[null,null,null,null,null,null,null,0,null,null,null,"OK"]
[null,null,null,null,null,null,null,0,null,null,null,"OK"]
[null,null,null,null,null,null,null,0,null,null,null,"OK"]
[]
["VEHICULES DE LIAISON","HORAMETRE MATIN","SOIR","GNR","HEURE\n FONTIONNEMENT"]
[null,null,null,null,{"$f":"C36-B36","v":0}]
[null,null,null,null,{"$f":"C37-B37","v":0}]
[null,null,null,null,0]
[]
[]
["RAPPORT DE PRODUCTION "]
[]
[null,"COMPTEUR HORAIRE","H/FONCT"]
["PRIMAIRE (Production Plaine)"]
["SECONDAIRE (Production Bascule  Tunnel)"]
["TERTIAIRE (frabrication concassée)"]
["BIG BAG"]
["Compteur d'eau"]
[]
[]
[null,null,null,null,"BIG BAG"]
["PRIMAIRE",null,null,"SECONDAIRE",null,null,"TERTIAIRE"]
["ALIMENTATION","Tout venant Brut",null,"FABRICATION","0/4SCL",null,"CONCASSES","0/2C"]
["Plaine","Tout venant Brut",null,"FABRICATION","M0/16",null,"CONCASSES","2/4C"]
["T120","Tout venant écreté",{"$f":"C54*0.95","v":0},"FABRICATION","M0/8",null,"CONCASSES","4/6C"]
["Débit mesuré en T/h","GRANULOMETRIE","TONNAGES",null,"GRANULOMETRIE","TONNAGES","CONCASSES","4/10C"]
[50,"04 NATUREL",{"$f":"C53*D57","v":0},0.22,"SABLE 0/4R",{"$f":"C57-(F53*'GNR ET ELEMENTS DE PROD'!L10)-('27'!F54*'GNR ET ELEMENTS DE PROD'!L7)","v":0},"CONCASSES","6/10C"]
[36,"4/8R",{"$f":"C53*D58","v":0},0.16,"4/8R",{"$f":"C58","v":0},"CONCASSES"]
[42,"8/16R",{"$f":"C53*D59","v":0},0.18,"8/16R",{"$f":"C59-F54*'GNR ET ELEMENTS DE PROD'!N7","v":0},"CONCASSES"]
[32,"11/22R",{"$f":"C53*D60","v":0},0.14000000000000001,"11/22R",{"$f":"C60","v":0},"CONCASSES","0/4C",{"$f":"-F54*'GNR ET ELEMENTS DE PROD'!K7-F53*'GNR ET ELEMENTS DE PROD'!K10","v":0},null,null,null,null,""]
[68,"22/80",{"$f":"C53*D61","v":0},0.3,"22/80",{"$f":"C63-I55-I5-ABS(I57)","v":0},"CONCASSES","6,3/10",{"$f":"+-'GNR ET ELEMENTS DE PROD'!M7*F54","v":0},null,null,null,null,""]
[{"$f":"SUM(A57:B61)","v":228},null,{"$f":"SUM(C57:C61)","v":0},null,null,{"$f":"SUM(F57:F61)","v":0},null,null,{"$f":"SUM(I53:I61)","v":0},null,null,null,null,""]
[]
["ACHATS"]
[]
[]
[null,null,null,null,null,null,null,null,null,null,null,null,null,""]
["ARRETS",null,null,null,null,null,null,null,null,null,null,null,null,""]
["Horamètre","CIRCUIT","MACHINE","CAUSE","DUREE (en mn)",null,null,"COMMENTAIRES",null,null,null,null,null,""]
[null,null,null,null,"Panne","Entretien","AUTRE",null,null,null,null,null,null,""]
[null,null,null,null,null,null,null,null,null,null,null,null,null,""]
[null,null,null,null,null,null,null,null,null,null,null,null,null,""]
[null,null,null,null,null,null,null,null,null,null,null,null,null,""]
[]
[]
[]
[]
["Observations\n  (pour garder une trace d'un fait particulier)"]

{"sheet":"28","index":29,"n_rows":78,"n_cols":14,"rows_kept":78,"cut":false,"hidden":false,"merged":[[0,0,0,11],[26,1,26,6],[51,0,51,2],[51,3,51,5],[51,6,51,8]]}
["RAPPORT JOURNALIER"]
[]
["DATE :"]
["EXPLOITATION DE:",null,null,"RESPONSABLE",null,"METEO"]
[]
[]
[null,null,null,"H DE PRODUCTIONS PREVUES"]
["POINTAGE PERSONNEL"]
[]
["NOM PRENOM","AFFECTATION","Nombre\nd'heure","AFFECTATION","Nombre\nd'heure","AFFECTATION","Nombre\nd'heure","TOTAL HORAIRE JOUR"]
[null,null,null,null,null,null,null,{"$f":"C11+E11+G11","v":0}]
[null,null,null,null,null,null,null,{"$f":"C12+E12+G12","v":0}]
[null,null,null,null,null,null,null,{"$f":"C13+E13+G13","v":0}]
[null,null,null,null,null,null,null,0]
[null,null,null,null,null,null,null,0]
[null,null,null,null,null,null,null,0]
[null,null,null,null,null,null,null,{"$f":"C17+E17+G17","v":0}]
[null,null,null,null,null,null,null,{"$f":"C18+E18+G18","v":0}]
[null,null,null,null,null,null,null,{"$f":"C19+E19+G19","v":0}]
[null,null,null,null,null,null,null,0]
[null,null,null,null,null,null,null,0]
[null,null,null,null,null,null,null,0]
[]
["POINTAGE MATERIEL"]
[]
["ENGINS DE PRODUCTION"]
["TYPE","AFFECTATION HORAIRE",null,null,null,null,null,"TOTAL\n HORAIRE JOUR","GNR","HORAMETRE \nMATIN","HORAMETRE \nSOIR","CONTRÔLE"]
[null,null,null,null,null,null,null,{"$f":"C28+E28+G28","v":0},null,null,null,{"$f":"IF(K28-J28=H28,\"OK\",\"FAUX\")","v":"OK"}]
[null,null,null,null,null,null,null,{"$f":"C29+E29+G29","v":0},null,null,null,{"$f":"IF(K29-J29=H29,\"OK\",\"FAUX\")","v":"OK"}]
[null,null,null,null,null,null,null,0,null,null,null,"OK"]
[null,null,null,null,null,null,null,0,null,null,null,"OK"]
[null,null,null,null,null,null,null,0,null,null,null,"OK"]
[null,null,null,null,null,null,null,0,null,null,null,"OK"]
[]
["VEHICULES DE LIAISON","HORAMETRE MATIN","SOIR","GNR","HEURE\n FONTIONNEMENT"]
[null,null,null,null,{"$f":"C36-B36","v":0}]
[null,null,null,null,{"$f":"C37-B37","v":0}]
[null,null,null,null,0]
[]
[]
["RAPPORT DE PRODUCTION "]
[]
[null,"COMPTEUR HORAIRE","H/FONCT"]
["PRIMAIRE (Production Plaine)"]
["SECONDAIRE (Production Bascule  Tunnel)"]
["TERTIAIRE (frabrication concassée)"]
["BIG BAG"]
["Compteur d'eau"]
[]
[]
[null,null,null,null,"BIG BAG"]
["PRIMAIRE",null,null,"SECONDAIRE",null,null,"TERTIAIRE"]
["ALIMENTATION","Tout venant Brut",null,"FABRICATION","0/4SCL",null,"CONCASSES","0/2C"]
["Plaine","Tout venant Brut",null,"FABRICATION","M0/16",null,"CONCASSES","2/4C"]
["T120","Tout venant écreté",{"$f":"C54*0.95","v":0},"FABRICATION","M0/8",null,"CONCASSES","4/6C"]
["Débit mesuré en T/h","GRANULOMETRIE","TONNAGES",null,"GRANULOMETRIE","TONNAGES","CONCASSES","4/10C"]
[50,"04 NATUREL",{"$f":"C53*D57","v":0},0.22,"SABLE 0/4R",{"$f":"C57-(F53*'GNR ET ELEMENTS DE PROD'!L10)-('28'!F54*'GNR ET ELEMENTS DE PROD'!L7)","v":0},"CONCASSES","6/10C"]
[36,"4/8R",{"$f":"C53*D58","v":0},0.16,"4/8R",{"$f":"C58","v":0},"CONCASSES"]
[42,"8/16R",{"$f":"C53*D59","v":0},0.18,"8/16R",{"$f":"C59-F54*'GNR ET ELEMENTS DE PROD'!N7","v":0},"CONCASSES"]
[32,"11/22R",{"$f":"C53*D60","v":0},0.14000000000000001,"11/22R",{"$f":"C60","v":0},"CONCASSES","0/4C",{"$f":"-F54*'GNR ET ELEMENTS DE PROD'!K7-F53*'GNR ET ELEMENTS DE PROD'!K10","v":0},null,null,null,null,""]
[68,"22/80",{"$f":"C53*D61","v":0},0.3,"22/80",{"$f":"C63-I55-I5-ABS(I57)","v":0},"CONCASSES","6,3/10",{"$f":"+-'GNR ET ELEMENTS DE PROD'!M7*F54","v":0},null,null,null,null,""]
[{"$f":"SUM(A57:B61)","v":228},null,{"$f":"SUM(C57:C61)","v":0},null,null,{"$f":"SUM(F57:F61)","v":0},null,null,{"$f":"SUM(I53:I61)","v":0},null,null,null,null,""]
[]
["ACHATS"]
[]
[]
[null,null,null,null,null,null,null,null,null,null,null,null,null,""]
["ARRETS",null,null,null,null,null,null,null,null,null,null,null,null,""]
["Horamètre","CIRCUIT","MACHINE","CAUSE","DUREE (en mn)",null,null,"COMMENTAIRES",null,null,null,null,null,""]
[null,null,null,null,"Panne","Entretien","AUTRE",null,null,null,null,null,null,""]
[null,null,null,null,null,null,null,null,null,null,null,null,null,""]
[null,null,null,null,null,null,null,null,null,null,null,null,null,""]
[null,null,null,null,null,null,null,null,null,null,null,null,null,""]
[]
[]
[]
[]
["Observations\n  (pour garder une trace d'un fait particulier)"]

{"sheet":"29","index":30,"n_rows":78,"n_cols":14,"rows_kept":78,"cut":false,"hidden":false,"merged":[[0,0,0,11],[26,1,26,6],[51,0,51,2],[51,3,51,5],[51,6,51,8]]}
["RAPPORT JOURNALIER"]
[]
["DATE :"]
["EXPLOITATION DE:",null,null,"RESPONSABLE",null,"METEO"]
[]
[]
[null,null,null,"H DE PRODUCTIONS PREVUES"]
["POINTAGE PERSONNEL"]
[]
["NOM PRENOM","AFFECTATION","Nombre\nd'heure","AFFECTATION","Nombre\nd'heure","AFFECTATION","Nombre\nd'heure","TOTAL HORAIRE JOUR"]
[null,null,null,null,null,null,null,{"$f":"C11+E11+G11","v":0}]
[null,null,null,null,null,null,null,{"$f":"C12+E12+G12","v":0}]
[null,null,null,null,null,null,null,{"$f":"C13+E13+G13","v":0}]
[null,null,null,null,null,null,null,0]
[null,null,null,null,null,null,null,0]
[null,null,null,null,null,null,null,0]
[null,null,null,null,null,null,null,{"$f":"C17+E17+G17","v":0}]
[null,null,null,null,null,null,null,{"$f":"C18+E18+G18","v":0}]
[null,null,null,null,null,null,null,{"$f":"C19+E19+G19","v":0}]
[null,null,null,null,null,null,null,0]
[null,null,null,null,null,null,null,0]
[null,null,null,null,null,null,null,0]
[]
["POINTAGE MATERIEL"]
[]
["ENGINS DE PRODUCTION"]
["TYPE","AFFECTATION HORAIRE",null,null,null,null,null,"TOTAL\n HORAIRE JOUR","GNR","HORAMETRE \nMATIN","HORAMETRE \nSOIR","CONTRÔLE"]
[null,null,null,null,null,null,null,{"$f":"C28+E28+G28","v":0},null,null,null,{"$f":"IF(K28-J28=H28,\"OK\",\"FAUX\")","v":"OK"}]
[null,null,null,null,null,null,null,{"$f":"C29+E29+G29","v":0},null,null,null,{"$f":"IF(K29-J29=H29,\"OK\",\"FAUX\")","v":"OK"}]
[null,null,null,null,null,null,null,0,null,null,null,"OK"]
[null,null,null,null,null,null,null,0,null,null,null,"OK"]
[null,null,null,null,null,null,null,0,null,null,null,"OK"]
[null,null,null,null,null,null,null,0,null,null,null,"OK"]
[]
["VEHICULES DE LIAISON","HORAMETRE MATIN","SOIR","GNR","HEURE\n FONTIONNEMENT"]
[null,null,null,null,{"$f":"C36-B36","v":0}]
[null,null,null,null,{"$f":"C37-B37","v":0}]
[null,null,null,null,0]
[]
[]
["RAPPORT DE PRODUCTION "]
[]
[null,"COMPTEUR HORAIRE","H/FONCT"]
["PRIMAIRE (Production Plaine)"]
["SECONDAIRE (Production Bascule  Tunnel)"]
["TERTIAIRE (frabrication concassée)"]
["BIG BAG"]
["Compteur d'eau"]
[]
[]
[null,null,null,null,"BIG BAG"]
["PRIMAIRE",null,null,"SECONDAIRE",null,null,"TERTIAIRE"]
["ALIMENTATION","Tout venant Brut",null,"FABRICATION","0/4SCL",null,"CONCASSES","0/2C"]
["Plaine","Tout venant Brut",null,"FABRICATION","M0/16",null,"CONCASSES","2/4C"]
["T120","Tout venant écreté",{"$f":"C54*0.95","v":0},"FABRICATION","M0/8",null,"CONCASSES","4/6C"]
["Débit mesuré en T/h","GRANULOMETRIE","TONNAGES",null,"GRANULOMETRIE","TONNAGES","CONCASSES","4/10C"]
[50,"04 NATUREL",{"$f":"C53*D57","v":0},0.22,"SABLE 0/4R",{"$f":"C57-(F53*'GNR ET ELEMENTS DE PROD'!L10)-('29'!F54*'GNR ET ELEMENTS DE PROD'!L7)","v":0},"CONCASSES","6/10C"]
[36,"4/8R",{"$f":"C53*D58","v":0},0.16,"4/8R",{"$f":"C58","v":0},"CONCASSES"]
[42,"8/16R",{"$f":"C53*D59","v":0},0.18,"8/16R",{"$f":"C59-F54*'GNR ET ELEMENTS DE PROD'!N7","v":0},"CONCASSES"]
[32,"11/22R",{"$f":"C53*D60","v":0},0.14000000000000001,"11/22R",{"$f":"C60","v":0},"CONCASSES","0/4C",{"$f":"-F54*'GNR ET ELEMENTS DE PROD'!K7-F53*'GNR ET ELEMENTS DE PROD'!K10","v":0},null,null,null,null,""]
[68,"22/80",{"$f":"C53*D61","v":0},0.3,"22/80",{"$f":"C63-I55-I5-ABS(I57)","v":0},"CONCASSES","6,3/10",{"$f":"+-'GNR ET ELEMENTS DE PROD'!M7*F54","v":0},null,null,null,null,""]
[{"$f":"SUM(A57:B61)","v":228},null,{"$f":"SUM(C57:C61)","v":0},null,null,{"$f":"SUM(F57:F61)","v":0},null,null,{"$f":"SUM(I53:I61)","v":0},null,null,null,null,""]
[]
["ACHATS"]
[]
[]
[null,null,null,null,null,null,null,null,null,null,null,null,null,""]
["ARRETS",null,null,null,null,null,null,null,null,null,null,null,null,""]
["Horamètre","CIRCUIT","MACHINE","CAUSE","DUREE (en mn)",null,null,"COMMENTAIRES",null,null,null,null,null,""]
[null,null,null,null,"Panne","Entretien","AUTRE",null,null,null,null,null,null,""]
[null,null,null,null,null,null,null,null,null,null,null,null,null,""]
[null,null,null,null,null,null,null,null,null,null,null,null,null,""]
[null,null,null,null,null,null,null,null,null,null,null,null,null,""]
[]
[]
[]
[]
["Observations\n  (pour garder une trace d'un fait particulier)"]

{"sheet":"30","index":31,"n_rows":78,"n_cols":14,"rows_kept":78,"cut":false,"hidden":false,"merged":[[0,0,0,11],[26,1,26,6],[51,0,51,2],[51,3,51,5],[51,6,51,8]]}
["RAPPORT JOURNALIER"]
[]
["DATE :"]
["EXPLOITATION DE:",null,null,"RESPONSABLE",null,"METEO"]
[]
[]
[null,null,null,"H DE PRODUCTIONS PREVUES"]
["POINTAGE PERSONNEL"]
[]
["NOM PRENOM","AFFECTATION","Nombre\nd'heure","AFFECTATION","Nombre\nd'heure","AFFECTATION","Nombre\nd'heure","TOTAL HORAIRE JOUR"]
[null,null,null,null,null,null,null,{"$f":"C11+E11+G11","v":0}]
[null,null,null,null,null,null,null,{"$f":"C12+E12+G12","v":0}]
[null,null,null,null,null,null,null,{"$f":"C13+E13+G13","v":0}]
[null,null,null,null,null,null,null,0]
[null,null,null,null,null,null,null,0]
[null,null,null,null,null,null,null,0]
[null,null,null,null,null,null,null,{"$f":"C17+E17+G17","v":0}]
[null,null,null,null,null,null,null,{"$f":"C18+E18+G18","v":0}]
[null,null,null,null,null,null,null,{"$f":"C19+E19+G19","v":0}]
[null,null,null,null,null,null,null,0]
[null,null,null,null,null,null,null,0]
[null,null,null,null,null,null,null,0]
[]
["POINTAGE MATERIEL"]
[]
["ENGINS DE PRODUCTION"]
["TYPE","AFFECTATION HORAIRE",null,null,null,null,null,"TOTAL\n HORAIRE JOUR","GNR","HORAMETRE \nMATIN","HORAMETRE \nSOIR","CONTRÔLE"]
[null,null,null,null,null,null,null,{"$f":"C28+E28+G28","v":0},null,null,null,{"$f":"IF(K28-J28=H28,\"OK\",\"FAUX\")","v":"OK"}]
[null,null,null,null,null,null,null,{"$f":"C29+E29+G29","v":0},null,null,null,{"$f":"IF(K29-J29=H29,\"OK\",\"FAUX\")","v":"OK"}]
[null,null,null,null,null,null,null,0,null,null,null,"OK"]
[null,null,null,null,null,null,null,0,null,null,null,"OK"]
[null,null,null,null,null,null,null,0,null,null,null,"OK"]
[null,null,null,null,null,null,null,0,null,null,null,"OK"]
[]
["VEHICULES DE LIAISON","HORAMETRE MATIN","SOIR","GNR","HEURE\n FONTIONNEMENT"]
[null,null,null,null,{"$f":"C36-B36","v":0}]
[null,null,null,null,{"$f":"C37-B37","v":0}]
[null,null,null,null,0]
[]
[]
["RAPPORT DE PRODUCTION "]
[]
[null,"COMPTEUR HORAIRE","H/FONCT"]
["PRIMAIRE (Production Plaine)"]
["SECONDAIRE (Production Bascule  Tunnel)"]
["TERTIAIRE (frabrication concassée)"]
["BIG BAG"]
["Compteur d'eau"]
[]
[]
[null,null,null,null,"BIG BAG"]
["PRIMAIRE",null,null,"SECONDAIRE",null,null,"TERTIAIRE"]
["ALIMENTATION","Tout venant Brut",null,"FABRICATION","0/4SCL",null,"CONCASSES","0/2C"]
["Plaine","Tout venant Brut",null,"FABRICATION","M0/16",null,"CONCASSES","2/4C"]
["T120","Tout venant écreté",{"$f":"C54*0.95","v":0},"FABRICATION","M0/8",null,"CONCASSES","4/6C"]
["Débit mesuré en T/h","GRANULOMETRIE","TONNAGES",null,"GRANULOMETRIE","TONNAGES","CONCASSES","4/10C"]
[50,"04 NATUREL",{"$f":"C53*D57","v":0},0.22,"SABLE 0/4R",{"$f":"C57-(F53*'GNR ET ELEMENTS DE PROD'!L10)-('30'!F54*'GNR ET ELEMENTS DE PROD'!L7)","v":0},"CONCASSES","6/10C"]
[36,"4/8R",{"$f":"C53*D58","v":0},0.16,"4/8R",{"$f":"C58","v":0},"CONCASSES"]
[42,"8/16R",{"$f":"C53*D59","v":0},0.18,"8/16R",{"$f":"C59-F54*'GNR ET ELEMENTS DE PROD'!N7","v":0},"CONCASSES"]
[32,"11/22R",{"$f":"C53*D60","v":0},0.14000000000000001,"11/22R",{"$f":"C60","v":0},"CONCASSES","0/4C",{"$f":"-F54*'GNR ET ELEMENTS DE PROD'!K7-F53*'GNR ET ELEMENTS DE PROD'!K10","v":0},null,null,null,null,""]
[68,"22/80",{"$f":"C53*D61","v":0},0.3,"22/80",{"$f":"C63-I55-I5-ABS(I57)","v":0},"CONCASSES","6,3/10",{"$f":"+-'GNR ET ELEMENTS DE PROD'!M7*F54","v":0},null,null,null,null,""]
[{"$f":"SUM(A57:B61)","v":228},null,{"$f":"SUM(C57:C61)","v":0},null,null,{"$f":"SUM(F57:F61)","v":0},null,null,{"$f":"SUM(I53:I61)","v":0},null,null,null,null,""]
[]
["ACHATS"]
[]
[]
[null,null,null,null,null,null,null,null,null,null,null,null,null,""]
["ARRETS",null,null,null,null,null,null,null,null,null,null,null,null,""]
["Horamètre","CIRCUIT","MACHINE","CAUSE","DUREE (en mn)",null,null,"COMMENTAIRES",null,null,null,null,null,""]
[null,null,null,null,"Panne","Entretien","AUTRE",null,null,null,null,null,null,""]
[null,null,null,null,null,null,null,null,null,null,null,null,null,""]
[null,null,null,null,null,null,null,null,null,null,null,null,null,""]
[null,null,null,null,null,null,null,null,null,null,null,null,null,""]
[]
[]
[]
[]
["Observations\n  (pour garder une trace d'un fait particulier)"]

{"sheet":"31","index":32,"n_rows":78,"n_cols":14,"rows_kept":78,"cut":false,"hidden":false,"merged":[[0,0,0,11],[26,1,26,6],[51,0,51,2],[51,3,51,5],[51,6,51,8]]}
["RAPPORT JOURNALIER"]
[]
["DATE :"]
["EXPLOITATION DE:",null,null,"RESPONSABLE",null,"METEO"]
[]
[]
[null,null,null,"H DE PRODUCTIONS PREVUES"]
["POINTAGE PERSONNEL"]
[]
["NOM PRENOM","AFFECTATION","Nombre\nd'heure","AFFECTATION","Nombre\nd'heure","AFFECTATION","Nombre\nd'heure","TOTAL HORAIRE JOUR"]
[null,null,null,null,null,null,null,{"$f":"C11+E11+G11","v":0}]
[null,null,null,null,null,null,null,{"$f":"C12+E12+G12","v":0}]
[null,null,null,null,null,null,null,{"$f":"C13+E13+G13","v":0}]
[null,null,null,null,null,null,null,0]
[null,null,null,null,null,null,null,0]
[null,null,null,null,null,null,null,0]
[null,null,null,null,null,null,null,{"$f":"C17+E17+G17","v":0}]
[null,null,null,null,null,null,null,{"$f":"C18+E18+G18","v":0}]
[null,null,null,null,null,null,null,{"$f":"C19+E19+G19","v":0}]
[null,null,null,null,null,null,null,0]
[null,null,null,null,null,null,null,0]
[null,null,null,null,null,null,null,0]
[]
["POINTAGE MATERIEL"]
[]
["ENGINS DE PRODUCTION"]
["TYPE","AFFECTATION HORAIRE",null,null,null,null,null,"TOTAL\n HORAIRE JOUR","GNR","HORAMETRE \nMATIN","HORAMETRE \nSOIR","CONTRÔLE"]
[null,null,null,null,null,null,null,{"$f":"C28+E28+G28","v":0},null,null,null,{"$f":"IF(K28-J28=H28,\"OK\",\"FAUX\")","v":"OK"}]
[null,null,null,null,null,null,null,{"$f":"C29+E29+G29","v":0},null,null,null,{"$f":"IF(K29-J29=H29,\"OK\",\"FAUX\")","v":"OK"}]
[null,null,null,null,null,null,null,0,null,null,null,"OK"]
[null,null,null,null,null,null,null,0,null,null,null,"OK"]
[null,null,null,null,null,null,null,0,null,null,null,"OK"]
[null,null,null,null,null,null,null,0,null,null,null,"OK"]
[]
["VEHICULES DE LIAISON","HORAMETRE MATIN","SOIR","GNR","HEURE\n FONTIONNEMENT"]
[null,null,null,null,{"$f":"C36-B36","v":0}]
[null,null,null,null,{"$f":"C37-B37","v":0}]
[null,null,null,null,0]
[]
[]
["RAPPORT DE PRODUCTION "]
[]
[null,"COMPTEUR HORAIRE","H/FONCT"]
["PRIMAIRE (Production Plaine)"]
["SECONDAIRE (Production Bascule  Tunnel)"]
["TERTIAIRE (frabrication concassée)"]
["BIG BAG"]
["Compteur d'eau"]
[]
[]
[null,null,null,null,"BIG BAG"]
["PRIMAIRE",null,null,"SECONDAIRE",null,null,"TERTIAIRE"]
["ALIMENTATION","Tout venant Brut",null,"FABRICATION","0/4SCL",null,"CONCASSES","0/2C"]
["Plaine","Tout venant Brut",null,"FABRICATION","M0/16",null,"CONCASSES","2/4C"]
["T120","Tout venant écreté",{"$f":"C54*0.95","v":0},"FABRICATION","M0/8",null,"CONCASSES","4/6C"]
["Débit mesuré en T/h","GRANULOMETRIE","TONNAGES",null,"GRANULOMETRIE","TONNAGES","CONCASSES","4/10C"]
[50,"04 NATUREL",{"$f":"C53*D57","v":0},0.22,"SABLE 0/4R",{"$f":"C57-(F53*'GNR ET ELEMENTS DE PROD'!L10)-('31'!F54*'GNR ET ELEMENTS DE PROD'!L7)","v":0},"CONCASSES","6/10C"]
[36,"4/8R",{"$f":"C53*D58","v":0},0.16,"4/8R",{"$f":"C58","v":0},"CONCASSES"]
[42,"8/16R",{"$f":"C53*D59","v":0},0.18,"8/16R",{"$f":"C59-F54*'GNR ET ELEMENTS DE PROD'!N7","v":0},"CONCASSES"]
[32,"11/22R",{"$f":"C53*D60","v":0},0.14000000000000001,"11/22R",{"$f":"C60","v":0},"CONCASSES","0/4C",{"$f":"-F54*'GNR ET ELEMENTS DE PROD'!K7-F53*'GNR ET ELEMENTS DE PROD'!K10","v":0},null,null,null,null,""]
[68,"22/80",{"$f":"C53*D61","v":0},0.3,"22/80",{"$f":"C63-I55-I5-ABS(I57)","v":0},"CONCASSES","6,3/10",{"$f":"+-'GNR ET ELEMENTS DE PROD'!M7*F54","v":0},null,null,null,null,""]
[{"$f":"SUM(A57:B61)","v":228},null,{"$f":"SUM(C57:C61)","v":0},null,null,{"$f":"SUM(F57:F61)","v":0},null,null,{"$f":"SUM(I53:I61)","v":0},null,null,null,null,""]
[]
["ACHATS"]
[]
[]
[null,null,null,null,null,null,null,null,null,null,null,null,null,""]
["ARRETS",null,null,null,null,null,null,null,null,null,null,null,null,""]
["Horamètre","CIRCUIT","MACHINE","CAUSE","DUREE (en mn)",null,null,"COMMENTAIRES",null,null,null,null,null,""]
[null,null,null,null,"Panne","Entretien","AUTRE",null,null,null,null,null,null,""]
[null,null,null,null,null,null,null,null,null,null,null,null,null,""]
[null,null,null,null,null,null,null,null,null,null,null,null,null,""]
[null,null,null,null,null,null,null,null,null,null,null,null,null,""]
[]
[]
[]
[]
["Observations\n  (pour garder une trace d'un fait particulier)"]

{"sheet":" RECAP MOIS PERSONNEL","index":33,"n_rows":376,"n_cols":12,"rows_kept":376,"cut":false,"hidden":false,"merged":[[0,0,0,8]]}
["RECAPITULATIF AFFECTATION PERSONNEL SEPTEMBRE 2020 OSSELLE"]
["DATE","NOM","AFFECTATION","H","AFFECTATION2","H2","AFFECTATION4","H3","TOTAL"]
[1,{"$f":"'1'!A11","v":"CRETIN Brigitte"},{"$f":"'1'!B11","v":"Bascule 200200"},{"$f":"'1'!C11","v":8},{"$f":"'1'!D11","v":0},{"$f":"'1'!E11","v":0},{"$f":"'1'!F11","v":0},{"$f":"'1'!G11","v":0},{"$f":"D3+H3+F3","v":8}]
[{"$f":"A3","v":1},{"$f":"'1'!A12","v":"DORKELD Didier"},{"$f":"'1'!B12","v":"Sur Engin Chargement client"},{"$f":"'1'!C12","v":5},{"$f":"'1'!D12","v":"210258 Travaux divers sans engins"},{"$f":"'1'!E12","v":3},{"$f":"'1'!F12","v":0},{"$f":"'1'!G12","v":0},{"$f":"D4+H4+F4","v":8}]
[{"$f":"A4","v":1},{"$f":"'1'!A13","v":"HOLTZ Mathieu"},{"$f":"'1'!B13","v":"Sur Engin Destockage"},{"$f":"'1'!C13","v":7},{"$f":"'1'!D13","v":"210258 Travaux divers sans engins"},{"$f":"'1'!E13","v":1},{"$f":"'1'!F13","v":0},{"$f":"'1'!G13","v":0},8]
[1,{"$f":"'1'!A14","v":0},{"$f":"'1'!B14","v":0},{"$f":"'1'!C14","v":0},{"$f":"'1'!D14","v":0},{"$f":"'1'!E14","v":0},{"$f":"'1'!F14","v":0},{"$f":"'1'!G14","v":0},0]
[1,{"$f":"'1'!A15","v":0},{"$f":"'1'!B15","v":0},{"$f":"'1'!C15","v":0},{"$f":"'1'!D15","v":0},{"$f":"'1'!E15","v":0},{"$f":"'1'!F15","v":0},{"$f":"'1'!G15","v":0},0]
[1,{"$f":"'1'!A16","v":0},{"$f":"'1'!B16","v":0},{"$f":"'1'!C16","v":0},{"$f":"'1'!D16","v":0},{"$f":"'1'!E16","v":0},{"$f":"'1'!F16","v":0},{"$f":"'1'!G16","v":0},{"$f":"D8+H8+F8","v":0}]
[1,{"$f":"'1'!A17","v":0},{"$f":"'1'!B17","v":0},{"$f":"'1'!C17","v":0},{"$f":"'1'!D17","v":0},{"$f":"'1'!E17","v":0},{"$f":"'1'!F17","v":0},{"$f":"'1'!G17","v":0},0]
[1,{"$f":"'1'!A18","v":0},{"$f":"'1'!B18","v":0},{"$f":"'1'!C18","v":0},{"$f":"'1'!D18","v":0},{"$f":"'1'!E18","v":0},{"$f":"'1'!F18","v":0},{"$f":"'1'!G18","v":0},0]
[1,{"$f":"'1'!A19","v":0},{"$f":"'1'!B19","v":0},{"$f":"'1'!C19","v":0},{"$f":"'1'!D19","v":0},{"$f":"'1'!E19","v":0},{"$f":"'1'!F19","v":0},{"$f":"'1'!G19","v":0},0]
[1,{"$f":"'1'!A20","v":0},{"$f":"'1'!B20","v":0},{"$f":"'1'!C20","v":0},{"$f":"'1'!D20","v":0},{"$f":"'1'!E20","v":0},{"$f":"'1'!F20","v":0},{"$f":"'1'!G20","v":0},0]
[1,{"$f":"'1'!A21","v":0},{"$f":"'1'!B21","v":0},{"$f":"'1'!C21","v":0},{"$f":"'1'!D21","v":0},{"$f":"'1'!E21","v":0},{"$f":"'1'!F21","v":0},{"$f":"'1'!G21","v":0},0]
[1,{"$f":"'1'!A22","v":0},{"$f":"'1'!B22","v":0},{"$f":"'1'!C22","v":0},{"$f":"'1'!D22","v":0},{"$f":"'1'!E22","v":0},{"$f":"'1'!F22","v":0},{"$f":"'1'!G22","v":0},0]
[2,{"$f":"'2'!A11","v":"CRETIN Brigitte"},{"$f":"'2'!B11","v":"Bascule 200200"},{"$f":"'2'!C11","v":7},{"$f":"'2'!D11","v":0},{"$f":"'2'!E11","v":0},{"$f":"'2'!F11","v":0},{"$f":"'2'!G11","v":0},7]
[{"$f":"A15","v":2},{"$f":"'2'!A12","v":"DORKELD Didier"},{"$f":"'2'!B12","v":"Sur Engin Chargement client"},{"$f":"'2'!C12","v":3},{"$f":"'2'!D12","v":"210258 Travaux divers sans engins"},{"$f":"'2'!E12","v":4},{"$f":"'2'!F12","v":0},{"$f":"'2'!G12","v":0},{"$f":"D16+H16+F16","v":7}]
[{"$f":"A16","v":2},{"$f":"'2'!A13","v":0},{"$f":"'2'!B13","v":0},{"$f":"'2'!C13","v":0},{"$f":"'2'!D13","v":0},{"$f":"'2'!E13","v":0},{"$f":"'2'!F13","v":0},{"$f":"'2'!G13","v":0},{"$f":"D17+H17+F17","v":0},null,"NOM"]
[2,{"$f":"'2'!A14","v":0},{"$f":"'2'!B14","v":0},{"$f":"'2'!C14","v":0},{"$f":"'2'!D14","v":0},{"$f":"'2'!E14","v":0},{"$f":"'2'!F14","v":0},{"$f":"'2'!G14","v":0},0]
[2,{"$f":"'2'!A15","v":0},{"$f":"'2'!B15","v":0},{"$f":"'2'!C15","v":0},{"$f":"'2'!D15","v":0},{"$f":"'2'!E15","v":0},{"$f":"'2'!F15","v":0},{"$f":"'2'!G15","v":0},0]
[2,{"$f":"'2'!A16","v":0},{"$f":"'2'!B16","v":0},{"$f":"'2'!C16","v":0},{"$f":"'2'!D16","v":0},{"$f":"'2'!E16","v":0},{"$f":"'2'!F16","v":0},{"$f":"'2'!G16","v":0},0]
[2,{"$f":"'2'!A17","v":0},{"$f":"'2'!B17","v":0},{"$f":"'2'!C17","v":0},{"$f":"'2'!D17","v":0},{"$f":"'2'!E17","v":0},{"$f":"'2'!F17","v":0},{"$f":"'2'!G17","v":0},0]
[2,{"$f":"'2'!A18","v":0},{"$f":"'2'!B18","v":0},{"$f":"'2'!C18","v":0},{"$f":"'2'!D18","v":0},{"$f":"'2'!E18","v":0},{"$f":"'2'!F18","v":0},{"$f":"'2'!G18","v":0},0]
[2,{"$f":"'2'!A19","v":0},{"$f":"'2'!B19","v":0},{"$f":"'2'!C19","v":0},{"$f":"'2'!D19","v":0},{"$f":"'2'!E19","v":0},{"$f":"'2'!F19","v":0},{"$f":"'2'!G19","v":0},0]
[2,{"$f":"'2'!A20","v":0},{"$f":"'2'!B20","v":0},{"$f":"'2'!C20","v":0},{"$f":"'2'!D20","v":0},{"$f":"'2'!E20","v":0},{"$f":"'2'!F20","v":0},{"$f":"'2'!G20","v":0},0]
[2,{"$f":"'2'!A21","v":0},{"$f":"'2'!B21","v":0},{"$f":"'2'!C21","v":0},{"$f":"'2'!D21","v":0},{"$f":"'2'!E21","v":0},{"$f":"'2'!F21","v":0},{"$f":"'2'!G21","v":0},0]
[2,{"$f":"'2'!A22","v":0},{"$f":"'2'!B22","v":0},{"$f":"'2'!C22","v":0},{"$f":"'2'!D22","v":0},{"$f":"'2'!E22","v":0},{"$f":"'2'!F22","v":0},{"$f":"'2'!G22","v":0},0]
[3,{"$f":"'3'!A11","v":"CRETIN Brigitte"},{"$f":"'3'!B11","v":"Bascule 200200"},{"$f":"'3'!C11","v":7},{"$f":"'3'!D11","v":0},{"$f":"'3'!E11","v":0},{"$f":"'3'!F11","v":0},{"$f":"'3'!G11","v":0},{"$f":"D27+H27+F27","v":7}]
[{"$f":"A27","v":3},{"$f":"'3'!A12","v":"DORKELD Didier"},{"$f":"'3'!B12","v":"Sur Engin Chargement client"},{"$f":"'3'!C12","v":3},{"$f":"'3'!D12","v":"210258 Travaux divers sans engins"},{"$f":"'3'!E12","v":4},{"$f":"'3'!F12","v":0},{"$f":"'3'!G12","v":0},{"$f":"D28+H28+F28","v":7},null,"AFFECTATIONS ","TOTAL HORAIRE"]
[{"$f":"A28","v":3},{"$f":"'3'!A13","v":0},{"$f":"'3'!B13","v":0},{"$f":"'3'!C13","v":0},{"$f":"'3'!D13","v":0},{"$f":"'3'!E13","v":0},{"$f":"'3'!F13","v":0},{"$f":"'3'!G13","v":0},0]
[3,{"$f":"'3'!A14","v":0},{"$f":"'3'!B14","v":0},{"$f":"'3'!C14","v":0},{"$f":"'3'!D14","v":0},{"$f":"'3'!E14","v":0},{"$f":"'3'!F14","v":0},{"$f":"'3'!G14","v":0},{"$f":"D30+H30+F30","v":0}]
[3,{"$f":"'3'!A15","v":0},{"$f":"'3'!B15","v":0},{"$f":"'3'!C15","v":0},{"$f":"'3'!D15","v":0},{"$f":"'3'!E15","v":0},{"$f":"'3'!F15","v":0},{"$f":"'3'!G15","v":0},0]
[3,{"$f":"'3'!A16","v":0},{"$f":"'3'!B16","v":0},{"$f":"'3'!C16","v":0},{"$f":"'3'!D16","v":0},{"$f":"'3'!E16","v":0},{"$f":"'3'!F16","v":0},{"$f":"'3'!G16","v":0},0]
[3,{"$f":"'3'!A17","v":0},{"$f":"'3'!B17","v":0},{"$f":"'3'!C17","v":0},{"$f":"'3'!D17","v":0},{"$f":"'3'!E17","v":0},{"$f":"'3'!F17","v":0},{"$f":"'3'!G17","v":0},{"$f":"D33+H33+F33","v":0}]
[3,{"$f":"'3'!A18","v":0},{"$f":"'3'!B18","v":0},{"$f":"'3'!C18","v":0},{"$f":"'3'!D18","v":0},{"$f":"'3'!E18","v":0},{"$f":"'3'!F18","v":0},{"$f":"'3'!G18","v":0},0]
[3,{"$f":"'3'!A19","v":0},{"$f":"'3'!B19","v":0},{"$f":"'3'!C19","v":0},{"$f":"'3'!D19","v":0},{"$f":"'3'!E19","v":0},{"$f":"'3'!F19","v":0},{"$f":"'3'!G19","v":0},0]
[3,{"$f":"'3'!A20","v":0},{"$f":"'3'!B20","v":0},{"$f":"'3'!C20","v":0},{"$f":"'3'!D20","v":0},{"$f":"'3'!E20","v":0},{"$f":"'3'!F20","v":0},{"$f":"'3'!G20","v":0},0]
[3,{"$f":"'3'!A21","v":0},{"$f":"'3'!B21","v":0},{"$f":"'3'!C21","v":0},{"$f":"'3'!D21","v":0},{"$f":"'3'!E21","v":0},{"$f":"'3'!F21","v":0},{"$f":"'3'!G21","v":0},0]
[3,{"$f":"'3'!A22","v":0},{"$f":"'3'!B22","v":0},{"$f":"'3'!C22","v":0},{"$f":"'3'!D22","v":0},{"$f":"'3'!E22","v":0},{"$f":"'3'!F22","v":0},{"$f":"'3'!G22","v":0},0]
[4,{"$f":"'4'!A11","v":"CRETIN Brigitte"},{"$f":"'4'!B11","v":"Bascule 200200"},{"$f":"'4'!C11","v":7},{"$f":"'4'!D11","v":0},{"$f":"'4'!E11","v":0},{"$f":"'4'!F11","v":0},{"$f":"'4'!G11","v":0},7]
[{"$f":"A39","v":4},{"$f":"'4'!A12","v":"DORKELD Didier"},{"$f":"'4'!B12","v":"Sur Engin Chargement client"},{"$f":"'4'!C12","v":3},{"$f":"'4'!D12","v":"210258 Travaux divers sans engins"},{"$f":"'4'!E12","v":4},{"$f":"'4'!F12","v":0},{"$f":"'4'!G12","v":0},{"$f":"D40+H40+F40","v":7}]
[{"$f":"A40","v":4},{"$f":"'4'!A13","v":0},{"$f":"'4'!B13","v":0},{"$f":"'4'!C13","v":0},{"$f":"'4'!D13","v":0},{"$f":"'4'!E13","v":0},{"$f":"'4'!F13","v":0},{"$f":"'4'!G13","v":0},0]
[4,{"$f":"'4'!A14","v":0},{"$f":"'4'!B14","v":0},{"$f":"'4'!C14","v":0},{"$f":"'4'!D14","v":0},{"$f":"'4'!E14","v":0},{"$f":"'4'!F14","v":0},{"$f":"'4'!G14","v":0},{"$f":"D42+H42+F42","v":0}]
[4,{"$f":"'4'!A15","v":0},{"$f":"'4'!B15","v":0},{"$f":"'4'!C15","v":0},{"$f":"'4'!D15","v":0},{"$f":"'4'!E15","v":0},{"$f":"'4'!F15","v":0},{"$f":"'4'!G15","v":0},0]
[4,{"$f":"'4'!A16","v":0},{"$f":"'4'!B16","v":0},{"$f":"'4'!C16","v":0},{"$f":"'4'!D16","v":0},{"$f":"'4'!E16","v":0},{"$f":"'4'!F16","v":0},{"$f":"'4'!G16","v":0},0]
[4,{"$f":"'4'!A17","v":0},{"$f":"'4'!B17","v":0},{"$f":"'4'!C17","v":0},{"$f":"'4'!D17","v":0},{"$f":"'4'!E17","v":0},{"$f":"'4'!F17","v":0},{"$f":"'4'!G17","v":0},0]
[4,{"$f":"'4'!A18","v":0},{"$f":"'4'!B18","v":0},{"$f":"'4'!C18","v":0},{"$f":"'4'!D18","v":0},{"$f":"'4'!E18","v":0},{"$f":"'4'!F18","v":0},{"$f":"'4'!G18","v":0},0]
[4,{"$f":"'4'!A19","v":0},{"$f":"'4'!B19","v":0},{"$f":"'4'!C19","v":0},{"$f":"'4'!D19","v":0},{"$f":"'4'!E19","v":0},{"$f":"'4'!F19","v":0},{"$f":"'4'!G19","v":0},0]
[4,{"$f":"'4'!A20","v":0},{"$f":"'4'!B20","v":0},{"$f":"'4'!C20","v":0},{"$f":"'4'!D20","v":0},{"$f":"'4'!E20","v":0},{"$f":"'4'!F20","v":0},{"$f":"'4'!G20","v":0},0]
[4,{"$f":"'4'!A21","v":0},{"$f":"'4'!B21","v":0},{"$f":"'4'!C21","v":0},{"$f":"'4'!D21","v":0},{"$f":"'4'!E21","v":0},{"$f":"'4'!F21","v":0},{"$f":"'4'!G21","v":0},0]
[4,{"$f":"'4'!A22","v":0},{"$f":"'4'!B22","v":0},{"$f":"'4'!C22","v":0},{"$f":"'4'!D22","v":0},{"$f":"'4'!E22","v":0},{"$f":"'4'!F22","v":0},{"$f":"'4'!G22","v":0},0]
[5,{"$f":"'5'!A11","v":0},{"$f":"'5'!B11","v":0},{"$f":"'5'!C11","v":0},{"$f":"'5'!D11","v":0},{"$f":"'5'!E11","v":0},{"$f":"'5'!F11","v":0},{"$f":"'5'!G11","v":0},0]
[5,{"$f":"'5'!A12","v":"DORKELD Didier"},{"$f":"'5'!B12","v":"Sur Engin Chargement client"},{"$f":"'5'!C12","v":2},{"$f":"'5'!D12","v":"210258 Travaux divers sans engins"},{"$f":"'5'!E12","v":6},{"$f":"'5'!F12","v":0},{"$f":"'5'!G12","v":0},{"$f":"D52+H52+F52","v":8}]
[5,{"$f":"'5'!A13","v":"HOLTZ Mathieu"},{"$f":"'5'!B13","v":"Install secondaire  210256"},{"$f":"'5'!C13","v":1.5},{"$f":"'5'!D13","v":"Sur Engin Destockage"},{"$f":"'5'!E13","v":4},{"$f":"'5'!F13","v":0},{"$f":"'5'!G13","v":0},{"$f":"D53+H53+F53","v":5.5}]
[5,{"$f":"'5'!A14","v":"LEBRUN Martial"},{"$f":"'5'!B14","v":"Bascule 200200"},{"$f":"'5'!C14","v":8},{"$f":"'5'!D14","v":0},{"$f":"'5'!E14","v":0},{"$f":"'5'!F14","v":0},{"$f":"'5'!G14","v":0},8]
[5,{"$f":"'5'!A15","v":0},{"$f":"'5'!B15","v":0},{"$f":"'5'!C15","v":0},{"$f":"'5'!D15","v":0},{"$f":"'5'!E15","v":0},{"$f":"'5'!F15","v":0},{"$f":"'5'!G15","v":0},0]
[5,{"$f":"'5'!A16","v":0},{"$f":"'5'!B16","v":0},{"$f":"'5'!C16","v":0},{"$f":"'5'!D16","v":0},{"$f":"'5'!E16","v":0},{"$f":"'5'!F16","v":0},{"$f":"'5'!G16","v":0},0]
[5,{"$f":"'5'!A17","v":0},{"$f":"'5'!B17","v":0},{"$f":"'5'!C17","v":0},{"$f":"'5'!D17","v":0},{"$f":"'5'!E17","v":0},{"$f":"'5'!F17","v":0},{"$f":"'5'!G17","v":0},0]
[5,{"$f":"'5'!A18","v":0},{"$f":"'5'!B18","v":0},{"$f":"'5'!C18","v":0},{"$f":"'5'!D18","v":0},{"$f":"'5'!E18","v":0},{"$f":"'5'!F18","v":0},{"$f":"'5'!G18","v":0},0]
[5,{"$f":"'5'!A19","v":0},{"$f":"'5'!B19","v":0},{"$f":"'5'!C19","v":0},{"$f":"'5'!D19","v":0},{"$f":"'5'!E19","v":0},{"$f":"'5'!F19","v":0},{"$f":"'5'!G19","v":0},0]
[5,{"$f":"'5'!A20","v":0},{"$f":"'5'!B20","v":0},{"$f":"'5'!C20","v":0},{"$f":"'5'!D20","v":0},{"$f":"'5'!E20","v":0},{"$f":"'5'!F20","v":0},{"$f":"'5'!G20","v":0},0]
[5,{"$f":"'5'!A21","v":0},{"$f":"'5'!B21","v":0},{"$f":"'5'!C21","v":0},{"$f":"'5'!D21","v":0},{"$f":"'5'!E21","v":0},{"$f":"'5'!F21","v":0},{"$f":"'5'!G21","v":0},0]
[5,{"$f":"'5'!A22","v":0},{"$f":"'5'!B22","v":0},{"$f":"'5'!C22","v":0},{"$f":"'5'!D22","v":0},{"$f":"'5'!E22","v":0},{"$f":"'5'!F22","v":0},{"$f":"'5'!G22","v":0},0]
[6,{"$f":"'6'!A11","v":0},{"$f":"'6'!B11","v":0},{"$f":"'6'!C11","v":0},{"$f":"'6'!D11","v":0},{"$f":"'6'!E11","v":0},{"$f":"'6'!F11","v":0},{"$f":"'6'!G11","v":0},0]
[{"$f":"A63","v":6},{"$f":"'6'!A12","v":"DORKELD Didier"},{"$f":"'6'!B12","v":"Sur Engin Chargement client"},{"$f":"'6'!C12","v":2},{"$f":"'6'!D12","v":"210258 Travaux divers sans engins"},{"$f":"'6'!E12","v":6},{"$f":"'6'!F12","v":0},{"$f":"'6'!G12","v":0},{"$f":"D64+H64+F64","v":8}]
[{"$f":"A64","v":6},{"$f":"'6'!A13","v":"HOLTZ Mathieu"},{"$f":"'6'!B13","v":"Sur Engin Destockage"},{"$f":"'6'!C13","v":4},{"$f":"'6'!D13","v":"Install secondaire  210256"},{"$f":"'6'!E13","v":4},{"$f":"'6'!F13","v":0},{"$f":"'6'!G13","v":0},8]
[6,{"$f":"'6'!A14","v":"LEBRUN Martial"},{"$f":"'6'!B14","v":"Bascule 200200"},{"$f":"'6'!C14","v":8},{"$f":"'6'!D14","v":0},{"$f":"'6'!E14","v":0},{"$f":"'6'!F14","v":0},{"$f":"'6'!G14","v":0},{"$f":"D66+H66+F66","v":8}]
[6,{"$f":"'6'!A15","v":0},{"$f":"'6'!B15","v":0},{"$f":"'6'!C15","v":0},{"$f":"'6'!D15","v":0},{"$f":"'6'!E15","v":0},{"$f":"'6'!F15","v":0},{"$f":"'6'!G15","v":0},0]
[6,{"$f":"'6'!A16","v":0},{"$f":"'6'!B16","v":0},{"$f":"'6'!C16","v":0},{"$f":"'6'!D16","v":0},{"$f":"'6'!E16","v":0},{"$f":"'6'!F16","v":0},{"$f":"'6'!G16","v":0},0]
[6,{"$f":"'6'!A17","v":0},{"$f":"'6'!B17","v":0},{"$f":"'6'!C17","v":0},{"$f":"'6'!D17","v":0},{"$f":"'6'!E17","v":0},{"$f":"'6'!F17","v":0},{"$f":"'6'!G17","v":0},0]
[6,{"$f":"'6'!A18","v":0},{"$f":"'6'!B18","v":0},{"$f":"'6'!C18","v":0},{"$f":"'6'!D18","v":0},{"$f":"'6'!E18","v":0},{"$f":"'6'!F18","v":0},{"$f":"'6'!G18","v":0},0]
[6,{"$f":"'6'!A19","v":0},{"$f":"'6'!B19","v":0},{"$f":"'6'!C19","v":0},{"$f":"'6'!D19","v":0},{"$f":"'6'!E19","v":0},{"$f":"'6'!F19","v":0},{"$f":"'6'!G19","v":0},0]
[6,{"$f":"'6'!A20","v":0},{"$f":"'6'!B20","v":0},{"$f":"'6'!C20","v":0},{"$f":"'6'!D20","v":0},{"$f":"'6'!E20","v":0},{"$f":"'6'!F20","v":0},{"$f":"'6'!G20","v":0},0]
[6,{"$f":"'6'!A21","v":0},{"$f":"'6'!B21","v":0},{"$f":"'6'!C21","v":0},{"$f":"'6'!D21","v":0},{"$f":"'6'!E21","v":0},{"$f":"'6'!F21","v":0},{"$f":"'6'!G21","v":0},0]
[6,{"$f":"'6'!A22","v":0},{"$f":"'6'!B22","v":0},{"$f":"'6'!C22","v":0},{"$f":"'6'!D22","v":0},{"$f":"'6'!E22","v":0},{"$f":"'6'!F22","v":0},{"$f":"'6'!G22","v":0},0]
[7,{"$f":"'7'!A11","v":0},{"$f":"'7'!B11","v":0},{"$f":"'7'!C11","v":0},{"$f":"'7'!D11","v":0},{"$f":"'7'!E11","v":0},{"$f":"'7'!F11","v":0},{"$f":"'7'!G11","v":0},0]
[{"$f":"A75","v":7},{"$f":"'7'!A12","v":"DORKELD Didier"},{"$f":"'7'!B12","v":"Sur Engin Chargement client"},{"$f":"'7'!C12","v":2},{"$f":"'7'!D12","v":"210258 Travaux divers sans engins"},{"$f":"'7'!E12","v":6},{"$f":"'7'!F12","v":0},{"$f":"'7'!G12","v":0},8]
[{"$f":"A76","v":7},{"$f":"'7'!A13","v":"HOLTZ Mathieu"},{"$f":"'7'!B13","v":"Sur Engin Travaux divers site"},{"$f":"'7'!C13","v":2},{"$f":"'7'!D13","v":"210258 Travaux divers sans engins"},{"$f":"'7'!E13","v":6},{"$f":"'7'!F13","v":0},{"$f":"'7'!G13","v":0},8]
[7,{"$f":"'7'!A14","v":"LEBRUN Martial"},{"$f":"'7'!B14","v":"Bascule 200200"},{"$f":"'7'!C14","v":8},{"$f":"'7'!D14","v":0},{"$f":"'7'!E14","v":0},{"$f":"'7'!F14","v":0},{"$f":"'7'!G14","v":0},8]
[7,{"$f":"'7'!A15","v":0},{"$f":"'7'!B15","v":0},{"$f":"'7'!C15","v":0},{"$f":"'7'!D15","v":0},{"$f":"'7'!E15","v":0},{"$f":"'7'!F15","v":0},{"$f":"'7'!G15","v":0},0]
[7,{"$f":"'7'!A16","v":0},{"$f":"'7'!B16","v":0},{"$f":"'7'!C16","v":0},{"$f":"'7'!D16","v":0},{"$f":"'7'!E16","v":0},{"$f":"'7'!F16","v":0},{"$f":"'7'!G16","v":0},0]
[7,{"$f":"'7'!A17","v":0},{"$f":"'7'!B17","v":0},{"$f":"'7'!C17","v":0},{"$f":"'7'!D17","v":0},{"$f":"'7'!E17","v":0},{"$f":"'7'!F17","v":0},{"$f":"'7'!G17","v":0},0]
[7,{"$f":"'7'!A18","v":0},{"$f":"'7'!B18","v":0},{"$f":"'7'!C18","v":0},{"$f":"'7'!D18","v":0},{"$f":"'7'!E18","v":0},{"$f":"'7'!F18","v":0},{"$f":"'7'!G18","v":0},0]
[7,{"$f":"'7'!A19","v":0},{"$f":"'7'!B19","v":0},{"$f":"'7'!C19","v":0},{"$f":"'7'!D19","v":0},{"$f":"'7'!E19","v":0},{"$f":"'7'!F19","v":0},{"$f":"'7'!G19","v":0},0]
[7,{"$f":"'7'!A20","v":0},{"$f":"'7'!B20","v":0},{"$f":"'7'!C20","v":0},{"$f":"'7'!D20","v":0},{"$f":"'7'!E20","v":0},{"$f":"'7'!F20","v":0},{"$f":"'7'!G20","v":0},0]
[7,{"$f":"'7'!A21","v":0},{"$f":"'7'!B21","v":0},{"$f":"'7'!C21","v":0},{"$f":"'7'!D21","v":0},{"$f":"'7'!E21","v":0},{"$f":"'7'!F21","v":0},{"$f":"'7'!G21","v":0},0]
[7,{"$f":"'7'!A22","v":0},{"$f":"'7'!B22","v":0},{"$f":"'7'!C22","v":0},{"$f":"'7'!D22","v":0},{"$f":"'7'!E22","v":0},{"$f":"'7'!F22","v":0},{"$f":"'7'!G22","v":0},0]
[8,{"$f":"'8'!A11","v":"CRETIN Brigitte"},{"$f":"'8'!B11","v":0},{"$f":"'8'!C11","v":0},{"$f":"'8'!D11","v":0},{"$f":"'8'!E11","v":0},{"$f":"'8'!F11","v":0},{"$f":"'8'!G11","v":0},0]
[{"$f":"A87","v":8},{"$f":"'8'!A12","v":"DORKELD Didier"},{"$f":"'8'!B12","v":"Sur Engin Chargement client"},{"$f":"'8'!C12","v":2},{"$f":"'8'!D12","v":"210258 Travaux divers sans engins"},{"$f":"'8'!E12","v":6},{"$f":"'8'!F12","v":0},{"$f":"'8'!G12","v":0},8]
[{"$f":"A88","v":8},{"$f":"'8'!A13","v":"HOLTZ Mathieu"},{"$f":"'8'!B13","v":"Sur Engin Destockage"},{"$f":"'8'!C13","v":5},{"$f":"'8'!D13","v":"Install secondaire  210256"},{"$f":"'8'!E13","v":3},{"$f":"'8'!F13","v":0},{"$f":"'8'!G13","v":0},8]
[8,{"$f":"'8'!A14","v":"LEBRUN Martial"},{"$f":"'8'!B14","v":"Bascule 200200"},{"$f":"'8'!C14","v":8},{"$f":"'8'!D14","v":0},{"$f":"'8'!E14","v":0},{"$f":"'8'!F14","v":0},{"$f":"'8'!G14","v":0},8]
[8,{"$f":"'8'!A15","v":0},{"$f":"'8'!B15","v":0},{"$f":"'8'!C15","v":0},{"$f":"'8'!D15","v":0},{"$f":"'8'!E15","v":0},{"$f":"'8'!F15","v":0},{"$f":"'8'!G15","v":0},0]
[8,{"$f":"'8'!A16","v":0},{"$f":"'8'!B16","v":0},{"$f":"'8'!C16","v":0},{"$f":"'8'!D16","v":0},{"$f":"'8'!E16","v":0},{"$f":"'8'!F16","v":0},{"$f":"'8'!G16","v":0},0]
[8,{"$f":"'8'!A17","v":0},{"$f":"'8'!B17","v":0},{"$f":"'8'!C17","v":0},{"$f":"'8'!D17","v":0},{"$f":"'8'!E17","v":0},{"$f":"'8'!F17","v":0},{"$f":"'8'!G17","v":0},0]
[8,{"$f":"'8'!A18","v":0},{"$f":"'8'!B18","v":0},{"$f":"'8'!C18","v":0},{"$f":"'8'!D18","v":0},{"$f":"'8'!E18","v":0},{"$f":"'8'!F18","v":0},{"$f":"'8'!G18","v":0},0]
[8,{"$f":"'8'!A19","v":0},{"$f":"'8'!B19","v":0},{"$f":"'8'!C19","v":0},{"$f":"'8'!D19","v":0},{"$f":"'8'!E19","v":0},{"$f":"'8'!F19","v":0},{"$f":"'8'!G19","v":0},0]
[8,{"$f":"'8'!A20","v":0},{"$f":"'8'!B20","v":0},{"$f":"'8'!C20","v":0},{"$f":"'8'!D20","v":0},{"$f":"'8'!E20","v":0},{"$f":"'8'!F20","v":0},{"$f":"'8'!G20","v":0},0]
[8,{"$f":"'8'!A21","v":0},{"$f":"'8'!B21","v":0},{"$f":"'8'!C21","v":0},{"$f":"'8'!D21","v":0},{"$f":"'8'!E21","v":0},{"$f":"'8'!F21","v":0},{"$f":"'8'!G21","v":0},0]
[8,{"$f":"'8'!A22","v":0},{"$f":"'8'!B22","v":0},{"$f":"'8'!C22","v":0},{"$f":"'8'!D22","v":0},{"$f":"'8'!E22","v":0},{"$f":"'8'!F22","v":0},{"$f":"'8'!G22","v":0},0]
[9,{"$f":"'9'!A11","v":"CRETIN Brigitte"},{"$f":"'9'!B11","v":0},{"$f":"'9'!C11","v":0},{"$f":"'9'!D11","v":0},{"$f":"'9'!E11","v":0},{"$f":"'9'!F11","v":0},{"$f":"'9'!G11","v":0},0]
[{"$f":"A99","v":9},{"$f":"'9'!A12","v":"DORKELD Didier"},{"$f":"'9'!B12","v":"210258 Travaux divers sans engins"},{"$f":"'9'!C12","v":3},{"$f":"'9'!D12","v":"Sur Engin Chargement client"},{"$f":"'9'!E12","v":3},{"$f":"'9'!F12","v":"Sur Engin Travaux divers site"},{"$f":"'9'!G12","v":1},7]
[{"$f":"A100","v":9},{"$f":"'9'!A13","v":"HOLTZ Mathieu"},{"$f":"'9'!B13","v":"Install secondaire  210256"},{"$f":"'9'!C13","v":3.5},{"$f":"'9'!D13","v":"Sur Engin Destockage"},{"$f":"'9'!E13","v":3.5},{"$f":"'9'!F13","v":0},{"$f":"'9'!G13","v":0},7]
[9,{"$f":"'9'!A14","v":"LEBRUN Martial"},{"$f":"'9'!B14","v":"Bascule 200200"},{"$f":"'9'!C14","v":7},{"$f":"'9'!D14","v":0},{"$f":"'9'!E14","v":0},{"$f":"'9'!F14","v":0},{"$f":"'9'!G14","v":0},7]
[9,{"$f":"'9'!A15","v":0},{"$f":"'9'!B15","v":0},{"$f":"'9'!C15","v":0},{"$f":"'9'!D15","v":0},{"$f":"'9'!E15","v":0},{"$f":"'9'!F15","v":0},{"$f":"'9'!G15","v":0},0]
[9,{"$f":"'9'!A16","v":0},{"$f":"'9'!B16","v":0},{"$f":"'9'!C16","v":0},{"$f":"'9'!D16","v":0},{"$f":"'9'!E16","v":0},{"$f":"'9'!F16","v":0},{"$f":"'9'!G16","v":0},{"$f":"D104+H104+F104","v":0}]
[9,{"$f":"'9'!A17","v":0},{"$f":"'9'!B17","v":0},{"$f":"'9'!C17","v":0},{"$f":"'9'!D17","v":0},{"$f":"'9'!E17","v":0},{"$f":"'9'!F17","v":0},{"$f":"'9'!G17","v":0},0]
[9,{"$f":"'9'!A18","v":0},{"$f":"'9'!B18","v":0},{"$f":"'9'!C18","v":0},{"$f":"'9'!D18","v":0},{"$f":"'9'!E18","v":0},{"$f":"'9'!F18","v":0},{"$f":"'9'!G18","v":0},0]
[9,{"$f":"'9'!A19","v":0},{"$f":"'9'!B19","v":0},{"$f":"'9'!C19","v":0},{"$f":"'9'!D19","v":0},{"$f":"'9'!E19","v":0},{"$f":"'9'!F19","v":0},{"$f":"'9'!G19","v":0},0]
[9,{"$f":"'9'!A20","v":0},{"$f":"'9'!B20","v":0},{"$f":"'9'!C20","v":0},{"$f":"'9'!D20","v":0},{"$f":"'9'!E20","v":0},{"$f":"'9'!F20","v":0},{"$f":"'9'!G20","v":0},0]
[9,{"$f":"'9'!A21","v":0},{"$f":"'9'!B21","v":0},{"$f":"'9'!C21","v":0},{"$f":"'9'!D21","v":0},{"$f":"'9'!E21","v":0},{"$f":"'9'!F21","v":0},{"$f":"'9'!G21","v":0},0]
[9,{"$f":"'9'!A22","v":0},{"$f":"'9'!B22","v":0},{"$f":"'9'!C22","v":0},{"$f":"'9'!D22","v":0},{"$f":"'9'!E22","v":0},{"$f":"'9'!F22","v":0},{"$f":"'9'!G22","v":0},0]
[10,{"$f":"'10'!A11","v":0},{"$f":"'10'!B11","v":0},{"$f":"'10'!C11","v":0},{"$f":"'10'!D11","v":0},{"$f":"'10'!E11","v":0},{"$f":"'10'!F11","v":0},{"$f":"'10'!G11","v":0},0]
[{"$f":"A111","v":10},{"$f":"'10'!A12","v":0},{"$f":"'10'!B12","v":0},{"$f":"'10'!C12","v":0},{"$f":"'10'!D12","v":0},{"$f":"'10'!E12","v":0},{"$f":"'10'!F12","v":0},{"$f":"'10'!G12","v":0},0]
[{"$f":"A112","v":10},{"$f":"'10'!A13","v":0},{"$f":"'10'!B13","v":0},{"$f":"'10'!C13","v":0},{"$f":"'10'!D13","v":0},{"$f":"'10'!E13","v":0},{"$f":"'10'!F13","v":0},{"$f":"'10'!G13","v":0},0]
[10,{"$f":"'10'!A14","v":0},{"$f":"'10'!B14","v":0},{"$f":"'10'!C14","v":0},{"$f":"'10'!D14","v":0},{"$f":"'10'!E14","v":0},{"$f":"'10'!F14","v":0},{"$f":"'10'!G14","v":0},0]
[10,{"$f":"'10'!A15","v":0},{"$f":"'10'!B15","v":0},{"$f":"'10'!C15","v":0},{"$f":"'10'!D15","v":0},{"$f":"'10'!E15","v":0},{"$f":"'10'!F15","v":0},{"$f":"'10'!G15","v":0},0]
[10,{"$f":"'10'!A16","v":0},{"$f":"'10'!B16","v":0},{"$f":"'10'!C16","v":0},{"$f":"'10'!D16","v":0},{"$f":"'10'!E16","v":0},{"$f":"'10'!F16","v":0},{"$f":"'10'!G16","v":0},0]
[10,{"$f":"'10'!A17","v":0},{"$f":"'10'!B17","v":0},{"$f":"'10'!C17","v":0},{"$f":"'10'!D17","v":0},{"$f":"'10'!E17","v":0},{"$f":"'10'!F17","v":0},{"$f":"'10'!G17","v":0},0]
[10,{"$f":"'10'!A18","v":0},{"$f":"'10'!B18","v":0},{"$f":"'10'!C18","v":0},{"$f":"'10'!D18","v":0},{"$f":"'10'!E18","v":0},{"$f":"'10'!F18","v":0},{"$f":"'10'!G18","v":0},0]
[10,{"$f":"'10'!A19","v":0},{"$f":"'10'!B19","v":0},{"$f":"'10'!C19","v":0},{"$f":"'10'!D19","v":0},{"$f":"'10'!E19","v":0},{"$f":"'10'!F19","v":0},{"$f":"'10'!G19","v":0},0]
[10,{"$f":"'10'!A20","v":0},{"$f":"'10'!B20","v":0},{"$f":"'10'!C20","v":0},{"$f":"'10'!D20","v":0},{"$f":"'10'!E20","v":0},{"$f":"'10'!F20","v":0},{"$f":"'10'!G20","v":0},0]
[10,{"$f":"'10'!A21","v":0},{"$f":"'10'!B21","v":0},{"$f":"'10'!C21","v":0},{"$f":"'10'!D21","v":0},{"$f":"'10'!E21","v":0},{"$f":"'10'!F21","v":0},{"$f":"'10'!G21","v":0},0]
[10,{"$f":"'10'!A22","v":0},{"$f":"'10'!B22","v":0},{"$f":"'10'!C22","v":0},{"$f":"'10'!D22","v":0},{"$f":"'10'!E22","v":0},{"$f":"'10'!F22","v":0},{"$f":"'10'!G22","v":0},0]
[11,{"$f":"'11'!A11","v":0},{"$f":"'11'!B11","v":0},{"$f":"'11'!C11","v":0},{"$f":"'11'!D11","v":0},{"$f":"'11'!E11","v":0},{"$f":"'11'!F11","v":0},{"$f":"'11'!G11","v":0},{"$f":"'11'!H11","v":0}]
[{"$f":"A123","v":11},{"$f":"'11'!A12","v":0},{"$f":"'11'!B12","v":0},{"$f":"'11'!C12","v":0},{"$f":"'11'!D12","v":0},{"$f":"'11'!E12","v":0},{"$f":"'11'!F12","v":0},{"$f":"'11'!G12","v":0},0]
[{"$f":"A124","v":11},{"$f":"'11'!A13","v":0},{"$f":"'11'!B13","v":0},{"$f":"'11'!C13","v":0},{"$f":"'11'!D13","v":0},{"$f":"'11'!E13","v":0},{"$f":"'11'!F13","v":0},{"$f":"'11'!G13","v":0},0]
[{"$f":"A125","v":11},{"$f":"'11'!A14","v":0},{"$f":"'11'!B14","v":0},{"$f":"'11'!C14","v":0},{"$f":"'11'!D14","v":0},{"$f":"'11'!E14","v":0},{"$f":"'11'!F14","v":0},{"$f":"'11'!G14","v":0},0]
[11,{"$f":"'11'!A15","v":0},{"$f":"'11'!B15","v":0},{"$f":"'11'!C15","v":0},{"$f":"'11'!D15","v":0},{"$f":"'11'!E15","v":0},{"$f":"'11'!F15","v":0},{"$f":"'11'!G15","v":0},0]
[11,{"$f":"'11'!A16","v":0},{"$f":"'11'!B16","v":0},{"$f":"'11'!C16","v":0},{"$f":"'11'!D16","v":0},{"$f":"'11'!E16","v":0},{"$f":"'11'!F16","v":0},{"$f":"'11'!G16","v":0},0]
[11,{"$f":"'11'!A17","v":0},{"$f":"'11'!B17","v":0},{"$f":"'11'!C17","v":0},{"$f":"'11'!D17","v":0},{"$f":"'11'!E17","v":0},{"$f":"'11'!F17","v":0},{"$f":"'11'!G17","v":0},0]
[11,{"$f":"'11'!A18","v":0},{"$f":"'11'!B18","v":0},{"$f":"'11'!C18","v":0},{"$f":"'11'!D18","v":0},{"$f":"'11'!E18","v":0},{"$f":"'11'!F18","v":0},{"$f":"'11'!G18","v":0},0]
[11,{"$f":"'11'!A19","v":0},{"$f":"'11'!B19","v":0},{"$f":"'11'!C19","v":0},{"$f":"'11'!D19","v":0},{"$f":"'11'!E19","v":0},{"$f":"'11'!F19","v":0},{"$f":"'11'!G19","v":0},0]
[11,{"$f":"'11'!A20","v":0},{"$f":"'11'!B20","v":0},{"$f":"'11'!C20","v":0},{"$f":"'11'!D20","v":0},{"$f":"'11'!E20","v":0},{"$f":"'11'!F20","v":0},{"$f":"'11'!G20","v":0},0]
[11,{"$f":"'11'!A21","v":0},{"$f":"'11'!B21","v":0},{"$f":"'11'!C21","v":0},{"$f":"'11'!D21","v":0},{"$f":"'11'!E21","v":0},{"$f":"'11'!F21","v":0},{"$f":"'11'!G21","v":0},0]
[11,{"$f":"'11'!A22","v":0},{"$f":"'11'!B22","v":0},{"$f":"'11'!C22","v":0},{"$f":"'11'!D22","v":0},{"$f":"'11'!E22","v":0},{"$f":"'11'!F22","v":0},{"$f":"'11'!G22","v":0},0]
[12,{"$f":"'12'!A11","v":"CRETIN Brigitte"},{"$f":"'12'!B11","v":"Bascule 200200"},{"$f":"'12'!C11","v":8},{"$f":"'12'!D11","v":0},{"$f":"'12'!E11","v":0},{"$f":"'12'!F11","v":0},{"$f":"'12'!G11","v":0},8]
[{"$f":"A135","v":12},{"$f":"'12'!A12","v":"DORKELD Didier"},{"$f":"'12'!B12","v":"210258 Travaux divers sans engins"},{"$f":"'12'!C12","v":3},{"$f":"'12'!D12","v":"Sur Engin Chargement client"},{"$f":"'12'!E12","v":5},{"$f":"'12'!F12","v":0},{"$f":"'12'!G12","v":0},8]
[{"$f":"A136","v":12},{"$f":"'12'!A13","v":0},{"$f":"'12'!B13","v":0},{"$f":"'12'!C13","v":0},{"$f":"'12'!D13","v":0},{"$f":"'12'!E13","v":0},{"$f":"'12'!F13","v":0},{"$f":"'12'!G13","v":0},0]
[12,{"$f":"'12'!A14","v":0},{"$f":"'12'!B14","v":0},{"$f":"'12'!C14","v":0},{"$f":"'12'!D14","v":0},{"$f":"'12'!E14","v":0},{"$f":"'12'!F14","v":0},{"$f":"'12'!G14","v":0},0]
[12,{"$f":"'12'!A15","v":0},{"$f":"'12'!B15","v":0},{"$f":"'12'!C15","v":0},{"$f":"'12'!D15","v":0},{"$f":"'12'!E15","v":0},{"$f":"'12'!F15","v":0},{"$f":"'12'!G15","v":0},0]
[12,{"$f":"'12'!A16","v":0},{"$f":"'12'!B16","v":0},{"$f":"'12'!C16","v":0},{"$f":"'12'!D16","v":0},{"$f":"'12'!E16","v":0},{"$f":"'12'!F16","v":0},{"$f":"'12'!G16","v":0},0]
[12,{"$f":"'12'!A17","v":0},{"$f":"'12'!B17","v":0},{"$f":"'12'!C17","v":0},{"$f":"'12'!D17","v":0},{"$f":"'12'!E17","v":0},{"$f":"'12'!F17","v":0},{"$f":"'12'!G17","v":0},0]
[12,{"$f":"'12'!A18","v":0},{"$f":"'12'!B18","v":0},{"$f":"'12'!C18","v":0},{"$f":"'12'!D18","v":0},{"$f":"'12'!E18","v":0},{"$f":"'12'!F18","v":0},{"$f":"'12'!G18","v":0},0]
[12,{"$f":"'12'!A19","v":0},{"$f":"'12'!B19","v":0},{"$f":"'12'!C19","v":0},{"$f":"'12'!D19","v":0},{"$f":"'12'!E19","v":0},{"$f":"'12'!F19","v":0},{"$f":"'12'!G19","v":0},0]
[12,{"$f":"'12'!A20","v":0},{"$f":"'12'!B20","v":0},{"$f":"'12'!C20","v":0},{"$f":"'12'!D20","v":0},{"$f":"'12'!E20","v":0},{"$f":"'12'!F20","v":0},{"$f":"'12'!G20","v":0},0]
[12,{"$f":"'12'!A21","v":0},{"$f":"'12'!B21","v":0},{"$f":"'12'!C21","v":0},{"$f":"'12'!D21","v":0},{"$f":"'12'!E21","v":0},{"$f":"'12'!F21","v":0},{"$f":"'12'!G21","v":0},0]
[12,{"$f":"'12'!A22","v":0},{"$f":"'12'!B22","v":0},{"$f":"'12'!C22","v":0},{"$f":"'12'!D22","v":0},{"$f":"'12'!E22","v":0},{"$f":"'12'!F22","v":0},{"$f":"'12'!G22","v":0},0]
[13,{"$f":"'13'!A11","v":"CRETIN Brigitte"},{"$f":"'13'!B11","v":"Bascule 200200"},{"$f":"'13'!C11","v":8},{"$f":"'13'!D11","v":0},{"$f":"'13'!E11","v":0},{"$f":"'13'!F11","v":0},{"$f":"'13'!G11","v":0},8]
[13,{"$f":"'13'!A12","v":"DORKELD Didier"},{"$f":"'13'!B12","v":"210258 Travaux divers sans engins"},{"$f":"'13'!C12","v":2},{"$f":"'13'!D12","v":"Sur Engin Chargement client"},{"$f":"'13'!E12","v":6},{"$f":"'13'!F12","v":0},{"$f":"'13'!G12","v":0},8]
[13,{"$f":"'13'!A13","v":0},{"$f":"'13'!B13","v":0},{"$f":"'13'!C13","v":0},{"$f":"'13'!D13","v":0},{"$f":"'13'!E13","v":0},{"$f":"'13'!F13","v":0},{"$f":"'13'!G13","v":0},0]
[13,{"$f":"'13'!A14","v":0},{"$f":"'13'!B14","v":0},{"$f":"'13'!C14","v":0},{"$f":"'13'!D14","v":0},{"$f":"'13'!E14","v":0},{"$f":"'13'!F14","v":0},{"$f":"'13'!G14","v":0},0]
[13,{"$f":"'13'!A15","v":0},{"$f":"'13'!B15","v":0},{"$f":"'13'!C15","v":0},{"$f":"'13'!D15","v":0},{"$f":"'13'!E15","v":0},{"$f":"'13'!F15","v":0},{"$f":"'13'!G15","v":0},0]
[13,{"$f":"'13'!A16","v":0},{"$f":"'13'!B16","v":0},{"$f":"'13'!C16","v":0},{"$f":"'13'!D16","v":0},{"$f":"'13'!E16","v":0},{"$f":"'13'!F16","v":0},{"$f":"'13'!G16","v":0},0]
[13,{"$f":"'13'!A17","v":0},{"$f":"'13'!B17","v":0},{"$f":"'13'!C17","v":0},{"$f":"'13'!D17","v":0},{"$f":"'13'!E17","v":0},{"$f":"'13'!F17","v":0},{"$f":"'13'!G17","v":0},0]
[13,{"$f":"'13'!A18","v":0},{"$f":"'13'!B18","v":0},{"$f":"'13'!C18","v":0},{"$f":"'13'!D18","v":0},{"$f":"'13'!E18","v":0},{"$f":"'13'!F18","v":0},{"$f":"'13'!G18","v":0},0]
[13,{"$f":"'13'!A19","v":0},{"$f":"'13'!B19","v":0},{"$f":"'13'!C19","v":0},{"$f":"'13'!D19","v":0},{"$f":"'13'!E19","v":0},{"$f":"'13'!F19","v":0},{"$f":"'13'!G19","v":0},0]
[13,{"$f":"'13'!A20","v":0},{"$f":"'13'!B20","v":0},{"$f":"'13'!C20","v":0},{"$f":"'13'!D20","v":0},{"$f":"'13'!E20","v":0},{"$f":"'13'!F20","v":0},{"$f":"'13'!G20","v":0},0]
[13,{"$f":"'13'!A21","v":0},{"$f":"'13'!B21","v":0},{"$f":"'13'!C21","v":0},{"$f":"'13'!D21","v":0},{"$f":"'13'!E21","v":0},{"$f":"'13'!F21","v":0},{"$f":"'13'!G21","v":0},0]
[13,{"$f":"'13'!A22","v":0},{"$f":"'13'!B22","v":0},{"$f":"'13'!C22","v":0},{"$f":"'13'!D22","v":0},{"$f":"'13'!E22","v":0},{"$f":"'13'!F22","v":0},{"$f":"'13'!G22","v":0},0]
[14,{"$f":"'14'!A11","v":"CRETIN Brigitte"},{"$f":"'14'!B11","v":"Bascule 200200"},{"$f":"'14'!C11","v":8},{"$f":"'14'!D11","v":0},{"$f":"'14'!E11","v":0},{"$f":"'14'!F11","v":0},{"$f":"'14'!G11","v":0},8]
[{"$f":"A159","v":14},{"$f":"'14'!A12","v":"DORKELD Didier"},{"$f":"'14'!B12","v":"210258 Travaux divers sans engins"},{"$f":"'14'!C12","v":6},{"$f":"'14'!D12","v":"Sur Engin Chargement client"},{"$f":"'14'!E12","v":2},{"$f":"'14'!F12","v":0},{"$f":"'14'!G12","v":0},8]
[{"$f":"A160","v":14},{"$f":"'14'!A13","v":0},{"$f":"'14'!B13","v":0},{"$f":"'14'!C13","v":0},{"$f":"'14'!D13","v":0},{"$f":"'14'!E13","v":0},{"$f":"'14'!F13","v":0},{"$f":"'14'!G13","v":0},0]
[14,{"$f":"'14'!A14","v":0},{"$f":"'14'!B14","v":0},{"$f":"'14'!C14","v":0},{"$f":"'14'!D14","v":0},{"$f":"'14'!E14","v":0},{"$f":"'14'!F14","v":0},{"$f":"'14'!G14","v":0},0]
[14,{"$f":"'14'!A15","v":0},{"$f":"'14'!B15","v":0},{"$f":"'14'!C15","v":0},{"$f":"'14'!D15","v":0},{"$f":"'14'!E15","v":0},{"$f":"'14'!F15","v":0},{"$f":"'14'!G15","v":0},0]
[14,{"$f":"'14'!A16","v":0},{"$f":"'14'!B16","v":0},{"$f":"'14'!C16","v":0},{"$f":"'14'!D16","v":0},{"$f":"'14'!E16","v":0},{"$f":"'14'!F16","v":0},{"$f":"'14'!G16","v":0},0]
[14,{"$f":"'14'!A17","v":0},{"$f":"'14'!B17","v":0},{"$f":"'14'!C17","v":0},{"$f":"'14'!D17","v":0},{"$f":"'14'!E17","v":0},{"$f":"'14'!F17","v":0},{"$f":"'14'!G17","v":0},0]
[14,{"$f":"'14'!A18","v":0},{"$f":"'14'!B18","v":0},{"$f":"'14'!C18","v":0},{"$f":"'14'!D18","v":0},{"$f":"'14'!E18","v":0},{"$f":"'14'!F18","v":0},{"$f":"'14'!G18","v":0},0]
[14,{"$f":"'14'!A19","v":0},{"$f":"'14'!B19","v":0},{"$f":"'14'!C19","v":0},{"$f":"'14'!D19","v":0},{"$f":"'14'!E19","v":0},{"$f":"'14'!F19","v":0},{"$f":"'14'!G19","v":0},0]
[14,{"$f":"'14'!A20","v":0},{"$f":"'14'!B20","v":0},{"$f":"'14'!C20","v":0},{"$f":"'14'!D20","v":0},{"$f":"'14'!E20","v":0},{"$f":"'14'!F20","v":0},{"$f":"'14'!G20","v":0},{"$f":"D168+H168+F168","v":0}]
[14,{"$f":"'14'!A21","v":0},{"$f":"'14'!B21","v":0},{"$f":"'14'!C21","v":0},{"$f":"'14'!D21","v":0},{"$f":"'14'!E21","v":0},{"$f":"'14'!F21","v":0},{"$f":"'14'!G21","v":0},0]
[14,{"$f":"'14'!A22","v":0},{"$f":"'14'!B22","v":0},{"$f":"'14'!C22","v":0},{"$f":"'14'!D22","v":0},{"$f":"'14'!E22","v":0},{"$f":"'14'!F22","v":0},{"$f":"'14'!G22","v":0},0]
[15,{"$f":"'15'!A11","v":"CRETIN Brigitte"},{"$f":"'15'!B11","v":"Bascule 200200"},{"$f":"'15'!C11","v":8},{"$f":"'15'!D11","v":0},{"$f":"'15'!E11","v":0},{"$f":"'15'!F11","v":0},{"$f":"'15'!G11","v":0},8]
[{"$f":"A171","v":15},{"$f":"'15'!A12","v":"DORKELD Didier"},{"$f":"'15'!B12","v":"210258 Travaux divers sans engins"},{"$f":"'15'!C12","v":6},{"$f":"'15'!D12","v":"Sur Engin Chargement client"},{"$f":"'15'!E12","v":2},{"$f":"'15'!F12","v":0},{"$f":"'15'!G12","v":0},8]
[{"$f":"A172","v":15},{"$f":"'15'!A13","v":0},{"$f":"'15'!B13","v":0},{"$f":"'15'!C13","v":0},{"$f":"'15'!D13","v":0},{"$f":"'15'!E13","v":0},{"$f":"'15'!F13","v":0},{"$f":"'15'!G13","v":0},0]
[15,{"$f":"'15'!A14","v":0},{"$f":"'15'!B14","v":0},{"$f":"'15'!C14","v":0},{"$f":"'15'!D14","v":0},{"$f":"'15'!E14","v":0},{"$f":"'15'!F14","v":0},{"$f":"'15'!G14","v":0},0]
[15,{"$f":"'15'!A15","v":0},{"$f":"'15'!B15","v":0},{"$f":"'15'!C15","v":0},{"$f":"'15'!D15","v":0},{"$f":"'15'!E15","v":0},{"$f":"'15'!F15","v":0},{"$f":"'15'!G15","v":0},0]
[15,{"$f":"'15'!A16","v":0},{"$f":"'15'!B16","v":0},{"$f":"'15'!C16","v":0},{"$f":"'15'!D16","v":0},{"$f":"'15'!E16","v":0},{"$f":"'15'!F16","v":0},{"$f":"'15'!G16","v":0},0]
[15,{"$f":"'15'!A17","v":0},{"$f":"'15'!B17","v":0},{"$f":"'15'!C17","v":0},{"$f":"'15'!D17","v":0},{"$f":"'15'!E17","v":0},{"$f":"'15'!F17","v":0},{"$f":"'15'!G17","v":0},0]
[15,{"$f":"'15'!A18","v":0},{"$f":"'15'!B18","v":0},{"$f":"'15'!C18","v":0},{"$f":"'15'!D18","v":0},{"$f":"'15'!E18","v":0},{"$f":"'15'!F18","v":0},{"$f":"'15'!G18","v":0},0]
[15,{"$f":"'15'!A19","v":0},{"$f":"'15'!B19","v":0},{"$f":"'15'!C19","v":0},{"$f":"'15'!D19","v":0},{"$f":"'15'!E19","v":0},{"$f":"'15'!F19","v":0},{"$f":"'15'!G19","v":0},0]
[15,{"$f":"'15'!A20","v":0},{"$f":"'15'!B20","v":0},{"$f":"'15'!C20","v":0},{"$f":"'15'!D20","v":0},{"$f":"'15'!E20","v":0},{"$f":"'15'!F20","v":0},{"$f":"'15'!G20","v":0},0]
[15,{"$f":"'15'!A21","v":0},{"$f":"'15'!B21","v":0},{"$f":"'15'!C21","v":0},{"$f":"'15'!D21","v":0},{"$f":"'15'!E21","v":0},{"$f":"'15'!F21","v":0},{"$f":"'15'!G21","v":0},0]
[15,{"$f":"'15'!A22","v":0},{"$f":"'15'!B22","v":0},{"$f":"'15'!C22","v":0},{"$f":"'15'!D22","v":0},{"$f":"'15'!E22","v":0},{"$f":"'15'!F22","v":0},{"$f":"'15'!G22","v":0},0]
[16,{"$f":"'16'!A11","v":"CRETIN Brigitte"},{"$f":"'16'!B11","v":"Bascule 200200"},{"$f":"'16'!C11","v":7},{"$f":"'16'!D11","v":0},{"$f":"'16'!E11","v":0},{"$f":"'16'!F11","v":0},{"$f":"'16'!G11","v":0},7]
[{"$f":"A183","v":16},{"$f":"'16'!A12","v":"DORKELD Didier"},{"$f":"'16'!B12","v":"210258 Travaux divers sans engins"},{"$f":"'16'!C12","v":5},{"$f":"'16'!D12","v":"Sur Engin Chargement client"},{"$f":"'16'!E12","v":2},{"$f":"'16'!F12","v":0},{"$f":"'16'!G12","v":0},7]
[{"$f":"A184","v":16},{"$f":"'16'!A13","v":0},{"$f":"'16'!B13","v":0},{"$f":"'16'!C13","v":0},{"$f":"'16'!D13","v":0},{"$f":"'16'!E13","v":0},{"$f":"'16'!F13","v":0},{"$f":"'16'!G13","v":0},0]
[16,{"$f":"'16'!A14","v":0},{"$f":"'16'!B14","v":0},{"$f":"'16'!C14","v":0},{"$f":"'16'!D14","v":0},{"$f":"'16'!E14","v":0},{"$f":"'16'!F14","v":0},{"$f":"'16'!G14","v":0},0]
[16,{"$f":"'16'!A15","v":0},{"$f":"'16'!B15","v":0},{"$f":"'16'!C15","v":0},{"$f":"'16'!D15","v":0},{"$f":"'16'!E15","v":0},{"$f":"'16'!F15","v":0},{"$f":"'16'!G15","v":0},0]
[16,{"$f":"'16'!A16","v":0},{"$f":"'16'!B16","v":0},{"$f":"'16'!C16","v":0},{"$f":"'16'!D16","v":0},{"$f":"'16'!E16","v":0},{"$f":"'16'!F16","v":0},{"$f":"'16'!G16","v":0},0]
[16,{"$f":"'16'!A17","v":0},{"$f":"'16'!B17","v":0},{"$f":"'16'!C17","v":0},{"$f":"'16'!D17","v":0},{"$f":"'16'!E17","v":0},{"$f":"'16'!F17","v":0},{"$f":"'16'!G17","v":0},0]
[16,{"$f":"'16'!A18","v":0},{"$f":"'16'!B18","v":0},{"$f":"'16'!C18","v":0},{"$f":"'16'!D18","v":0},{"$f":"'16'!E18","v":0},{"$f":"'16'!F18","v":0},{"$f":"'16'!G18","v":0},0]
[16,{"$f":"'16'!A19","v":0},{"$f":"'16'!B19","v":0},{"$f":"'16'!C19","v":0},{"$f":"'16'!D19","v":0},{"$f":"'16'!E19","v":0},{"$f":"'16'!F19","v":0},{"$f":"'16'!G19","v":0},0]
[16,{"$f":"'16'!A20","v":0},{"$f":"'16'!B20","v":0},{"$f":"'16'!C20","v":0},{"$f":"'16'!D20","v":0},{"$f":"'16'!E20","v":0},{"$f":"'16'!F20","v":0},{"$f":"'16'!G20","v":0},0]
[16,{"$f":"'16'!A21","v":0},{"$f":"'16'!B21","v":0},{"$f":"'16'!C21","v":0},{"$f":"'16'!D21","v":0},{"$f":"'16'!E21","v":0},{"$f":"'16'!F21","v":0},{"$f":"'16'!G21","v":0},0]
[16,{"$f":"'16'!A22","v":0},{"$f":"'16'!B22","v":0},{"$f":"'16'!C22","v":0},{"$f":"'16'!D22","v":0},{"$f":"'16'!E22","v":0},{"$f":"'16'!F22","v":0},{"$f":"'16'!G22","v":0},0]
[17,{"$f":"'17'!A11","v":0},{"$f":"'17'!B11","v":0},{"$f":"'17'!C11","v":0},{"$f":"'17'!D11","v":0},{"$f":"'17'!E11","v":0},{"$f":"'17'!F11","v":0},{"$f":"'17'!G11","v":0},0]
[{"$f":"A195","v":17},{"$f":"'17'!A12","v":0},{"$f":"'17'!B12","v":0},{"$f":"'17'!C12","v":0},{"$f":"'17'!D12","v":0},{"$f":"'17'!E12","v":0},{"$f":"'17'!F12","v":0},{"$f":"'17'!G12","v":0},0]
[{"$f":"A196","v":17},{"$f":"'17'!A13","v":0},{"$f":"'17'!B13","v":0},{"$f":"'17'!C13","v":0},{"$f":"'17'!D13","v":0},{"$f":"'17'!E13","v":0},{"$f":"'17'!F13","v":0},{"$f":"'17'!G13","v":0},0]
[17,{"$f":"'17'!A14","v":0},{"$f":"'17'!B14","v":0},{"$f":"'17'!C14","v":0},{"$f":"'17'!D14","v":0},{"$f":"'17'!E14","v":0},{"$f":"'17'!F14","v":0},{"$f":"'17'!G14","v":0},0]
[17,{"$f":"'17'!A15","v":0},{"$f":"'17'!B15","v":0},{"$f":"'17'!C15","v":0},{"$f":"'17'!D15","v":0},{"$f":"'17'!E15","v":0},{"$f":"'17'!F15","v":0},{"$f":"'17'!G15","v":0},0]
[17,{"$f":"'17'!A16","v":0},{"$f":"'17'!B16","v":0},{"$f":"'17'!C16","v":0},{"$f":"'17'!D16","v":0},{"$f":"'17'!E16","v":0},{"$f":"'17'!F16","v":0},{"$f":"'17'!G16","v":0},0]
[17,{"$f":"'17'!A17","v":0},{"$f":"'17'!B17","v":0},{"$f":"'17'!C17","v":0},{"$f":"'17'!D17","v":0},{"$f":"'17'!E17","v":0},{"$f":"'17'!F17","v":0},{"$f":"'17'!G17","v":0},0]
[17,{"$f":"'17'!A18","v":0},{"$f":"'17'!B18","v":0},{"$f":"'17'!C18","v":0},{"$f":"'17'!D18","v":0},{"$f":"'17'!E18","v":0},{"$f":"'17'!F18","v":0},{"$f":"'17'!G18","v":0},0]
[17,{"$f":"'17'!A19","v":0},{"$f":"'17'!B19","v":0},{"$f":"'17'!C19","v":0},{"$f":"'17'!D19","v":0},{"$f":"'17'!E19","v":0},{"$f":"'17'!F19","v":0},{"$f":"'17'!G19","v":0},0]
[17,{"$f":"'17'!A20","v":0},{"$f":"'17'!B20","v":0},{"$f":"'17'!C20","v":0},{"$f":"'17'!D20","v":0},{"$f":"'17'!E20","v":0},{"$f":"'17'!F20","v":0},{"$f":"'17'!G20","v":0},0]
[17,{"$f":"'17'!A21","v":0},{"$f":"'17'!B21","v":0},{"$f":"'17'!C21","v":0},{"$f":"'17'!D21","v":0},{"$f":"'17'!E21","v":0},{"$f":"'17'!F21","v":0},{"$f":"'17'!G21","v":0},0]
[17,{"$f":"'17'!A22","v":0},{"$f":"'17'!B22","v":0},{"$f":"'17'!C22","v":0},{"$f":"'17'!D22","v":0},{"$f":"'17'!E22","v":0},{"$f":"'17'!F22","v":0},{"$f":"'17'!G22","v":0},0]
[18,{"$f":"'18'!A11","v":0},{"$f":"'18'!B11","v":0},{"$f":"'18'!C11","v":0},{"$f":"'18'!D11","v":0},{"$f":"'18'!E11","v":0},{"$f":"'18'!F11","v":0},{"$f":"'18'!G11","v":0},0]
[{"$f":"A207","v":18},{"$f":"'18'!A12","v":0},{"$f":"'18'!B12","v":0},{"$f":"'18'!C12","v":0},{"$f":"'18'!D12","v":0},{"$f":"'18'!E12","v":0},{"$f":"'18'!F12","v":0},{"$f":"'18'!G12","v":0},0]
[{"$f":"A208","v":18},{"$f":"'18'!A13","v":0},{"$f":"'18'!B13","v":0},{"$f":"'18'!C13","v":0},{"$f":"'18'!D13","v":0},{"$f":"'18'!E13","v":0},{"$f":"'18'!F13","v":0},{"$f":"'18'!G13","v":0},0]
[18,{"$f":"'18'!A14","v":0},{"$f":"'18'!B14","v":0},{"$f":"'18'!C14","v":0},{"$f":"'18'!D14","v":0},{"$f":"'18'!E14","v":0},{"$f":"'18'!F14","v":0},{"$f":"'18'!G14","v":0},0]
[18,{"$f":"'18'!A15","v":0},{"$f":"'18'!B15","v":0},{"$f":"'18'!C15","v":0},{"$f":"'18'!D15","v":0},{"$f":"'18'!E15","v":0},{"$f":"'18'!F15","v":0},{"$f":"'18'!G15","v":0},0]
[18,{"$f":"'18'!A16","v":0},{"$f":"'18'!B16","v":0},{"$f":"'18'!C16","v":0},{"$f":"'18'!D16","v":0},{"$f":"'18'!E16","v":0},{"$f":"'18'!F16","v":0},{"$f":"'18'!G16","v":0},0]
[18,{"$f":"'18'!A17","v":0},{"$f":"'18'!B17","v":0},{"$f":"'18'!C17","v":0},{"$f":"'18'!D17","v":0},{"$f":"'18'!E17","v":0},{"$f":"'18'!F17","v":0},{"$f":"'18'!G17","v":0},0]
[18,{"$f":"'18'!A18","v":0},{"$f":"'18'!B18","v":0},{"$f":"'18'!C18","v":0},{"$f":"'18'!D18","v":0},{"$f":"'18'!E18","v":0},{"$f":"'18'!F18","v":0},{"$f":"'18'!G18","v":0},0]
[18,{"$f":"'18'!A19","v":0},{"$f":"'18'!B19","v":0},{"$f":"'18'!C19","v":0},{"$f":"'18'!D19","v":0},{"$f":"'18'!E19","v":0},{"$f":"'18'!F19","v":0},{"$f":"'18'!G19","v":0},0]
[18,{"$f":"'18'!A20","v":0},{"$f":"'18'!B20","v":0},{"$f":"'18'!C20","v":0},{"$f":"'18'!D20","v":0},{"$f":"'18'!E20","v":0},{"$f":"'18'!F20","v":0},{"$f":"'18'!G20","v":0},0]
[18,{"$f":"'18'!A21","v":0},{"$f":"'18'!B21","v":0},{"$f":"'18'!C21","v":0},{"$f":"'18'!D21","v":0},{"$f":"'18'!E21","v":0},{"$f":"'18'!F21","v":0},{"$f":"'18'!G21","v":0},0]
[18,{"$f":"'18'!A22","v":0},{"$f":"'18'!B22","v":0},{"$f":"'18'!C22","v":0},{"$f":"'18'!D22","v":0},{"$f":"'18'!E22","v":0},{"$f":"'18'!F22","v":0},{"$f":"'18'!G22","v":0},0]
[19,{"$f":"'19'!A11","v":0},{"$f":"'19'!B11","v":0},{"$f":"'19'!C11","v":0},{"$f":"'19'!D11","v":0},{"$f":"'19'!E11","v":0},{"$f":"'19'!F11","v":0},{"$f":"'19'!G11","v":0},0]
[{"$f":"A219","v":19},{"$f":"'19'!A12","v":0},{"$f":"'19'!B12","v":0},{"$f":"'19'!C12","v":0},{"$f":"'19'!D12","v":0},{"$f":"'19'!E12","v":0},{"$f":"'19'!F12","v":0},{"$f":"'19'!G12","v":0},{"$f":"D220+H220+F220","v":0}]
[{"$f":"A220","v":19},{"$f":"'19'!A13","v":0},{"$f":"'19'!B13","v":0},{"$f":"'19'!C13","v":0},{"$f":"'19'!D13","v":0},{"$f":"'19'!E13","v":0},{"$f":"'19'!F13","v":0},{"$f":"'19'!G13","v":0},0]
[19,{"$f":"'19'!A14","v":0},{"$f":"'19'!B14","v":0},{"$f":"'19'!C14","v":0},{"$f":"'19'!D14","v":0},{"$f":"'19'!E14","v":0},{"$f":"'19'!F14","v":0},{"$f":"'19'!G14","v":0},0]
[19,{"$f":"'19'!A15","v":0},{"$f":"'19'!B15","v":0},{"$f":"'19'!C15","v":0},{"$f":"'19'!D15","v":0},{"$f":"'19'!E15","v":0},{"$f":"'19'!F15","v":0},{"$f":"'19'!G15","v":0},0]
[19,{"$f":"'19'!A16","v":0},{"$f":"'19'!B16","v":0},{"$f":"'19'!C16","v":0},{"$f":"'19'!D16","v":0},{"$f":"'19'!E16","v":0},{"$f":"'19'!F16","v":0},{"$f":"'19'!G16","v":0},0]
[19,{"$f":"'19'!A17","v":0},{"$f":"'19'!B17","v":0},{"$f":"'19'!C17","v":0},{"$f":"'19'!D17","v":0},{"$f":"'19'!E17","v":0},{"$f":"'19'!F17","v":0},{"$f":"'19'!G17","v":0},0]
[19,{"$f":"'19'!A18","v":0},{"$f":"'19'!B18","v":0},{"$f":"'19'!C18","v":0},{"$f":"'19'!D18","v":0},{"$f":"'19'!E18","v":0},{"$f":"'19'!F18","v":0},{"$f":"'19'!G18","v":0},0]
[19,{"$f":"'19'!A19","v":0},{"$f":"'19'!B19","v":0},{"$f":"'19'!C19","v":0},{"$f":"'19'!D19","v":0},{"$f":"'19'!E19","v":0},{"$f":"'19'!F19","v":0},{"$f":"'19'!G19","v":0},0]
[19,{"$f":"'19'!A20","v":0},{"$f":"'19'!B20","v":0},{"$f":"'19'!C20","v":0},{"$f":"'19'!D20","v":0},{"$f":"'19'!E20","v":0},{"$f":"'19'!F20","v":0},{"$f":"'19'!G20","v":0},0]
[19,{"$f":"'19'!A21","v":0},{"$f":"'19'!B21","v":0},{"$f":"'19'!C21","v":0},{"$f":"'19'!D21","v":0},{"$f":"'19'!E21","v":0},{"$f":"'19'!F21","v":0},{"$f":"'19'!G21","v":0},0]
[19,{"$f":"'19'!A22","v":0},{"$f":"'19'!B22","v":0},{"$f":"'19'!C22","v":0},{"$f":"'19'!D22","v":0},{"$f":"'19'!E22","v":0},{"$f":"'19'!F22","v":0},{"$f":"'19'!G22","v":0},0]
[20,{"$f":"'20'!A11","v":0},{"$f":"'20'!B11","v":0},{"$f":"'20'!C11","v":0},{"$f":"'20'!D11","v":0},{"$f":"'20'!E11","v":0},{"$f":"'20'!F11","v":0},{"$f":"'20'!G11","v":0},0]
[{"$f":"A231","v":20},{"$f":"'20'!A12","v":0},{"$f":"'20'!B12","v":0},{"$f":"'20'!C12","v":0},{"$f":"'20'!D12","v":0},{"$f":"'20'!E12","v":0},{"$f":"'20'!F12","v":0},{"$f":"'20'!G12","v":0},0]
[{"$f":"A232","v":20},{"$f":"'20'!A13","v":0},{"$f":"'20'!B13","v":0},{"$f":"'20'!C13","v":0},{"$f":"'20'!D13","v":0},{"$f":"'20'!E13","v":0},{"$f":"'20'!F13","v":0},{"$f":"'20'!G13","v":0},{"$f":"D233+H233+F233","v":0}]
[20,{"$f":"'20'!A14","v":0},{"$f":"'20'!B14","v":0},{"$f":"'20'!C14","v":0},{"$f":"'20'!D14","v":0},{"$f":"'20'!E14","v":0},{"$f":"'20'!F14","v":0},{"$f":"'20'!G14","v":0},0]
[20,{"$f":"'20'!A15","v":0},{"$f":"'20'!B15","v":0},{"$f":"'20'!C15","v":0},{"$f":"'20'!D15","v":0},{"$f":"'20'!E15","v":0},{"$f":"'20'!F15","v":0},{"$f":"'20'!G15","v":0},0]
[20,{"$f":"'20'!A16","v":0},{"$f":"'20'!B16","v":0},{"$f":"'20'!C16","v":0},{"$f":"'20'!D16","v":0},{"$f":"'20'!E16","v":0},{"$f":"'20'!F16","v":0},{"$f":"'20'!G16","v":0},0]
[20,{"$f":"'20'!A17","v":0},{"$f":"'20'!B17","v":0},{"$f":"'20'!C17","v":0},{"$f":"'20'!D17","v":0},{"$f":"'20'!E17","v":0},{"$f":"'20'!F17","v":0},{"$f":"'20'!G17","v":0},0]
[20,{"$f":"'20'!A18","v":0},{"$f":"'20'!B18","v":0},{"$f":"'20'!C18","v":0},{"$f":"'20'!D18","v":0},{"$f":"'20'!E18","v":0},{"$f":"'20'!F18","v":0},{"$f":"'20'!G18","v":0},0]
[20,{"$f":"'20'!A19","v":0},{"$f":"'20'!B19","v":0},{"$f":"'20'!C19","v":0},{"$f":"'20'!D19","v":0},{"$f":"'20'!E19","v":0},{"$f":"'20'!F19","v":0},{"$f":"'20'!G19","v":0},0]
[20,{"$f":"'20'!A20","v":0},{"$f":"'20'!B20","v":0},{"$f":"'20'!C20","v":0},{"$f":"'20'!D20","v":0},{"$f":"'20'!E20","v":0},{"$f":"'20'!F20","v":0},{"$f":"'20'!G20","v":0},0]
[20,{"$f":"'20'!A21","v":0},{"$f":"'20'!B21","v":0},{"$f":"'20'!C21","v":0},{"$f":"'20'!D21","v":0},{"$f":"'20'!E21","v":0},{"$f":"'20'!F21","v":0},{"$f":"'20'!G21","v":0},0]
[20,{"$f":"'20'!A22","v":0},{"$f":"'20'!B22","v":0},{"$f":"'20'!C22","v":0},{"$f":"'20'!D22","v":0},{"$f":"'20'!E22","v":0},{"$f":"'20'!F22","v":0},{"$f":"'20'!G22","v":0},0]
[21,{"$f":"'21'!A11","v":0},{"$f":"'21'!B11","v":0},{"$f":"'21'!C11","v":0},{"$f":"'21'!D11","v":0},{"$f":"'21'!E11","v":0},{"$f":"'21'!F11","v":0},{"$f":"'21'!G11","v":0},0]
[21,{"$f":"'21'!A12","v":0},{"$f":"'21'!B12","v":0},{"$f":"'21'!C12","v":0},{"$f":"'21'!D12","v":0},{"$f":"'21'!E12","v":0},{"$f":"'21'!F12","v":0},{"$f":"'21'!G12","v":0},0]
[21,{"$f":"'21'!A13","v":0},{"$f":"'21'!B13","v":0},{"$f":"'21'!C13","v":0},{"$f":"'21'!D13","v":0},{"$f":"'21'!E13","v":0},{"$f":"'21'!F13","v":0},{"$f":"'21'!G13","v":0},0]
[21,{"$f":"'21'!A14","v":0},{"$f":"'21'!B14","v":0},{"$f":"'21'!C14","v":0},{"$f":"'21'!D14","v":0},{"$f":"'21'!E14","v":0},{"$f":"'21'!F14","v":0},{"$f":"'21'!G14","v":0},0]
[21,{"$f":"'21'!A15","v":0},{"$f":"'21'!B15","v":0},{"$f":"'21'!C15","v":0},{"$f":"'21'!D15","v":0},{"$f":"'21'!E15","v":0},{"$f":"'21'!F15","v":0},{"$f":"'21'!G15","v":0},{"$f":"D247+H247+F247","v":0}]
[21,{"$f":"'21'!A16","v":0},{"$f":"'21'!B16","v":0},{"$f":"'21'!C16","v":0},{"$f":"'21'!D16","v":0},{"$f":"'21'!E16","v":0},{"$f":"'21'!F16","v":0},{"$f":"'21'!G16","v":0},0]
[21,{"$f":"'21'!A17","v":0},{"$f":"'21'!B17","v":0},{"$f":"'21'!C17","v":0},{"$f":"'21'!D17","v":0},{"$f":"'21'!E17","v":0},{"$f":"'21'!F17","v":0},{"$f":"'21'!G17","v":0},0]
[21,{"$f":"'21'!A18","v":0},{"$f":"'21'!B18","v":0},{"$f":"'21'!C18","v":0},{"$f":"'21'!D18","v":0},{"$f":"'21'!E18","v":0},{"$f":"'21'!F18","v":0},{"$f":"'21'!G18","v":0},0]
[21,{"$f":"'21'!A19","v":0},{"$f":"'21'!B19","v":0},{"$f":"'21'!C19","v":0},{"$f":"'21'!D19","v":0},{"$f":"'21'!E19","v":0},{"$f":"'21'!F19","v":0},{"$f":"'21'!G19","v":0},0]
[21,{"$f":"'21'!A20","v":0},{"$f":"'21'!B20","v":0},{"$f":"'21'!C20","v":0},{"$f":"'21'!D20","v":0},{"$f":"'21'!E20","v":0},{"$f":"'21'!F20","v":0},{"$f":"'21'!G20","v":0},0]
[21,{"$f":"'21'!A21","v":0},{"$f":"'21'!B21","v":0},{"$f":"'21'!C21","v":0},{"$f":"'21'!D21","v":0},{"$f":"'21'!E21","v":0},{"$f":"'21'!F21","v":0},{"$f":"'21'!G21","v":0},{"$f":"D253+H253+F253","v":0}]
[21,{"$f":"'21'!A22","v":0},{"$f":"'21'!B22","v":0},{"$f":"'21'!C22","v":0},{"$f":"'21'!D22","v":0},{"$f":"'21'!E22","v":0},{"$f":"'21'!F22","v":0},{"$f":"'21'!G22","v":0},0]
[22,{"$f":"'22'!A11","v":0},{"$f":"'22'!B11","v":0},{"$f":"'22'!C11","v":0},{"$f":"'22'!D11","v":0},{"$f":"'22'!E11","v":0},{"$f":"'22'!F11","v":0},{"$f":"'22'!G11","v":0},0]
[{"$f":"A255","v":22},{"$f":"'22'!A12","v":0},{"$f":"'22'!B12","v":0},{"$f":"'22'!C12","v":0},{"$f":"'22'!D12","v":0},{"$f":"'22'!E12","v":0},{"$f":"'22'!F12","v":0},{"$f":"'22'!G12","v":0},{"$f":"D256+H256+F256","v":0}]
[{"$f":"A256","v":22},{"$f":"'22'!A13","v":0},{"$f":"'22'!B13","v":0},{"$f":"'22'!C13","v":0},{"$f":"'22'!D13","v":0},{"$f":"'22'!E13","v":0},{"$f":"'22'!F13","v":0},{"$f":"'22'!G13","v":0},0]
[22,{"$f":"'22'!A14","v":0},{"$f":"'22'!B14","v":0},{"$f":"'22'!C14","v":0},{"$f":"'22'!D14","v":0},{"$f":"'22'!E14","v":0},{"$f":"'22'!F14","v":0},{"$f":"'22'!G14","v":0},0]
[22,{"$f":"'22'!A15","v":0},{"$f":"'22'!B15","v":0},{"$f":"'22'!C15","v":0},{"$f":"'22'!D15","v":0},{"$f":"'22'!E15","v":0},{"$f":"'22'!F15","v":0},{"$f":"'22'!G15","v":0},0]
[22,{"$f":"'22'!A16","v":0},{"$f":"'22'!B16","v":0},{"$f":"'22'!C16","v":0},{"$f":"'22'!D16","v":0},{"$f":"'22'!E16","v":0},{"$f":"'22'!F16","v":0},{"$f":"'22'!G16","v":0},0]
[22,{"$f":"'22'!A17","v":0},{"$f":"'22'!B17","v":0},{"$f":"'22'!C17","v":0},{"$f":"'22'!D17","v":0},{"$f":"'22'!E17","v":0},{"$f":"'22'!F17","v":0},{"$f":"'22'!G17","v":0},0]
[22,{"$f":"'22'!A18","v":0},{"$f":"'22'!B18","v":0},{"$f":"'22'!C18","v":0},{"$f":"'22'!D18","v":0},{"$f":"'22'!E18","v":0},{"$f":"'22'!F18","v":0},{"$f":"'22'!G18","v":0},0]
[22,{"$f":"'22'!A19","v":0},{"$f":"'22'!B19","v":0},{"$f":"'22'!C19","v":0},{"$f":"'22'!D19","v":0},{"$f":"'22'!E19","v":0},{"$f":"'22'!F19","v":0},{"$f":"'22'!G19","v":0},0]
[22,{"$f":"'22'!A20","v":0},{"$f":"'22'!B20","v":0},{"$f":"'22'!C20","v":0},{"$f":"'22'!D20","v":0},{"$f":"'22'!E20","v":0},{"$f":"'22'!F20","v":0},{"$f":"'22'!G20","v":0},0]
[22,{"$f":"'22'!A21","v":0},{"$f":"'22'!B21","v":0},{"$f":"'22'!C21","v":0},{"$f":"'22'!D21","v":0},{"$f":"'22'!E21","v":0},{"$f":"'22'!F21","v":0},{"$f":"'22'!G21","v":0},0]
[22,{"$f":"'22'!A22","v":0},{"$f":"'22'!B22","v":0},{"$f":"'22'!C22","v":0},{"$f":"'22'!D22","v":0},{"$f":"'22'!E22","v":0},{"$f":"'22'!F22","v":0},{"$f":"'22'!G22","v":0},0]
[23,{"$f":"'23'!A11","v":0},{"$f":"'23'!B11","v":0},{"$f":"'23'!C11","v":0},{"$f":"'23'!D11","v":0},{"$f":"'23'!E11","v":0},{"$f":"'23'!F11","v":0},{"$f":"'23'!G11","v":0},0]
[{"$f":"A267","v":23},{"$f":"'23'!A12","v":0},{"$f":"'23'!B12","v":0},{"$f":"'23'!C12","v":0},{"$f":"'23'!D12","v":0},{"$f":"'23'!E12","v":0},{"$f":"'23'!F12","v":0},{"$f":"'23'!G12","v":0},0]
[{"$f":"A268","v":23},{"$f":"'23'!A13","v":0},{"$f":"'23'!B13","v":0},{"$f":"'23'!C13","v":0},{"$f":"'23'!D13","v":0},{"$f":"'23'!E13","v":0},{"$f":"'23'!F13","v":0},{"$f":"'23'!G13","v":0},0]
[23,{"$f":"'23'!A14","v":0},{"$f":"'23'!B14","v":0},{"$f":"'23'!C14","v":0},{"$f":"'23'!D14","v":0},{"$f":"'23'!E14","v":0},{"$f":"'23'!F14","v":0},{"$f":"'23'!G14","v":0},0]
[23,{"$f":"'23'!A15","v":0},{"$f":"'23'!B15","v":0},{"$f":"'23'!C15","v":0},{"$f":"'23'!D15","v":0},{"$f":"'23'!E15","v":0},{"$f":"'23'!F15","v":0},{"$f":"'23'!G15","v":0},0]
[23,{"$f":"'23'!A16","v":0},{"$f":"'23'!B16","v":0},{"$f":"'23'!C16","v":0},{"$f":"'23'!D16","v":0},{"$f":"'23'!E16","v":0},{"$f":"'23'!F16","v":0},{"$f":"'23'!G16","v":0},0]
[23,{"$f":"'23'!A17","v":0},{"$f":"'23'!B17","v":0},{"$f":"'23'!C17","v":0},{"$f":"'23'!D17","v":0},{"$f":"'23'!E17","v":0},{"$f":"'23'!F17","v":0},{"$f":"'23'!G17","v":0},0]
[23,{"$f":"'23'!A18","v":0},{"$f":"'23'!B18","v":0},{"$f":"'23'!C18","v":0},{"$f":"'23'!D18","v":0},{"$f":"'23'!E18","v":0},{"$f":"'23'!F18","v":0},{"$f":"'23'!G18","v":0},0]
[23,{"$f":"'23'!A19","v":0},{"$f":"'23'!B19","v":0},{"$f":"'23'!C19","v":0},{"$f":"'23'!D19","v":0},{"$f":"'23'!E19","v":0},{"$f":"'23'!F19","v":0},{"$f":"'23'!G19","v":0},0]
[23,{"$f":"'23'!A20","v":0},{"$f":"'23'!B20","v":0},{"$f":"'23'!C20","v":0},{"$f":"'23'!D20","v":0},{"$f":"'23'!E20","v":0},{"$f":"'23'!F20","v":0},{"$f":"'23'!G20","v":0},0]
[23,{"$f":"'23'!A21","v":0},{"$f":"'23'!B21","v":0},{"$f":"'23'!C21","v":0},{"$f":"'23'!D21","v":0},{"$f":"'23'!E21","v":0},{"$f":"'23'!F21","v":0},{"$f":"'23'!G21","v":0},0]
[23,{"$f":"'23'!A22","v":0},{"$f":"'23'!B22","v":0},{"$f":"'23'!C22","v":0},{"$f":"'23'!D22","v":0},{"$f":"'23'!E22","v":0},{"$f":"'23'!F22","v":0},{"$f":"'23'!G22","v":0},0]
[24,{"$f":"'24'!A11","v":0},{"$f":"'24'!B11","v":0},{"$f":"'24'!C11","v":0},{"$f":"'24'!D11","v":0},{"$f":"'24'!E11","v":0},{"$f":"'24'!F11","v":0},{"$f":"'24'!G11","v":0},0]
[{"$f":"A279","v":24},{"$f":"'24'!A12","v":0},{"$f":"'24'!B12","v":0},{"$f":"'24'!C12","v":0},{"$f":"'24'!D12","v":0},{"$f":"'24'!E12","v":0},{"$f":"'24'!F12","v":0},{"$f":"'24'!G12","v":0},{"$f":"D280+H280+F280","v":0}]
[{"$f":"A280","v":24},{"$f":"'24'!A13","v":0},{"$f":"'24'!B13","v":0},{"$f":"'24'!C13","v":0},{"$f":"'24'!D13","v":0},{"$f":"'24'!E13","v":0},{"$f":"'24'!F13","v":0},{"$f":"'24'!G13","v":0},0]
[24,{"$f":"'24'!A14","v":0},{"$f":"'24'!B14","v":0},{"$f":"'24'!C14","v":0},{"$f":"'24'!D14","v":0},{"$f":"'24'!E14","v":0},{"$f":"'24'!F14","v":0},{"$f":"'24'!G14","v":0},0]
[24,{"$f":"'24'!A15","v":0},{"$f":"'24'!B15","v":0},{"$f":"'24'!C15","v":0},{"$f":"'24'!D15","v":0},{"$f":"'24'!E15","v":0},{"$f":"'24'!F15","v":0},{"$f":"'24'!G15","v":0},0]
[24,{"$f":"'24'!A16","v":0},{"$f":"'24'!B16","v":0},{"$f":"'24'!C16","v":0},{"$f":"'24'!D16","v":0},{"$f":"'24'!E16","v":0},{"$f":"'24'!F16","v":0},{"$f":"'24'!G16","v":0},0]
[24,{"$f":"'24'!A17","v":0},{"$f":"'24'!B17","v":0},{"$f":"'24'!C17","v":0},{"$f":"'24'!D17","v":0},{"$f":"'24'!E17","v":0},{"$f":"'24'!F17","v":0},{"$f":"'24'!G17","v":0},0]
[24,{"$f":"'24'!A18","v":0},{"$f":"'24'!B18","v":0},{"$f":"'24'!C18","v":0},{"$f":"'24'!D18","v":0},{"$f":"'24'!E18","v":0},{"$f":"'24'!F18","v":0},{"$f":"'24'!G18","v":0},0]
[24,{"$f":"'24'!A19","v":0},{"$f":"'24'!B19","v":0},{"$f":"'24'!C19","v":0},{"$f":"'24'!D19","v":0},{"$f":"'24'!E19","v":0},{"$f":"'24'!F19","v":0},{"$f":"'24'!G19","v":0},0]
[24,{"$f":"'24'!A20","v":0},{"$f":"'24'!B20","v":0},{"$f":"'24'!C20","v":0},{"$f":"'24'!D20","v":0},{"$f":"'24'!E20","v":0},{"$f":"'24'!F20","v":0},{"$f":"'24'!G20","v":0},0]
[24,{"$f":"'24'!A21","v":0},{"$f":"'24'!B21","v":0},{"$f":"'24'!C21","v":0},{"$f":"'24'!D21","v":0},{"$f":"'24'!E21","v":0},{"$f":"'24'!F21","v":0},{"$f":"'24'!G21","v":0},0]
[24,{"$f":"'24'!A22","v":0},{"$f":"'24'!B22","v":0},{"$f":"'24'!C22","v":0},{"$f":"'24'!D22","v":0},{"$f":"'24'!E22","v":0},{"$f":"'24'!F22","v":0},{"$f":"'24'!G22","v":0},0]
[25,{"$f":"'25'!A11","v":0},{"$f":"'25'!B11","v":0},{"$f":"'25'!C11","v":0},{"$f":"'25'!D11","v":0},{"$f":"'25'!E11","v":0},{"$f":"'25'!F11","v":0},{"$f":"'25'!G11","v":0},0]
[{"$f":"A291","v":25},{"$f":"'25'!A12","v":0},{"$f":"'25'!B12","v":0},{"$f":"'25'!C12","v":0},{"$f":"'25'!D12","v":0},{"$f":"'25'!E12","v":0},{"$f":"'25'!F12","v":0},{"$f":"'25'!G12","v":0},0]
[{"$f":"A292","v":25},{"$f":"'25'!A13","v":0},{"$f":"'25'!B13","v":0},{"$f":"'25'!C13","v":0},{"$f":"'25'!D13","v":0},{"$f":"'25'!E13","v":0},{"$f":"'25'!F13","v":0},{"$f":"'25'!G13","v":0},{"$f":"D293+H293+F293","v":0}]
[25,{"$f":"'25'!A14","v":0},{"$f":"'25'!B14","v":0},{"$f":"'25'!C14","v":0},{"$f":"'25'!D14","v":0},{"$f":"'25'!E14","v":0},{"$f":"'25'!F14","v":0},{"$f":"'25'!G14","v":0},0]
[25,{"$f":"'25'!A15","v":0},{"$f":"'25'!B15","v":0},{"$f":"'25'!C15","v":0},{"$f":"'25'!D15","v":0},{"$f":"'25'!E15","v":0},{"$f":"'25'!F15","v":0},{"$f":"'25'!G15","v":0},0]
[25,{"$f":"'25'!A16","v":0},{"$f":"'25'!B16","v":0},{"$f":"'25'!C16","v":0},{"$f":"'25'!D16","v":0},{"$f":"'25'!E16","v":0},{"$f":"'25'!F16","v":0},{"$f":"'25'!G16","v":0},0]
[25,{"$f":"'25'!A17","v":0},{"$f":"'25'!B17","v":0},{"$f":"'25'!C17","v":0},{"$f":"'25'!D17","v":0},{"$f":"'25'!E17","v":0},{"$f":"'25'!F17","v":0},{"$f":"'25'!G17","v":0},0]
[25,{"$f":"'25'!A18","v":0},{"$f":"'25'!B18","v":0},{"$f":"'25'!C18","v":0},{"$f":"'25'!D18","v":0},{"$f":"'25'!E18","v":0},{"$f":"'25'!F18","v":0},{"$f":"'25'!G18","v":0},0]
[25,{"$f":"'25'!A19","v":0},{"$f":"'25'!B19","v":0},{"$f":"'25'!C19","v":0},{"$f":"'25'!D19","v":0},{"$f":"'25'!E19","v":0},{"$f":"'25'!F19","v":0},{"$f":"'25'!G19","v":0},0]
[25,{"$f":"'25'!A20","v":0},{"$f":"'25'!B20","v":0},{"$f":"'25'!C20","v":0},{"$f":"'25'!D20","v":0},{"$f":"'25'!E20","v":0},{"$f":"'25'!F20","v":0},{"$f":"'25'!G20","v":0},0]
[25,{"$f":"'25'!A21","v":0},{"$f":"'25'!B21","v":0},{"$f":"'25'!C21","v":0},{"$f":"'25'!D21","v":0},{"$f":"'25'!E21","v":0},{"$f":"'25'!F21","v":0},{"$f":"'25'!G21","v":0},0]
[25,{"$f":"'25'!A22","v":0},{"$f":"'25'!B22","v":0},{"$f":"'25'!C22","v":0},{"$f":"'25'!D22","v":0},{"$f":"'25'!E22","v":0},{"$f":"'25'!F22","v":0},{"$f":"'25'!G22","v":0},{"$f":"D302+H302+F302","v":0}]
[26,{"$f":"'26'!A11","v":0},{"$f":"'26'!B11","v":0},{"$f":"'26'!C11","v":0},{"$f":"'26'!D11","v":0},{"$f":"'26'!E11","v":0},{"$f":"'26'!F11","v":0},{"$f":"'26'!G11","v":0},0]
[{"$f":"A303","v":26},{"$f":"'26'!A12","v":0},{"$f":"'26'!B12","v":0},{"$f":"'26'!C12","v":0},{"$f":"'26'!D12","v":0},{"$f":"'26'!E12","v":0},{"$f":"'26'!F12","v":0},{"$f":"'26'!G12","v":0},{"$f":"D304+H304+F304","v":0}]
[{"$f":"A304","v":26},{"$f":"'26'!A13","v":0},{"$f":"'26'!B13","v":0},{"$f":"'26'!C13","v":0},{"$f":"'26'!D13","v":0},{"$f":"'26'!E13","v":0},{"$f":"'26'!F13","v":0},{"$f":"'26'!G13","v":0},{"$f":"D305+H305+F305","v":0}]
[26,{"$f":"'26'!A14","v":0},{"$f":"'26'!B14","v":0},{"$f":"'26'!C14","v":0},{"$f":"'26'!D14","v":0},{"$f":"'26'!E14","v":0},{"$f":"'26'!F14","v":0},{"$f":"'26'!G14","v":0},0]
[26,{"$f":"'26'!A15","v":0},{"$f":"'26'!B15","v":0},{"$f":"'26'!C15","v":0},{"$f":"'26'!D15","v":0},{"$f":"'26'!E15","v":0},{"$f":"'26'!F15","v":0},{"$f":"'26'!G15","v":0},0]
[26,{"$f":"'26'!A16","v":0},{"$f":"'26'!B16","v":0},{"$f":"'26'!C16","v":0},{"$f":"'26'!D16","v":0},{"$f":"'26'!E16","v":0},{"$f":"'26'!F16","v":0},{"$f":"'26'!G16","v":0},{"$f":"D308+H308+F308","v":0}]
[26,{"$f":"'26'!A17","v":0},{"$f":"'26'!B17","v":0},{"$f":"'26'!C17","v":0},{"$f":"'26'!D17","v":0},{"$f":"'26'!E17","v":0},{"$f":"'26'!F17","v":0},{"$f":"'26'!G17","v":0},0]
[26,{"$f":"'26'!A18","v":0},{"$f":"'26'!B18","v":0},{"$f":"'26'!C18","v":0},{"$f":"'26'!D18","v":0},{"$f":"'26'!E18","v":0},{"$f":"'26'!F18","v":0},{"$f":"'26'!G18","v":0},0]
[26,{"$f":"'26'!A19","v":0},{"$f":"'26'!B19","v":0},{"$f":"'26'!C19","v":0},{"$f":"'26'!D19","v":0},{"$f":"'26'!E19","v":0},{"$f":"'26'!F19","v":0},{"$f":"'26'!G19","v":0},0]
[26,{"$f":"'26'!A20","v":0},{"$f":"'26'!B20","v":0},{"$f":"'26'!C20","v":0},{"$f":"'26'!D20","v":0},{"$f":"'26'!E20","v":0},{"$f":"'26'!F20","v":0},{"$f":"'26'!G20","v":0},0]
[26,{"$f":"'26'!A21","v":0},{"$f":"'26'!B21","v":0},{"$f":"'26'!C21","v":0},{"$f":"'26'!D21","v":0},{"$f":"'26'!E21","v":0},{"$f":"'26'!F21","v":0},{"$f":"'26'!G21","v":0},0]
[26,{"$f":"'26'!A22","v":0},{"$f":"'26'!B22","v":0},{"$f":"'26'!C22","v":0},{"$f":"'26'!D22","v":0},{"$f":"'26'!E22","v":0},{"$f":"'26'!F22","v":0},{"$f":"'26'!G22","v":0},0]
[27,{"$f":"'27'!A11","v":0},{"$f":"'27'!B11","v":0},{"$f":"'27'!C11","v":0},{"$f":"'27'!D11","v":0},{"$f":"'27'!E11","v":0},{"$f":"'27'!F11","v":0},{"$f":"'27'!G11","v":0},0]
[{"$f":"A315","v":27},{"$f":"'27'!A12","v":0},{"$f":"'27'!B12","v":0},{"$f":"'27'!C12","v":0},{"$f":"'27'!D12","v":0},{"$f":"'27'!E12","v":0},{"$f":"'27'!F12","v":0},{"$f":"'27'!G12","v":0},0]
[{"$f":"A316","v":27},{"$f":"'27'!A13","v":0},{"$f":"'27'!B13","v":0},{"$f":"'27'!C13","v":0},{"$f":"'27'!D13","v":0},{"$f":"'27'!E13","v":0},{"$f":"'27'!F13","v":0},{"$f":"'27'!G13","v":0},0]
[27,{"$f":"'27'!A14","v":0},{"$f":"'27'!B14","v":0},{"$f":"'27'!C14","v":0},{"$f":"'27'!D14","v":0},{"$f":"'27'!E14","v":0},{"$f":"'27'!F14","v":0},{"$f":"'27'!G14","v":0},0]
[27,{"$f":"'27'!A15","v":0},{"$f":"'27'!B15","v":0},{"$f":"'27'!C15","v":0},{"$f":"'27'!D15","v":0},{"$f":"'27'!E15","v":0},{"$f":"'27'!F15","v":0},{"$f":"'27'!G15","v":0},0]
[27,{"$f":"'27'!A16","v":0},{"$f":"'27'!B16","v":0},{"$f":"'27'!C16","v":0},{"$f":"'27'!D16","v":0},{"$f":"'27'!E16","v":0},{"$f":"'27'!F16","v":0},{"$f":"'27'!G16","v":0},0]
[27,{"$f":"'27'!A17","v":0},{"$f":"'27'!B17","v":0},{"$f":"'27'!C17","v":0},{"$f":"'27'!D17","v":0},{"$f":"'27'!E17","v":0},{"$f":"'27'!F17","v":0},{"$f":"'27'!G17","v":0},0]
[27,{"$f":"'27'!A18","v":0},{"$f":"'27'!B18","v":0},{"$f":"'27'!C18","v":0},{"$f":"'27'!D18","v":0},{"$f":"'27'!E18","v":0},{"$f":"'27'!F18","v":0},{"$f":"'27'!G18","v":0},0]
[27,{"$f":"'27'!A19","v":0},{"$f":"'27'!B19","v":0},{"$f":"'27'!C19","v":0},{"$f":"'27'!D19","v":0},{"$f":"'27'!E19","v":0},{"$f":"'27'!F19","v":0},{"$f":"'27'!G19","v":0},0]
[27,{"$f":"'27'!A20","v":0},{"$f":"'27'!B20","v":0},{"$f":"'27'!C20","v":0},{"$f":"'27'!D20","v":0},{"$f":"'27'!E20","v":0},{"$f":"'27'!F20","v":0},{"$f":"'27'!G20","v":0},0]
[27,{"$f":"'27'!A21","v":0},{"$f":"'27'!B21","v":0},{"$f":"'27'!C21","v":0},{"$f":"'27'!D21","v":0},{"$f":"'27'!E21","v":0},{"$f":"'27'!F21","v":0},{"$f":"'27'!G21","v":0},0]
[27,{"$f":"'27'!A22","v":0},{"$f":"'27'!B22","v":0},{"$f":"'27'!C22","v":0},{"$f":"'27'!D22","v":0},{"$f":"'27'!E22","v":0},{"$f":"'27'!F22","v":0},{"$f":"'27'!G22","v":0},0]
[28,{"$f":"'28'!A11","v":0},{"$f":"'28'!B11","v":0},{"$f":"'28'!C11","v":0},{"$f":"'28'!D11","v":0},{"$f":"'28'!E11","v":0},{"$f":"'28'!F11","v":0},{"$f":"'28'!G11","v":0},0]
[{"$f":"A327","v":28},{"$f":"'28'!A12","v":0},{"$f":"'28'!B12","v":0},{"$f":"'28'!C12","v":0},{"$f":"'28'!D12","v":0},{"$f":"'28'!E12","v":0},{"$f":"'28'!F12","v":0},{"$f":"'28'!G12","v":0},0]
[{"$f":"A328","v":28},{"$f":"'28'!A13","v":0},{"$f":"'28'!B13","v":0},{"$f":"'28'!C13","v":0},{"$f":"'28'!D13","v":0},{"$f":"'28'!E13","v":0},{"$f":"'28'!F13","v":0},{"$f":"'28'!G13","v":0},0]
[28,{"$f":"'28'!A14","v":0},{"$f":"'28'!B14","v":0},{"$f":"'28'!C14","v":0},{"$f":"'28'!D14","v":0},{"$f":"'28'!E14","v":0},{"$f":"'28'!F14","v":0},{"$f":"'28'!G14","v":0},0]
[28,{"$f":"'28'!A15","v":0},{"$f":"'28'!B15","v":0},{"$f":"'28'!C15","v":0},{"$f":"'28'!D15","v":0},{"$f":"'28'!E15","v":0},{"$f":"'28'!F15","v":0},{"$f":"'28'!G15","v":0},0]
[28,{"$f":"'28'!A16","v":0},{"$f":"'28'!B16","v":0},{"$f":"'28'!C16","v":0},{"$f":"'28'!D16","v":0},{"$f":"'28'!E16","v":0},{"$f":"'28'!F16","v":0},{"$f":"'28'!G16","v":0},0]
[28,{"$f":"'28'!A17","v":0},{"$f":"'28'!B17","v":0},{"$f":"'28'!C17","v":0},{"$f":"'28'!D17","v":0},{"$f":"'28'!E17","v":0},{"$f":"'28'!F17","v":0},{"$f":"'28'!G17","v":0},0]
[28,{"$f":"'28'!A18","v":0},{"$f":"'28'!B18","v":0},{"$f":"'28'!C18","v":0},{"$f":"'28'!D18","v":0},{"$f":"'28'!E18","v":0},{"$f":"'28'!F18","v":0},{"$f":"'28'!G18","v":0},0]
[28,{"$f":"'28'!A19","v":0},{"$f":"'28'!B19","v":0},{"$f":"'28'!C19","v":0},{"$f":"'28'!D19","v":0},{"$f":"'28'!E19","v":0},{"$f":"'28'!F19","v":0},{"$f":"'28'!G19","v":0},0]
[28,{"$f":"'28'!A20","v":0},{"$f":"'28'!B20","v":0},{"$f":"'28'!C20","v":0},{"$f":"'28'!D20","v":0},{"$f":"'28'!E20","v":0},{"$f":"'28'!F20","v":0},{"$f":"'28'!G20","v":0},0]
[28,{"$f":"'28'!A21","v":0},{"$f":"'28'!B21","v":0},{"$f":"'28'!C21","v":0},{"$f":"'28'!D21","v":0},{"$f":"'28'!E21","v":0},{"$f":"'28'!F21","v":0},{"$f":"'28'!G21","v":0},0]
[28,{"$f":"'28'!A22","v":0},{"$f":"'28'!B22","v":0},{"$f":"'28'!C22","v":0},{"$f":"'28'!D22","v":0},{"$f":"'28'!E22","v":0},{"$f":"'28'!F22","v":0},{"$f":"'28'!G22","v":0},0]
[29,{"$f":"'29'!A11","v":0},{"$f":"'29'!B11","v":0},{"$f":"'29'!C11","v":0},{"$f":"'29'!D11","v":0},{"$f":"'29'!E11","v":0},{"$f":"'29'!F11","v":0},{"$f":"'29'!G11","v":0},0]
[{"$f":"A339","v":29},{"$f":"'29'!A12","v":0},{"$f":"'29'!B12","v":0},{"$f":"'29'!C12","v":0},{"$f":"'29'!D12","v":0},{"$f":"'29'!E12","v":0},{"$f":"'29'!F12","v":0},{"$f":"'29'!G12","v":0},0]
[{"$f":"A340","v":29},{"$f":"'29'!A13","v":0},{"$f":"'29'!B13","v":0},{"$f":"'29'!C13","v":0},{"$f":"'29'!D13","v":0},{"$f":"'29'!E13","v":0},{"$f":"'29'!F13","v":0},{"$f":"'29'!G13","v":0},0]
[29,{"$f":"'29'!A14","v":0},{"$f":"'29'!B14","v":0},{"$f":"'29'!C14","v":0},{"$f":"'29'!D14","v":0},{"$f":"'29'!E14","v":0},{"$f":"'29'!F14","v":0},{"$f":"'29'!G14","v":0},0]
[29,{"$f":"'29'!A15","v":0},{"$f":"'29'!B15","v":0},{"$f":"'29'!C15","v":0},{"$f":"'29'!D15","v":0},{"$f":"'29'!E15","v":0},{"$f":"'29'!F15","v":0},{"$f":"'29'!G15","v":0},0]
[29,{"$f":"'29'!A16","v":0},{"$f":"'29'!B16","v":0},{"$f":"'29'!C16","v":0},{"$f":"'29'!D16","v":0},{"$f":"'29'!E16","v":0},{"$f":"'29'!F16","v":0},{"$f":"'29'!G16","v":0},0]
[29,{"$f":"'29'!A17","v":0},{"$f":"'29'!B17","v":0},{"$f":"'29'!C17","v":0},{"$f":"'29'!D17","v":0},{"$f":"'29'!E17","v":0},{"$f":"'29'!F17","v":0},{"$f":"'29'!G17","v":0},0]
[29,{"$f":"'29'!A18","v":0},{"$f":"'29'!B18","v":0},{"$f":"'29'!C18","v":0},{"$f":"'29'!D18","v":0},{"$f":"'29'!E18","v":0},{"$f":"'29'!F18","v":0},{"$f":"'29'!G18","v":0},0]
[29,{"$f":"'29'!A19","v":0},{"$f":"'29'!B19","v":0},{"$f":"'29'!C19","v":0},{"$f":"'29'!D19","v":0},{"$f":"'29'!E19","v":0},{"$f":"'29'!F19","v":0},{"$f":"'29'!G19","v":0},0]
[29,{"$f":"'29'!A20","v":0},{"$f":"'29'!B20","v":0},{"$f":"'29'!C20","v":0},{"$f":"'29'!D20","v":0},{"$f":"'29'!E20","v":0},{"$f":"'29'!F20","v":0},{"$f":"'29'!G20","v":0},0]
[29,{"$f":"'29'!A21","v":0},{"$f":"'29'!B21","v":0},{"$f":"'29'!C21","v":0},{"$f":"'29'!D21","v":0},{"$f":"'29'!E21","v":0},{"$f":"'29'!F21","v":0},{"$f":"'29'!G21","v":0},0]
[29,{"$f":"'29'!A22","v":0},{"$f":"'29'!B22","v":0},{"$f":"'29'!C22","v":0},{"$f":"'29'!D22","v":0},{"$f":"'29'!E22","v":0},{"$f":"'29'!F22","v":0},{"$f":"'29'!G22","v":0},0]
[30,{"$f":"'30'!A11","v":0},{"$f":"'30'!B11","v":0},{"$f":"'30'!C11","v":0},{"$f":"'30'!D11","v":0},{"$f":"'30'!E11","v":0},{"$f":"'30'!F11","v":0},{"$f":"'30'!G11","v":0},0]
[{"$f":"A351","v":30},{"$f":"'30'!A12","v":0},{"$f":"'30'!B12","v":0},{"$f":"'30'!C12","v":0},{"$f":"'30'!D12","v":0},{"$f":"'30'!E12","v":0},{"$f":"'30'!F12","v":0},{"$f":"'30'!G12","v":0},0]
[{"$f":"A352","v":30},{"$f":"'30'!A13","v":0},{"$f":"'30'!B13","v":0},{"$f":"'30'!C13","v":0},{"$f":"'30'!D13","v":0},{"$f":"'30'!E13","v":0},{"$f":"'30'!F13","v":0},{"$f":"'30'!G13","v":0},0]
[30,{"$f":"'30'!A14","v":0},{"$f":"'30'!B14","v":0},{"$f":"'30'!C14","v":0},{"$f":"'30'!D14","v":0},{"$f":"'30'!E14","v":0},{"$f":"'30'!F14","v":0},{"$f":"'30'!G14","v":0},0]
[30,{"$f":"'30'!A15","v":0},{"$f":"'30'!B15","v":0},{"$f":"'30'!C15","v":0},{"$f":"'30'!D15","v":0},{"$f":"'30'!E15","v":0},{"$f":"'30'!F15","v":0},{"$f":"'30'!G15","v":0},0]
[30,{"$f":"'30'!A16","v":0},{"$f":"'30'!B16","v":0},{"$f":"'30'!C16","v":0},{"$f":"'30'!D16","v":0},{"$f":"'30'!E16","v":0},{"$f":"'30'!F16","v":0},{"$f":"'30'!G16","v":0},{"$f":"D356+H356+F356","v":0}]
[30,{"$f":"'30'!A17","v":0},{"$f":"'30'!B17","v":0},{"$f":"'30'!C17","v":0},{"$f":"'30'!D17","v":0},{"$f":"'30'!E17","v":0},{"$f":"'30'!F17","v":0},{"$f":"'30'!G17","v":0},0]
[30,{"$f":"'30'!A18","v":0},{"$f":"'30'!B18","v":0},{"$f":"'30'!C18","v":0},{"$f":"'30'!D18","v":0},{"$f":"'30'!E18","v":0},{"$f":"'30'!F18","v":0},{"$f":"'30'!G18","v":0},0]
[30,{"$f":"'30'!A19","v":0},{"$f":"'30'!B19","v":0},{"$f":"'30'!C19","v":0},{"$f":"'30'!D19","v":0},{"$f":"'30'!E19","v":0},{"$f":"'30'!F19","v":0},{"$f":"'30'!G19","v":0},0]
[30,{"$f":"'30'!A20","v":0},{"$f":"'30'!B20","v":0},{"$f":"'30'!C20","v":0},{"$f":"'30'!D20","v":0},{"$f":"'30'!E20","v":0},{"$f":"'30'!F20","v":0},{"$f":"'30'!G20","v":0},0]
[30,{"$f":"'30'!A21","v":0},{"$f":"'30'!B21","v":0},{"$f":"'30'!C21","v":0},{"$f":"'30'!D21","v":0},{"$f":"'30'!E21","v":0},{"$f":"'30'!F21","v":0},{"$f":"'30'!G21","v":0},0]
[30,{"$f":"'30'!A22","v":0},{"$f":"'30'!B22","v":0},{"$f":"'30'!C22","v":0},{"$f":"'30'!D22","v":0},{"$f":"'30'!E22","v":0},{"$f":"'30'!F22","v":0},{"$f":"'30'!G22","v":0},0]
[31,{"$f":"'31'!A11","v":0},{"$f":"'31'!B11","v":0},{"$f":"'31'!C11","v":0},{"$f":"'31'!D11","v":0},{"$f":"'31'!E11","v":0},{"$f":"'31'!F11","v":0},{"$f":"'31'!G11","v":0},0]
[{"$f":"A363","v":31},{"$f":"'31'!A12","v":0},{"$f":"'31'!B12","v":0},{"$f":"'31'!C12","v":0},{"$f":"'31'!D12","v":0},{"$f":"'31'!E12","v":0},{"$f":"'31'!F12","v":0},{"$f":"'31'!G12","v":0},0]
[{"$f":"A364","v":31},{"$f":"'31'!A13","v":0},{"$f":"'31'!B13","v":0},{"$f":"'31'!C13","v":0},{"$f":"'31'!D13","v":0},{"$f":"'31'!E13","v":0},{"$f":"'31'!F13","v":0},{"$f":"'31'!G13","v":0},0]
[31,{"$f":"'31'!A14","v":0},{"$f":"'31'!B14","v":0},{"$f":"'31'!C14","v":0},{"$f":"'31'!D14","v":0},{"$f":"'31'!E14","v":0},{"$f":"'31'!F14","v":0},{"$f":"'31'!G14","v":0},0]
[31,{"$f":"'31'!A15","v":0},{"$f":"'31'!B15","v":0},{"$f":"'31'!C15","v":0},{"$f":"'31'!D15","v":0},{"$f":"'31'!E15","v":0},{"$f":"'31'!F15","v":0},{"$f":"'31'!G15","v":0},0]
[31,{"$f":"'31'!A16","v":0},{"$f":"'31'!B16","v":0},{"$f":"'31'!C16","v":0},{"$f":"'31'!D16","v":0},{"$f":"'31'!E16","v":0},{"$f":"'31'!F16","v":0},{"$f":"'31'!G16","v":0},0]
[31,{"$f":"'31'!A17","v":0},{"$f":"'31'!B17","v":0},{"$f":"'31'!C17","v":0},{"$f":"'31'!D17","v":0},{"$f":"'31'!E17","v":0},{"$f":"'31'!F17","v":0},{"$f":"'31'!G17","v":0},0]
[31,{"$f":"'31'!A18","v":0},{"$f":"'31'!B18","v":0},{"$f":"'31'!C18","v":0},{"$f":"'31'!D18","v":0},{"$f":"'31'!E18","v":0},{"$f":"'31'!F18","v":0},{"$f":"'31'!G18","v":0},{"$f":"D370+H370+F370","v":0}]
[31,{"$f":"'31'!A19","v":0},{"$f":"'31'!B19","v":0},{"$f":"'31'!C19","v":0},{"$f":"'31'!D19","v":0},{"$f":"'31'!E19","v":0},{"$f":"'31'!F19","v":0},{"$f":"'31'!G19","v":0},{"$f":"D371+H371+F371","v":0}]
[{"$f":"A369","v":31},{"$f":"'31'!A20","v":0},{"$f":"'31'!B20","v":0},{"$f":"'31'!C20","v":0},{"$f":"'31'!D20","v":0},{"$f":"'31'!E20","v":0},{"$f":"'31'!F20","v":0},{"$f":"'31'!G20","v":0},0]
[31,{"$f":"'31'!A21","v":0},{"$f":"'31'!B21","v":0},{"$f":"'31'!C21","v":0},{"$f":"'31'!D21","v":0},{"$f":"'31'!E21","v":0},{"$f":"'31'!F21","v":0},{"$f":"'31'!G21","v":0},0]
[31,{"$f":"'31'!A22","v":0},{"$f":"'31'!B22","v":0},{"$f":"'31'!C22","v":0},{"$f":"'31'!D22","v":0},{"$f":"'31'!E22","v":0},{"$f":"'31'!F22","v":0},{"$f":"'31'!G22","v":0},0]
[]
[null,null,null,{"$f":"SUM(D3:D375)","v":177}]

{"sheet":"RECAP MOIS MATERIEL","index":34,"n_rows":275,"n_cols":13,"rows_kept":275,"cut":false,"hidden":false,"merged":[[145,12,153,12],[136,12,144,12],[127,12,135,12],[118,12,126,12],[109,12,117,12],[100,12,108,12],[1,12,9,12],[10,12,18,12],[19,12,27,12],[28,12,36,12],[37,12,45,12],[91,12,99,12],[82,12,90,12],[73,12,81,12],[64,12,72,12],[55,12,63,12],[46,12,54,12],[154,12,162,12],[253,12,261,12],[262,12,270,12],[244,12,252,12],[235,12,243,12],[226,12,234,12],[208,12,216,12],[217,12,225,12],[199,12,207,12],[172,12,180,12],[163,12,171,12],[181,12,189,12],[190,12,198,12]]}
["DATE","N° IMMAT","AFFECTATION","H","AFFECTATION","H","AFFECTATION","H","H/kms TOTAL","GNR","H MATIN","H SOIR","TOTAL GNR/jour"]
[1,{"$f":"'1'!A28","v":"Chargeur L566 - D3101014"},{"$f":"'1'!B28","v":"CHARGEMENT CLIENT /200200"},{"$f":"'1'!C28","v":5},{"$f":"'1'!D28","v":0},{"$f":"'1'!E28","v":0},{"$f":"'1'!F28","v":0},{"$f":"'1'!G28","v":0},{"$f":"'1'!H28","v":5},{"$f":"'1'!I28","v":0},{"$f":"'1'!J28","v":"16743"},{"$f":"'1'!K28","v":"16748"},{"$f":"SUM(J2:J10)","v":193}]
[{"$f":"A2","v":1},{"$f":"'1'!A29","v":"Chargeur 966G - D3102742"},{"$f":"'1'!B29","v":"DESTOCKAGE/200308"},{"$f":"'1'!C29","v":7},{"$f":"'1'!D29","v":0},{"$f":"'1'!E29","v":0},{"$f":"'1'!F29","v":0},{"$f":"'1'!G29","v":0},{"$f":"'1'!H29","v":7},{"$f":"'1'!I29","v":193},{"$f":"'1'!J29","v":"2386"},{"$f":"'1'!K29","v":"2393"}]
[{"$f":"A3","v":1},{"$f":"'1'!A30","v":"CAMION MERCEDES OSSELLE-P2100552"},{"$f":"'1'!B30","v":0},{"$f":"'1'!C30","v":0},{"$f":"'1'!D30","v":0},{"$f":"'1'!E30","v":0},{"$f":"'1'!F30","v":0},{"$f":"'1'!G30","v":0},{"$f":"'1'!H30","v":0},{"$f":"'1'!I30","v":0},{"$f":"'1'!J30","v":0},{"$f":"'1'!K30","v":0}]
[1,{"$f":"'1'!A31","v":0},{"$f":"'1'!B31","v":0},{"$f":"'1'!C31","v":0},{"$f":"'1'!D31","v":0},{"$f":"'1'!E31","v":0},{"$f":"'1'!F31","v":0},{"$f":"'1'!G31","v":0},{"$f":"'1'!H31","v":0},{"$f":"'1'!I31","v":0},{"$f":"'1'!J31","v":0},{"$f":"'1'!K31","v":0}]
[1,{"$f":"'1'!A32","v":0},{"$f":"'1'!B32","v":0},{"$f":"'1'!C32","v":0},{"$f":"'1'!D32","v":0},{"$f":"'1'!E32","v":0},{"$f":"'1'!F32","v":0},{"$f":"'1'!G32","v":0},{"$f":"'1'!H32","v":0},{"$f":"'1'!I32","v":0},{"$f":"'1'!J32","v":0},{"$f":"'1'!K32","v":0}]
[1,{"$f":"'1'!A33","v":0},{"$f":"'1'!B33","v":0},{"$f":"'1'!C33","v":0},{"$f":"'1'!D33","v":0},{"$f":"'1'!E33","v":0},{"$f":"'1'!F33","v":0},{"$f":"'1'!G33","v":0},{"$f":"'1'!H33","v":0},{"$f":"'1'!I33","v":0},{"$f":"'1'!J33","v":0},{"$f":"'1'!K33","v":0}]
[1,{"$f":"'1'!A36","v":"Minipelle SV17 - oss - D1002929"},null,null,null,null,null,null,{"$f":"'1'!E36","v":0},{"$f":"'1'!D36","v":0},{"$f":"'1'!B36","v":"2291"},{"$f":"'1'!C36","v":"2291"}]
[1,{"$f":"'1'!A37","v":"Manitou M30 - C8100689"},null,null,null,null,null,null,{"$f":"'1'!E37","v":0},{"$f":"'1'!D37","v":0},{"$f":"'1'!B37","v":"7139"},{"$f":"'1'!C37","v":"7139"}]
[1,{"$f":"'1'!A38","v":0},null,null,null,null,null,null,{"$f":"'1'!E38","v":0},{"$f":"'1'!D38","v":0},{"$f":"'1'!B38","v":0},{"$f":"'1'!C38","v":0}]
[2,{"$f":"'2'!A28","v":"Chargeur L566 - D3101014"},{"$f":"'2'!B28","v":0},{"$f":"'2'!C28","v":0},{"$f":"'2'!D28","v":0},{"$f":"'2'!E28","v":0},{"$f":"'2'!F28","v":0},{"$f":"'2'!G28","v":0},{"$f":"'2'!H28","v":0},{"$f":"'2'!I28","v":0},{"$f":"'2'!J28","v":"16748"},{"$f":"'2'!K28","v":"16748"},{"$f":"SUM(J11:J19)","v":0}]
[{"$f":"A11","v":2},{"$f":"'2'!A29","v":"Chargeur 966G - D3102742"},{"$f":"'2'!B29","v":"CHARGEMENT CLIENT /200200"},{"$f":"'2'!C29","v":3},{"$f":"'2'!D29","v":0},{"$f":"'2'!E29","v":0},{"$f":"'2'!F29","v":0},{"$f":"'2'!G29","v":0},{"$f":"'2'!H29","v":3},{"$f":"'2'!I29","v":0},{"$f":"'2'!J29","v":"2393"},{"$f":"'2'!K29","v":"2396"}]
[{"$f":"A12","v":2},{"$f":"'2'!A30","v":"CAMION MERCEDES OSSELLE-P2100552"},{"$f":"'2'!B30","v":0},{"$f":"'2'!C30","v":0},{"$f":"'2'!D30","v":0},{"$f":"'2'!E30","v":0},{"$f":"'2'!F30","v":0},{"$f":"'2'!G30","v":0},{"$f":"'2'!H30","v":0},{"$f":"'2'!I30","v":0},{"$f":"'2'!J30","v":0},{"$f":"'2'!K30","v":0}]
[2,{"$f":"'2'!A31","v":0},{"$f":"'2'!B31","v":0},{"$f":"'2'!C31","v":0},{"$f":"'2'!D31","v":0},{"$f":"'2'!E31","v":0},{"$f":"'2'!F31","v":0},{"$f":"'2'!G31","v":0},{"$f":"'2'!H31","v":0},{"$f":"'2'!I31","v":0},{"$f":"'2'!J31","v":0},{"$f":"'2'!K31","v":0}]
[2,{"$f":"'2'!A32","v":0},{"$f":"'2'!B32","v":0},{"$f":"'2'!C32","v":0},{"$f":"'2'!D32","v":0},{"$f":"'2'!E32","v":0},{"$f":"'2'!F32","v":0},{"$f":"'2'!G32","v":0},{"$f":"'2'!H32","v":0},{"$f":"'2'!I32","v":0},{"$f":"'2'!J32","v":0},{"$f":"'2'!K32","v":0}]
[2,{"$f":"'2'!A33","v":0},{"$f":"'2'!B33","v":0},{"$f":"'2'!C33","v":0},{"$f":"'2'!D33","v":0},{"$f":"'2'!E33","v":0},{"$f":"'2'!F33","v":0},{"$f":"'2'!G33","v":0},{"$f":"'2'!H33","v":0},{"$f":"'2'!I33","v":0},{"$f":"'2'!J33","v":0},{"$f":"'2'!K33","v":0}]
[2,{"$f":"'2'!A36","v":"Minipelle SV17 - oss - D1002929"},null,null,null,null,{"$f":"'2'!F36","v":0},{"$f":"'2'!G36","v":0},{"$f":"'2'!E36","v":0},{"$f":"'2'!D36","v":0},{"$f":"'2'!B36","v":"2291"},{"$f":"'2'!C36","v":"2291"}]
[2,{"$f":"'2'!A37","v":"Manitou M30 - C8100689"},null,null,null,null,null,null,{"$f":"'2'!E37","v":0},{"$f":"'2'!D37","v":0},{"$f":"'2'!B37","v":"7139"},{"$f":"'2'!C37","v":"7139"}]
[2,{"$f":"'2'!A38","v":0},null,null,null,null,null,null,{"$f":"'2'!E38","v":0},{"$f":"'2'!D38","v":0},{"$f":"'2'!B38","v":0},{"$f":"'2'!C38","v":0}]
[3,{"$f":"'3'!A28","v":"Chargeur L566 - D3101014"},{"$f":"'3'!B28","v":0},{"$f":"'3'!C28","v":0},{"$f":"'3'!D28","v":0},{"$f":"'3'!E28","v":0},{"$f":"'3'!F28","v":0},{"$f":"'3'!G28","v":0},{"$f":"'3'!H28","v":0},{"$f":"'3'!I28","v":0},{"$f":"'3'!J28","v":"16748"},{"$f":"'3'!K28","v":"16748"},{"$f":"SUM(J20:J28)","v":0}]
[3,{"$f":"'3'!A29","v":"Chargeur 966G - D3102742"},{"$f":"'3'!B29","v":"CHARGEMENT CLIENT /200200"},{"$f":"'3'!C29","v":3},{"$f":"'3'!D29","v":0},{"$f":"'3'!E29","v":0},{"$f":"'3'!F29","v":0},{"$f":"'3'!G29","v":0},{"$f":"'3'!H29","v":3},{"$f":"'3'!I29","v":0},{"$f":"'3'!J29","v":"2393"},{"$f":"'3'!K29","v":"2396"}]
[3,{"$f":"'3'!A30","v":"CAMION MERCEDES OSSELLE-P2100552"},{"$f":"'3'!B30","v":0},{"$f":"'3'!C30","v":0},{"$f":"'3'!D30","v":0},{"$f":"'3'!E30","v":0},{"$f":"'3'!F30","v":0},{"$f":"'3'!G30","v":0},{"$f":"'3'!H30","v":0},{"$f":"'3'!I30","v":0},{"$f":"'3'!J30","v":0},{"$f":"'3'!K30","v":0}]
[3,{"$f":"'3'!A31","v":0},{"$f":"'3'!B31","v":0},{"$f":"'3'!C31","v":0},{"$f":"'3'!D31","v":0},{"$f":"'3'!E31","v":0},{"$f":"'3'!F31","v":0},{"$f":"'3'!G31","v":0},{"$f":"'3'!H31","v":0},{"$f":"'3'!I31","v":0},{"$f":"'3'!J31","v":0},{"$f":"'3'!K31","v":0}]
[3,{"$f":"'3'!A32","v":0},{"$f":"'3'!B32","v":0},{"$f":"'3'!C32","v":0},{"$f":"'3'!D32","v":0},{"$f":"'3'!E32","v":0},{"$f":"'3'!F32","v":0},{"$f":"'3'!G32","v":0},{"$f":"'3'!H32","v":0},{"$f":"'3'!I32","v":0},{"$f":"'3'!J32","v":0},{"$f":"'3'!K32","v":0}]
[3,{"$f":"'3'!A33","v":0},{"$f":"'3'!B33","v":0},{"$f":"'3'!C33","v":0},{"$f":"'3'!D33","v":0},{"$f":"'3'!E33","v":0},{"$f":"'3'!F33","v":0},{"$f":"'3'!G33","v":0},{"$f":"'3'!H33","v":0},{"$f":"'3'!I33","v":0},{"$f":"'3'!J33","v":0},{"$f":"'3'!K33","v":0}]
[3,{"$f":"'3'!A36","v":"Minipelle SV17 - oss - D1002929"},null,null,null,null,{"$f":"'3'!F36","v":0},{"$f":"'3'!G36","v":0},{"$f":"'3'!E36","v":0},{"$f":"'3'!D36","v":0},{"$f":"'3'!B36","v":"2291"},{"$f":"'3'!C36","v":"2291"}]
[3,{"$f":"'3'!A37","v":"Manitou M30 - C8100689"},null,null,null,null,{"$f":"'3'!F37","v":0},{"$f":"'3'!G37","v":0},{"$f":"'3'!E37","v":0},{"$f":"'3'!D37","v":0},{"$f":"'3'!B37","v":"7139"},{"$f":"'3'!C37","v":"7139"}]
[3,{"$f":"'3'!A38","v":0},null,null,null,null,{"$f":"'3'!F38","v":0},{"$f":"'3'!G38","v":0},{"$f":"'3'!E38","v":0},{"$f":"'3'!D38","v":0},{"$f":"'3'!B38","v":0},{"$f":"'3'!C38","v":0}]
[4,{"$f":"'4'!A28","v":"Chargeur L566 - D3101014"},{"$f":"'4'!B28","v":0},{"$f":"'4'!C28","v":0},{"$f":"'4'!D28","v":0},{"$f":"'4'!E28","v":0},{"$f":"'4'!F28","v":0},{"$f":"'4'!G28","v":0},{"$f":"'4'!H28","v":0},{"$f":"'4'!I28","v":0},{"$f":"'4'!J28","v":"16748"},{"$f":"'4'!K28","v":"16748"},{"$f":"SUM(J29:J37)","v":0}]
[{"$f":"A29","v":4},{"$f":"'4'!A29","v":"Chargeur 966G - D3102742"},{"$f":"'4'!B29","v":"CHARGEMENT CLIENT /200200"},{"$f":"'4'!C29","v":3},{"$f":"'4'!D29","v":0},{"$f":"'4'!E29","v":0},{"$f":"'4'!F29","v":0},{"$f":"'4'!G29","v":0},{"$f":"'4'!H29","v":3},{"$f":"'4'!I29","v":0},{"$f":"'4'!J29","v":"2393"},{"$f":"'4'!K29","v":"2396"}]
[{"$f":"A30","v":4},{"$f":"'4'!A30","v":"CAMION MERCEDES OSSELLE-P2100552"},{"$f":"'4'!B30","v":0},{"$f":"'4'!C30","v":0},{"$f":"'4'!D30","v":0},{"$f":"'4'!E30","v":0},{"$f":"'4'!F30","v":0},{"$f":"'4'!G30","v":0},{"$f":"'4'!H30","v":0},{"$f":"'4'!I30","v":0},{"$f":"'4'!J30","v":0},{"$f":"'4'!K30","v":0}]
[4,{"$f":"'4'!A31","v":0},{"$f":"'4'!B31","v":0},{"$f":"'4'!C31","v":0},{"$f":"'4'!D31","v":0},{"$f":"'4'!E31","v":0},{"$f":"'4'!F31","v":0},{"$f":"'4'!G31","v":0},{"$f":"'4'!H31","v":0},{"$f":"'4'!I31","v":0},{"$f":"'4'!J31","v":0},{"$f":"'4'!K31","v":0}]
[4,{"$f":"'4'!A32","v":0},{"$f":"'4'!B32","v":0},{"$f":"'4'!C32","v":0},{"$f":"'4'!D32","v":0},{"$f":"'4'!E32","v":0},{"$f":"'4'!F32","v":0},{"$f":"'4'!G32","v":0},{"$f":"'4'!H32","v":0},{"$f":"'4'!I32","v":0},{"$f":"'4'!J32","v":0},{"$f":"'4'!K32","v":0}]
[4,{"$f":"'4'!A33","v":0},{"$f":"'4'!B33","v":0},{"$f":"'4'!C33","v":0},{"$f":"'4'!D33","v":0},{"$f":"'4'!E33","v":0},{"$f":"'4'!F33","v":0},{"$f":"'4'!G33","v":0},{"$f":"'4'!H33","v":0},{"$f":"'4'!I33","v":0},{"$f":"'4'!J33","v":0},{"$f":"'4'!K33","v":0}]
[4,{"$f":"'4'!A36","v":"Minipelle SV17 - oss - D1002929"},null,null,null,null,{"$f":"'4'!F36","v":0},{"$f":"'4'!G36","v":0},{"$f":"'4'!E36","v":0},{"$f":"'4'!D36","v":0},{"$f":"'4'!B36","v":"2291"},{"$f":"'4'!C36","v":"2291"}]
[4,{"$f":"'4'!A37","v":"Manitou M30 - C8100689"},null,null,null,null,{"$f":"'4'!F37","v":0},{"$f":"'4'!G37","v":0},{"$f":"'4'!E37","v":0},{"$f":"'4'!D37","v":0},{"$f":"'4'!B37","v":"7139"},{"$f":"'4'!C37","v":"7139"}]
[4,{"$f":"'4'!A38","v":0},null,null,null,null,{"$f":"'4'!F38","v":0},{"$f":"'4'!G38","v":0},{"$f":"'4'!E38","v":0},{"$f":"'4'!D38","v":0},{"$f":"'4'!B38","v":0},{"$f":"'4'!C38","v":0}]
[5,{"$f":"'5'!A28","v":"Chargeur L566 - D3101014"},{"$f":"'5'!B28","v":"CHARGEMENT CLIENT /200200"},{"$f":"'5'!C28","v":2},{"$f":"'5'!D28","v":0},{"$f":"'5'!E28","v":0},{"$f":"'5'!F28","v":0},{"$f":"'5'!G28","v":0},{"$f":"'5'!H28","v":2},{"$f":"'5'!I28","v":150},{"$f":"'5'!J28","v":"16748"},{"$f":"'5'!K28","v":"16750"},{"$f":"SUM(J38:J46)","v":150}]
[{"$f":"A38","v":5},{"$f":"'5'!A29","v":"Chargeur 966G - D3102742"},{"$f":"'5'!B29","v":"DESTOCKAGE/200308"},{"$f":"'5'!C29","v":4},{"$f":"'5'!D29","v":0},{"$f":"'5'!E29","v":0},{"$f":"'5'!F29","v":0},{"$f":"'5'!G29","v":0},{"$f":"'5'!H29","v":4},{"$f":"'5'!I29","v":0},{"$f":"'5'!J29","v":"2396"},{"$f":"'5'!K29","v":"2400"}]
[{"$f":"A39","v":5},{"$f":"'5'!A30","v":"CAMION MERCEDES OSSELLE-P2100552"},{"$f":"'5'!B30","v":0},{"$f":"'5'!C30","v":0},{"$f":"'5'!D30","v":0},{"$f":"'5'!E30","v":0},{"$f":"'5'!F30","v":0},{"$f":"'5'!G30","v":0},{"$f":"'5'!H30","v":0},{"$f":"'5'!I30","v":0},{"$f":"'5'!J30","v":0},{"$f":"'5'!K30","v":0}]
[5,{"$f":"'5'!A31","v":0},{"$f":"'5'!B31","v":0},{"$f":"'5'!C31","v":0},{"$f":"'5'!D31","v":0},{"$f":"'5'!E31","v":0},{"$f":"'5'!F31","v":0},{"$f":"'5'!G31","v":0},{"$f":"'5'!H31","v":0},{"$f":"'5'!I31","v":0},{"$f":"'5'!J31","v":0},{"$f":"'5'!K31","v":0}]
[5,{"$f":"'5'!A32","v":0},{"$f":"'5'!B32","v":0},{"$f":"'5'!C32","v":0},{"$f":"'5'!D32","v":0},{"$f":"'5'!E32","v":0},{"$f":"'5'!F32","v":0},{"$f":"'5'!G32","v":0},{"$f":"'5'!H32","v":0},{"$f":"'5'!I32","v":0},{"$f":"'5'!J32","v":0},{"$f":"'5'!K32","v":0}]
[5,{"$f":"'5'!A33","v":0},{"$f":"'5'!B33","v":0},{"$f":"'5'!C33","v":0},{"$f":"'5'!D33","v":0},{"$f":"'5'!E33","v":0},{"$f":"'5'!F33","v":0},{"$f":"'5'!G33","v":0},{"$f":"'5'!H33","v":0},{"$f":"'5'!I33","v":0},{"$f":"'5'!J33","v":0},{"$f":"'5'!K33","v":0}]
[5,{"$f":"'5'!A36","v":"Minipelle SV17 - oss - D1002929"},null,null,null,null,{"$f":"'5'!F36","v":0},{"$f":"'5'!G36","v":0},{"$f":"'5'!E36","v":0},{"$f":"'5'!D36","v":0},{"$f":"'5'!B36","v":"2291"},{"$f":"'5'!C36","v":"2291"}]
[5,{"$f":"'5'!A37","v":"Manitou M30 - C8100689"},null,null,null,null,{"$f":"'5'!F37","v":0},{"$f":"'5'!G37","v":0},{"$f":"'5'!E37","v":0},{"$f":"'5'!D37","v":0},{"$f":"'5'!B37","v":"7139"},{"$f":"'5'!C37","v":"7139"}]
[5,{"$f":"'5'!A38","v":0},null,null,null,null,{"$f":"'5'!F38","v":0},{"$f":"'5'!G38","v":0},{"$f":"'5'!E38","v":0},{"$f":"'5'!D38","v":0},{"$f":"'5'!B38","v":0},{"$f":"'5'!C38","v":0}]
[6,{"$f":"'6'!A28","v":"Chargeur L566 - D3101014"},{"$f":"'6'!B28","v":"CHARGEMENT CLIENT /200200"},{"$f":"'6'!C28","v":2},{"$f":"'6'!D28","v":0},{"$f":"'6'!E28","v":0},{"$f":"'6'!F28","v":0},{"$f":"'6'!G28","v":0},{"$f":"'6'!H28","v":2},{"$f":"'6'!I28","v":0},{"$f":"'6'!J28","v":"16750"},{"$f":"'6'!K28","v":"16752"},{"$f":"SUM(J47:J55)","v":0}]
[{"$f":"A47","v":6},{"$f":"'6'!A29","v":"Chargeur 966G - D3102742"},{"$f":"'6'!B29","v":"DESTOCKAGE/200308"},{"$f":"'6'!C29","v":4},{"$f":"'6'!D29","v":0},{"$f":"'6'!E29","v":0},{"$f":"'6'!F29","v":0},{"$f":"'6'!G29","v":0},{"$f":"'6'!H29","v":4},{"$f":"'6'!I29","v":0},{"$f":"'6'!J29","v":"2400"},{"$f":"'6'!K29","v":"2404"}]
[{"$f":"A48","v":6},{"$f":"'6'!A30","v":"CAMION MERCEDES OSSELLE-P2100552"},{"$f":"'6'!B30","v":0},{"$f":"'6'!C30","v":0},{"$f":"'6'!D30","v":0},{"$f":"'6'!E30","v":0},{"$f":"'6'!F30","v":0},{"$f":"'6'!G30","v":0},{"$f":"'6'!H30","v":0},{"$f":"'6'!I30","v":0},{"$f":"'6'!J30","v":0},{"$f":"'6'!K30","v":0}]
[6,{"$f":"'6'!A31","v":0},{"$f":"'6'!B31","v":0},{"$f":"'6'!C31","v":0},{"$f":"'6'!D31","v":0},{"$f":"'6'!E31","v":0},{"$f":"'6'!F31","v":0},{"$f":"'6'!G31","v":0},{"$f":"'6'!H31","v":0},{"$f":"'6'!I31","v":0},{"$f":"'6'!J31","v":0},{"$f":"'6'!K31","v":0}]
[6,{"$f":"'6'!A32","v":0},{"$f":"'6'!B32","v":0},{"$f":"'6'!C32","v":0},{"$f":"'6'!D32","v":0},{"$f":"'6'!E32","v":0},{"$f":"'6'!F32","v":0},{"$f":"'6'!G32","v":0},{"$f":"'6'!H32","v":0},{"$f":"'6'!I32","v":0},{"$f":"'6'!J32","v":0},{"$f":"'6'!K32","v":0}]
[6,{"$f":"'6'!A33","v":0},{"$f":"'6'!B33","v":0},{"$f":"'6'!C33","v":0},{"$f":"'6'!D33","v":0},{"$f":"'6'!E33","v":0},{"$f":"'6'!F33","v":0},{"$f":"'6'!G33","v":0},{"$f":"'6'!H33","v":0},{"$f":"'6'!I33","v":0},{"$f":"'6'!J33","v":0},{"$f":"'6'!K33","v":0}]
[6,{"$f":"'6'!A36","v":"Minipelle SV17 - oss - D1002929"},null,null,null,null,{"$f":"'6'!F36","v":0},{"$f":"'6'!G36","v":0},{"$f":"'6'!E36","v":0},{"$f":"'6'!D36","v":0},{"$f":"'6'!B36","v":"2291"},{"$f":"'6'!C36","v":"2291"}]
[6,{"$f":"'6'!A37","v":"Manitou M30 - C8100689"},null,null,null,null,{"$f":"'6'!F37","v":0},{"$f":"'6'!G37","v":0},{"$f":"'6'!E37","v":0},{"$f":"'6'!D37","v":0},{"$f":"'6'!B37","v":"7139"},{"$f":"'6'!C37","v":"7139"}]
[6,{"$f":"'6'!A38","v":0},null,null,null,null,{"$f":"'6'!F38","v":0},{"$f":"'6'!G38","v":0},{"$f":"'6'!E38","v":0},{"$f":"'6'!D38","v":0},{"$f":"'6'!B38","v":0},{"$f":"'6'!C38","v":0}]
[7,{"$f":"'7'!A28","v":"Chargeur L566 - D3101014"},{"$f":"'7'!B28","v":"TRAVAUX DIVERS SUR PISTE 200950"},{"$f":"'7'!C28","v":2},{"$f":"'7'!D28","v":0},{"$f":"'7'!E28","v":0},{"$f":"'7'!F28","v":0},{"$f":"'7'!G28","v":0},{"$f":"'7'!H28","v":2},{"$f":"'7'!I28","v":100},{"$f":"'7'!J28","v":"16752"},{"$f":"'7'!K28","v":"16754"},{"$f":"SUM(J56:J64)","v":250}]
[{"$f":"A56","v":7},{"$f":"'7'!A29","v":"Chargeur 966G - D3102742"},{"$f":"'7'!B29","v":"TRAVAUX DECH/210402"},{"$f":"'7'!C29","v":2},{"$f":"'7'!D29","v":0},{"$f":"'7'!E29","v":0},{"$f":"'7'!F29","v":0},{"$f":"'7'!G29","v":0},{"$f":"'7'!H29","v":2},{"$f":"'7'!I29","v":150},{"$f":"'7'!J29","v":"2404"},{"$f":"'7'!K29","v":"2406"}]
[{"$f":"A57","v":7},{"$f":"'7'!A30","v":"CAMION MERCEDES OSSELLE-P2100552"},{"$f":"'7'!B30","v":0},{"$f":"'7'!C30","v":0},{"$f":"'7'!D30","v":0},{"$f":"'7'!E30","v":0},{"$f":"'7'!F30","v":0},{"$f":"'7'!G30","v":0},{"$f":"'7'!H30","v":0},{"$f":"'7'!I30","v":0},{"$f":"'7'!J30","v":0},{"$f":"'7'!K30","v":0}]
[7,{"$f":"'7'!A31","v":0},{"$f":"'7'!B31","v":0},{"$f":"'7'!C31","v":0},{"$f":"'7'!D31","v":0},{"$f":"'7'!E31","v":0},{"$f":"'7'!F31","v":0},{"$f":"'7'!G31","v":0},{"$f":"'7'!H31","v":0},{"$f":"'7'!I31","v":0},{"$f":"'7'!J31","v":0},{"$f":"'7'!K31","v":0}]
[7,{"$f":"'7'!A32","v":0},{"$f":"'7'!B32","v":0},{"$f":"'7'!C32","v":0},{"$f":"'7'!D32","v":0},{"$f":"'7'!E32","v":0},{"$f":"'7'!F32","v":0},{"$f":"'7'!G32","v":0},{"$f":"'7'!H32","v":0},{"$f":"'7'!I32","v":0},{"$f":"'7'!J32","v":0},{"$f":"'7'!K32","v":0}]
[7,{"$f":"'7'!A33","v":0},{"$f":"'7'!B33","v":0},{"$f":"'7'!C33","v":0},{"$f":"'7'!D33","v":0},{"$f":"'7'!E33","v":0},{"$f":"'7'!F33","v":0},{"$f":"'7'!G33","v":0},{"$f":"'7'!H33","v":0},{"$f":"'7'!I33","v":0},{"$f":"'7'!J33","v":0},{"$f":"'7'!K33","v":0}]
[7,{"$f":"'7'!A36","v":"Minipelle SV17 - oss - D1002929"},null,null,null,null,{"$f":"'7'!F36","v":0},{"$f":"'7'!G36","v":0},{"$f":"'7'!E36","v":0},{"$f":"'7'!D36","v":0},{"$f":"'7'!B36","v":"2291"},{"$f":"'7'!C36","v":"2291"}]
[7,{"$f":"'7'!A37","v":"Manitou M30 - C8100689"},null,null,null,null,{"$f":"'7'!F37","v":0},{"$f":"'7'!G37","v":0},{"$f":"'7'!E37","v":2},{"$f":"'7'!D37","v":0},{"$f":"'7'!B37","v":"7139"},{"$f":"'7'!C37","v":"7141"}]
[7,{"$f":"'7'!A38","v":0},null,null,null,null,{"$f":"'7'!F38","v":0},{"$f":"'7'!G38","v":0},{"$f":"'7'!E38","v":0},{"$f":"'7'!D38","v":0},{"$f":"'7'!B38","v":0},{"$f":"'7'!C38","v":0}]
[8,{"$f":"'8'!A28","v":"Chargeur L566 - D3101014"},{"$f":"'8'!B28","v":"CHARGEMENT CLIENT /200200"},{"$f":"'8'!C28","v":2},{"$f":"'8'!D28","v":0},{"$f":"'8'!E28","v":0},{"$f":"'8'!F28","v":0},{"$f":"'8'!G28","v":0},{"$f":"'8'!H28","v":2},{"$f":"'8'!I28","v":0},{"$f":"'8'!J28","v":"16754"},{"$f":"'8'!K28","v":"16756"},{"$f":"SUM(J65:J73)","v":0}]
[{"$f":"A65","v":8},{"$f":"'8'!A29","v":"Chargeur 966G - D3102742"},{"$f":"'8'!B29","v":"DESTOCKAGE/200308"},{"$f":"'8'!C29","v":5},{"$f":"'8'!D29","v":0},{"$f":"'8'!E29","v":0},{"$f":"'8'!F29","v":0},{"$f":"'8'!G29","v":0},{"$f":"'8'!H29","v":5},{"$f":"'8'!I29","v":0},{"$f":"'8'!J29","v":"2406"},{"$f":"'8'!K29","v":"2411"}]
[{"$f":"A66","v":8},{"$f":"'8'!A30","v":"CAMION MERCEDES OSSELLE-P2100552"},{"$f":"'8'!B30","v":0},{"$f":"'8'!C30","v":0},{"$f":"'8'!D30","v":0},{"$f":"'8'!E30","v":0},{"$f":"'8'!F30","v":0},{"$f":"'8'!G30","v":0},{"$f":"'8'!H30","v":0},{"$f":"'8'!I30","v":0},{"$f":"'8'!J30","v":0},{"$f":"'8'!K30","v":0}]
[8,{"$f":"'8'!A31","v":0},{"$f":"'8'!B31","v":0},{"$f":"'8'!C31","v":0},{"$f":"'8'!D31","v":0},{"$f":"'8'!E31","v":0},{"$f":"'8'!F31","v":0},{"$f":"'8'!G31","v":0},{"$f":"'8'!H31","v":0},{"$f":"'8'!I31","v":0},{"$f":"'8'!J31","v":0},{"$f":"'8'!K31","v":0}]
[8,{"$f":"'8'!A32","v":0},{"$f":"'8'!B32","v":0},{"$f":"'8'!C32","v":0},{"$f":"'8'!D32","v":0},{"$f":"'8'!E32","v":0},{"$f":"'8'!F32","v":0},{"$f":"'8'!G32","v":0},{"$f":"'8'!H32","v":0},{"$f":"'8'!I32","v":0},{"$f":"'8'!J32","v":0},{"$f":"'8'!K32","v":0}]
[8,{"$f":"'8'!A33","v":0},{"$f":"'8'!B33","v":0},{"$f":"'8'!C33","v":0},{"$f":"'8'!D33","v":0},{"$f":"'8'!E33","v":0},{"$f":"'8'!F33","v":0},{"$f":"'8'!G33","v":0},{"$f":"'8'!H33","v":0},{"$f":"'8'!I33","v":0},{"$f":"'8'!J33","v":0},{"$f":"'8'!K33","v":0}]
[8,{"$f":"'8'!A36","v":"Minipelle SV17 - oss - D1002929"},null,null,null,null,{"$f":"'8'!F36","v":0},{"$f":"'8'!G36","v":0},{"$f":"'8'!E36","v":0},{"$f":"'8'!D36","v":0},{"$f":"'8'!B36","v":"2291"},{"$f":"'8'!C36","v":"2291"}]
[8,{"$f":"'8'!A37","v":"Manitou M30 - C8100689"},null,null,null,null,{"$f":"'8'!F37","v":0},{"$f":"'8'!G37","v":0},{"$f":"'8'!E37","v":0},{"$f":"'8'!D37","v":0},{"$f":"'8'!B37","v":"7141"},{"$f":"'8'!C37","v":"7141"}]
[8,{"$f":"'8'!A38","v":0},null,null,null,null,{"$f":"'8'!F38","v":0},{"$f":"'8'!G38","v":0},{"$f":"'8'!E38","v":0},{"$f":"'8'!D38","v":0},{"$f":"'8'!B38","v":0},{"$f":"'8'!C38","v":0}]
[9,{"$f":"'9'!A28","v":"Chargeur L566 - D3101014"},{"$f":"'9'!B28","v":"TRAVAUX DIVERS SUR PISTE 200950"},{"$f":"'9'!C28","v":1},{"$f":"'9'!D28","v":"CHARGEMENT CLIENT /200200"},{"$f":"'9'!E28","v":3},{"$f":"'9'!F28","v":0},{"$f":"'9'!G28","v":0},{"$f":"'9'!H28","v":4},{"$f":"'9'!I28","v":0},{"$f":"'9'!J28","v":"16756"},{"$f":"'9'!K28","v":"16760"},{"$f":"SUM(J74:J82)","v":150}]
[{"$f":"A74","v":9},{"$f":"'9'!A29","v":"Chargeur 966G - D3102742"},{"$f":"'9'!B29","v":"TRAVAUX DIVERS SUR PISTE 200950"},{"$f":"'9'!C29","v":1},{"$f":"'9'!D29","v":"DESTOCKAGE/200308"},{"$f":"'9'!E29","v":4},{"$f":"'9'!F29","v":0},{"$f":"'9'!G29","v":0},{"$f":"'9'!H29","v":5},{"$f":"'9'!I29","v":150},{"$f":"'9'!J29","v":"2411"},{"$f":"'9'!K29","v":"2416"}]
[{"$f":"A75","v":9},{"$f":"'9'!A30","v":"CAMION MERCEDES OSSELLE-P2100552"},{"$f":"'9'!B30","v":0},{"$f":"'9'!C30","v":0},{"$f":"'9'!D30","v":0},{"$f":"'9'!E30","v":0},{"$f":"'9'!F30","v":0},{"$f":"'9'!G30","v":0},{"$f":"'9'!H30","v":0},{"$f":"'9'!I30","v":0},{"$f":"'9'!J30","v":0},{"$f":"'9'!K30","v":0}]
[9,{"$f":"'9'!A31","v":0},{"$f":"'9'!B31","v":0},{"$f":"'9'!C31","v":0},{"$f":"'9'!D31","v":0},{"$f":"'9'!E31","v":0},{"$f":"'9'!F31","v":0},{"$f":"'9'!G31","v":0},{"$f":"'9'!H31","v":0},{"$f":"'9'!I31","v":0},{"$f":"'9'!J31","v":0},{"$f":"'9'!K31","v":0}]
[9,{"$f":"'9'!A32","v":0},{"$f":"'9'!B32","v":0},{"$f":"'9'!C32","v":0},{"$f":"'9'!D32","v":0},{"$f":"'9'!E32","v":0},{"$f":"'9'!F32","v":0},{"$f":"'9'!G32","v":0},{"$f":"'9'!H32","v":0},{"$f":"'9'!I32","v":0},{"$f":"'9'!J32","v":0},{"$f":"'9'!K32","v":0}]
[9,{"$f":"'9'!A33","v":0},{"$f":"'9'!B33","v":0},{"$f":"'9'!C33","v":0},{"$f":"'9'!D33","v":0},{"$f":"'9'!E33","v":0},{"$f":"'9'!F33","v":0},{"$f":"'9'!G33","v":0},{"$f":"'9'!H33","v":0},{"$f":"'9'!I33","v":0},{"$f":"'9'!J33","v":0},{"$f":"'9'!K33","v":0}]
[9,{"$f":"'9'!A36","v":"Minipelle SV17 - oss - D1002929"},null,null,null,null,{"$f":"'9'!F36","v":0},{"$f":"'9'!G36","v":0},{"$f":"'9'!E36","v":0},{"$f":"'9'!D36","v":0},{"$f":"'9'!B36","v":"2291"},{"$f":"'9'!C36","v":"2291"}]
[9,{"$f":"'9'!A37","v":"Manitou M30 - C8100689"},null,null,null,null,{"$f":"'9'!F37","v":0},{"$f":"'9'!G37","v":0},{"$f":"'9'!E37","v":0},{"$f":"'9'!D37","v":0},{"$f":"'9'!B37","v":"7141"},{"$f":"'9'!C37","v":"7141"}]
[9,{"$f":"'9'!A38","v":0},null,null,null,null,{"$f":"'9'!F38","v":0},{"$f":"'9'!G38","v":0},{"$f":"'9'!E38","v":0},{"$f":"'9'!D38","v":0},{"$f":"'9'!B38","v":0},{"$f":"'9'!C38","v":0}]
[10,{"$f":"'10'!A28","v":0},{"$f":"'10'!B28","v":0},{"$f":"'10'!C28","v":0},{"$f":"'10'!D28","v":0},{"$f":"'10'!E28","v":0},{"$f":"'10'!F28","v":0},{"$f":"'10'!G28","v":0},{"$f":"'10'!H28","v":0},{"$f":"'10'!I28","v":0},{"$f":"'10'!J28","v":0},{"$f":"'10'!K28","v":0},{"$f":"SUM(J83:J91)","v":0}]
[{"$f":"A83","v":10},{"$f":"'10'!A29","v":0},{"$f":"'10'!B29","v":0},{"$f":"'10'!C29","v":0},{"$f":"'10'!D29","v":0},{"$f":"'10'!E29","v":0},{"$f":"'10'!F29","v":0},{"$f":"'10'!G29","v":0},{"$f":"'10'!H29","v":0},{"$f":"'10'!I29","v":0},{"$f":"'10'!J29","v":0},{"$f":"'10'!K29","v":0}]
[{"$f":"A84","v":10},{"$f":"'10'!A30","v":0},{"$f":"'10'!B30","v":0},{"$f":"'10'!C30","v":0},{"$f":"'10'!D30","v":0},{"$f":"'10'!E30","v":0},{"$f":"'10'!F30","v":0},{"$f":"'10'!G30","v":0},{"$f":"'10'!H30","v":0},{"$f":"'10'!I30","v":0},{"$f":"'10'!J30","v":0},{"$f":"'10'!K30","v":0}]
[10,{"$f":"'10'!A31","v":0},{"$f":"'10'!B31","v":0},{"$f":"'10'!C31","v":0},{"$f":"'10'!D31","v":0},{"$f":"'10'!E31","v":0},{"$f":"'10'!F31","v":0},{"$f":"'10'!G31","v":0},{"$f":"'10'!H31","v":0},{"$f":"'10'!I31","v":0},{"$f":"'10'!J31","v":0},{"$f":"'10'!K31","v":0}]
[10,{"$f":"'10'!A32","v":0},{"$f":"'10'!B32","v":0},{"$f":"'10'!C32","v":0},{"$f":"'10'!D32","v":0},{"$f":"'10'!E32","v":0},{"$f":"'10'!F32","v":0},{"$f":"'10'!G32","v":0},{"$f":"'10'!H32","v":0},{"$f":"'10'!I32","v":0},{"$f":"'10'!J32","v":0},{"$f":"'10'!K32","v":0}]
[10,{"$f":"'10'!A33","v":0},{"$f":"'10'!B33","v":0},{"$f":"'10'!C33","v":0},{"$f":"'10'!D33","v":0},{"$f":"'10'!E33","v":0},{"$f":"'10'!F33","v":0},{"$f":"'10'!G33","v":0},{"$f":"'10'!H33","v":0},{"$f":"'10'!I33","v":0},{"$f":"'10'!J33","v":0},{"$f":"'10'!K33","v":0}]
[10,{"$f":"'10'!A36","v":0},null,null,null,null,{"$f":"'10'!F36","v":0},{"$f":"'10'!G36","v":0},{"$f":"'10'!E36","v":0},{"$f":"'10'!D36","v":0},{"$f":"'10'!B36","v":0},{"$f":"'10'!C36","v":0}]
[10,{"$f":"'10'!A37","v":0},null,null,null,null,{"$f":"'10'!F37","v":0},{"$f":"'10'!G37","v":0},{"$f":"'10'!E37","v":0},{"$f":"'10'!D37","v":0},{"$f":"'10'!B37","v":0},{"$f":"'10'!C37","v":0}]
[10,{"$f":"'10'!A38","v":0},null,null,null,null,{"$f":"'10'!F38","v":0},{"$f":"'10'!G38","v":0},{"$f":"'10'!E38","v":0},{"$f":"'10'!D38","v":0},{"$f":"'10'!B38","v":0},{"$f":"'10'!C38","v":0}]
[11,{"$f":"'11'!A28","v":0},{"$f":"'11'!B28","v":0},{"$f":"'11'!C28","v":0},{"$f":"'11'!D28","v":0},{"$f":"'11'!E28","v":0},{"$f":"'11'!F28","v":0},{"$f":"'11'!G28","v":0},{"$f":"'11'!H28","v":0},{"$f":"'11'!I28","v":0},{"$f":"'11'!J28","v":0},{"$f":"'11'!K28","v":0},{"$f":"SUM(J92:J100)","v":0}]
[{"$f":"A92","v":11},{"$f":"'11'!A29","v":0},{"$f":"'11'!B29","v":0},{"$f":"'11'!C29","v":0},{"$f":"'11'!D29","v":0},{"$f":"'11'!E29","v":0},{"$f":"'11'!F29","v":0},{"$f":"'11'!G29","v":0},{"$f":"'11'!H29","v":0},{"$f":"'11'!I29","v":0},{"$f":"'11'!J29","v":0},{"$f":"'11'!K29","v":0}]
[{"$f":"A93","v":11},{"$f":"'11'!A30","v":0},{"$f":"'11'!B30","v":0},{"$f":"'11'!C30","v":0},{"$f":"'11'!D30","v":0},{"$f":"'11'!E30","v":0},{"$f":"'11'!F30","v":0},{"$f":"'11'!G30","v":0},{"$f":"'11'!H30","v":0},{"$f":"'11'!I30","v":0},{"$f":"'11'!J30","v":0},{"$f":"'11'!K30","v":0}]
[11,{"$f":"'11'!A31","v":0},{"$f":"'11'!B31","v":0},{"$f":"'11'!C31","v":0},{"$f":"'11'!D31","v":0},{"$f":"'11'!E31","v":0},{"$f":"'11'!F31","v":0},{"$f":"'11'!G31","v":0},{"$f":"'11'!H31","v":0},{"$f":"'11'!I31","v":0},{"$f":"'11'!J31","v":0},{"$f":"'11'!K31","v":0}]
[11,{"$f":"'11'!A32","v":0},{"$f":"'11'!B32","v":0},{"$f":"'11'!C32","v":0},{"$f":"'11'!D32","v":0},{"$f":"'11'!E32","v":0},{"$f":"'11'!F32","v":0},{"$f":"'11'!G32","v":0},{"$f":"'11'!H32","v":0},{"$f":"'11'!I32","v":0},{"$f":"'11'!J32","v":0},{"$f":"'11'!K32","v":0}]
[11,{"$f":"'11'!A33","v":0},{"$f":"'11'!B33","v":0},{"$f":"'11'!C33","v":0},{"$f":"'11'!D33","v":0},{"$f":"'11'!E33","v":0},{"$f":"'11'!F33","v":0},{"$f":"'11'!G33","v":0},{"$f":"'11'!H33","v":0},{"$f":"'11'!I33","v":0},{"$f":"'11'!J33","v":0},{"$f":"'11'!K33","v":0}]
[11,{"$f":"'11'!A36","v":0},null,null,null,null,{"$f":"'11'!F36","v":0},{"$f":"'11'!G36","v":0},{"$f":"'11'!E36","v":0},{"$f":"'11'!D36","v":0},{"$f":"'11'!B36","v":0},{"$f":"'11'!C36","v":0}]
[11,{"$f":"'11'!A37","v":0},null,null,null,null,{"$f":"'11'!F37","v":0},{"$f":"'11'!G37","v":0},{"$f":"'11'!E37","v":0},{"$f":"'11'!D37","v":0},{"$f":"'11'!B37","v":0},{"$f":"'11'!C37","v":0}]
[11,{"$f":"'11'!A38","v":0},null,null,null,null,{"$f":"'11'!F38","v":0},{"$f":"'11'!G38","v":0},{"$f":"'11'!E38","v":0},{"$f":"'11'!D38","v":0},{"$f":"'11'!B38","v":0},{"$f":"'11'!C38","v":0}]
[12,{"$f":"'12'!A28","v":"Chargeur L566 - D3101014"},{"$f":"'12'!B28","v":"TRAVAUX DIVERS SUR PISTE 200950"},{"$f":"'12'!C28","v":3},{"$f":"'12'!D28","v":0},{"$f":"'12'!E28","v":0},{"$f":"'12'!F28","v":0},{"$f":"'12'!G28","v":0},{"$f":"'12'!H28","v":3},{"$f":"'12'!I28","v":305},{"$f":"'12'!J28","v":"16760"},{"$f":"'12'!K28","v":"16763"},{"$f":"SUM(J101:J109)","v":305}]
[{"$f":"A101","v":12},{"$f":"'12'!A29","v":"Chargeur 966G - D3102742"},{"$f":"'12'!B29","v":"CHARGEMENT CLIENT /200200"},{"$f":"'12'!C29","v":3},{"$f":"'12'!D29","v":0},{"$f":"'12'!E29","v":0},{"$f":"'12'!F29","v":0},{"$f":"'12'!G29","v":0},{"$f":"'12'!H29","v":3},{"$f":"'12'!I29","v":0},{"$f":"'12'!J29","v":"2416"},{"$f":"'12'!K29","v":"2419"}]
[{"$f":"A102","v":12},{"$f":"'12'!A30","v":"CAMION MERCEDES OSSELLE-P2100552"},{"$f":"'12'!B30","v":0},{"$f":"'12'!C30","v":0},{"$f":"'12'!D30","v":0},{"$f":"'12'!E30","v":0},{"$f":"'12'!F30","v":0},{"$f":"'12'!G30","v":0},{"$f":"'12'!H30","v":0},{"$f":"'12'!I30","v":0},{"$f":"'12'!J30","v":0},{"$f":"'12'!K30","v":0}]
[12,{"$f":"'12'!A31","v":0},{"$f":"'12'!B31","v":0},{"$f":"'12'!C31","v":0},{"$f":"'12'!D31","v":0},{"$f":"'12'!E31","v":0},{"$f":"'12'!F31","v":0},{"$f":"'12'!G31","v":0},{"$f":"'12'!H31","v":0},{"$f":"'12'!I31","v":0},{"$f":"'12'!J31","v":0},{"$f":"'12'!K31","v":0}]
[12,{"$f":"'12'!A32","v":0},{"$f":"'12'!B32","v":0},{"$f":"'12'!C32","v":0},{"$f":"'12'!D32","v":0},{"$f":"'12'!E32","v":0},{"$f":"'12'!F32","v":0},{"$f":"'12'!G32","v":0},{"$f":"'12'!H32","v":0},{"$f":"'12'!I32","v":0},{"$f":"'12'!J32","v":0},{"$f":"'12'!K32","v":0}]
[12,{"$f":"'12'!A33","v":0},{"$f":"'12'!B33","v":0},{"$f":"'12'!C33","v":0},{"$f":"'12'!D33","v":0},{"$f":"'12'!E33","v":0},{"$f":"'12'!F33","v":0},{"$f":"'12'!G33","v":0},{"$f":"'12'!H33","v":0},{"$f":"'12'!I33","v":0},{"$f":"'12'!J33","v":0},{"$f":"'12'!K33","v":0}]
[12,{"$f":"'12'!A36","v":"Minipelle SV17 - oss - D1002929"},null,null,null,null,{"$f":"'12'!F36","v":0},{"$f":"'12'!G36","v":0},{"$f":"'12'!E36","v":0},{"$f":"'12'!D36","v":0},{"$f":"'12'!B36","v":"2291"},{"$f":"'12'!C36","v":"2291"}]
[12,{"$f":"'12'!A37","v":"Manitou M30 - C8100689"},null,null,null,null,{"$f":"'12'!F37","v":0},{"$f":"'12'!G37","v":0},{"$f":"'12'!E37","v":0},{"$f":"'12'!D37","v":0},{"$f":"'12'!B37","v":"7141"},{"$f":"'12'!C37","v":"7141"}]
[12,{"$f":"'12'!A38","v":0},null,null,null,null,{"$f":"'12'!F38","v":0},{"$f":"'12'!G38","v":0},{"$f":"'12'!E38","v":0},{"$f":"'12'!D38","v":0},{"$f":"'12'!B38","v":0},{"$f":"'12'!C38","v":0}]
[13,{"$f":"'13'!A28","v":"Chargeur L566 - D3101014"},{"$f":"'13'!B28","v":0},{"$f":"'13'!C28","v":0},{"$f":"'13'!D28","v":0},{"$f":"'13'!E28","v":0},{"$f":"'13'!F28","v":0},{"$f":"'13'!G28","v":0},{"$f":"'13'!H28","v":0},{"$f":"'13'!I28","v":0},{"$f":"'13'!J28","v":"16763"},{"$f":"'13'!K28","v":"16763"},{"$f":"SUM(J110:J118)","v":0}]
[{"$f":"A110","v":13},{"$f":"'13'!A29","v":"Chargeur 966G - D3102742"},{"$f":"'13'!B29","v":"CHARGEMENT CLIENT /200200"},{"$f":"'13'!C29","v":3},{"$f":"'13'!D29","v":0},{"$f":"'13'!E29","v":0},{"$f":"'13'!F29","v":0},{"$f":"'13'!G29","v":0},{"$f":"'13'!H29","v":3},{"$f":"'13'!I29","v":0},{"$f":"'13'!J29","v":"2419"},{"$f":"'13'!K29","v":"2422"}]
[{"$f":"A111","v":13},{"$f":"'13'!A30","v":"CAMION MERCEDES OSSELLE-P2100552"},{"$f":"'13'!B30","v":0},{"$f":"'13'!C30","v":0},{"$f":"'13'!D30","v":0},{"$f":"'13'!E30","v":0},{"$f":"'13'!F30","v":0},{"$f":"'13'!G30","v":0},{"$f":"'13'!H30","v":0},{"$f":"'13'!I30","v":0},{"$f":"'13'!J30","v":0},{"$f":"'13'!K30","v":0}]
[13,{"$f":"'13'!A31","v":0},{"$f":"'13'!B31","v":0},{"$f":"'13'!C31","v":0},{"$f":"'13'!D31","v":0},{"$f":"'13'!E31","v":0},{"$f":"'13'!F31","v":0},{"$f":"'13'!G31","v":0},{"$f":"'13'!H31","v":0},{"$f":"'13'!I31","v":0},{"$f":"'13'!J31","v":0},{"$f":"'13'!K31","v":0}]
[13,{"$f":"'13'!A32","v":0},{"$f":"'13'!B32","v":0},{"$f":"'13'!C32","v":0},{"$f":"'13'!D32","v":0},{"$f":"'13'!E32","v":0},{"$f":"'13'!F32","v":0},{"$f":"'13'!G32","v":0},{"$f":"'13'!H32","v":0},{"$f":"'13'!I32","v":0},{"$f":"'13'!J32","v":0},{"$f":"'13'!K32","v":0}]
[13,{"$f":"'13'!A33","v":0},{"$f":"'13'!B33","v":0},{"$f":"'13'!C33","v":0},{"$f":"'13'!D33","v":0},{"$f":"'13'!E33","v":0},{"$f":"'13'!F33","v":0},{"$f":"'13'!G33","v":0},{"$f":"'13'!H33","v":0},{"$f":"'13'!I33","v":0},{"$f":"'13'!J33","v":0},{"$f":"'13'!K33","v":0}]
[13,{"$f":"'13'!A36","v":"Minipelle SV17 - oss - D1002929"},null,null,null,null,{"$f":"'13'!F36","v":0},{"$f":"'13'!G36","v":0},{"$f":"'13'!E36","v":0},{"$f":"'13'!D36","v":0},{"$f":"'13'!B36","v":"2291"},{"$f":"'13'!C36","v":"2291"}]
[13,{"$f":"'13'!A37","v":"Manitou M30 - C8100689"},null,null,null,null,{"$f":"'13'!F37","v":0},{"$f":"'13'!G37","v":0},{"$f":"'13'!E37","v":5},{"$f":"'13'!D37","v":0},{"$f":"'13'!B37","v":"7141"},{"$f":"'13'!C37","v":"7146"}]
[13,{"$f":"'13'!A38","v":0},null,null,null,null,{"$f":"'13'!F38","v":0},{"$f":"'13'!G38","v":0},{"$f":"'13'!E38","v":0},{"$f":"'13'!D38","v":0},{"$f":"'13'!B38","v":0},{"$f":"'13'!C38","v":0}]
[14,{"$f":"'14'!A28","v":"Chargeur L566 - D3101014"},{"$f":"'14'!B28","v":0},{"$f":"'14'!C28","v":0},{"$f":"'14'!D28","v":0},{"$f":"'14'!E28","v":0},{"$f":"'14'!F28","v":0},{"$f":"'14'!G28","v":0},{"$f":"'14'!H28","v":0},{"$f":"'14'!I28","v":0},{"$f":"'14'!J28","v":"16763"},{"$f":"'14'!K28","v":"16763"},{"$f":"SUM(J119:J127)","v":0}]
[{"$f":"A119","v":14},{"$f":"'14'!A29","v":"Chargeur 966G - D3102742"},{"$f":"'14'!B29","v":"CHARGEMENT CLIENT /200200"},{"$f":"'14'!C29","v":2},{"$f":"'14'!D29","v":0},{"$f":"'14'!E29","v":0},{"$f":"'14'!F29","v":0},{"$f":"'14'!G29","v":0},{"$f":"'14'!H29","v":2},{"$f":"'14'!I29","v":0},{"$f":"'14'!J29","v":"2422"},{"$f":"'14'!K29","v":"2424"}]
[{"$f":"A120","v":14},{"$f":"'14'!A30","v":"CAMION MERCEDES OSSELLE-P2100552"},{"$f":"'14'!B30","v":0},{"$f":"'14'!C30","v":0},{"$f":"'14'!D30","v":0},{"$f":"'14'!E30","v":0},{"$f":"'14'!F30","v":0},{"$f":"'14'!G30","v":0},{"$f":"'14'!H30","v":0},{"$f":"'14'!I30","v":0},{"$f":"'14'!J30","v":0},{"$f":"'14'!K30","v":0}]
[14,{"$f":"'14'!A31","v":0},{"$f":"'14'!B31","v":0},{"$f":"'14'!C31","v":0},{"$f":"'14'!D31","v":0},{"$f":"'14'!E31","v":0},{"$f":"'14'!F31","v":0},{"$f":"'14'!G31","v":0},{"$f":"'14'!H31","v":0},{"$f":"'14'!I31","v":0},{"$f":"'14'!J31","v":0},{"$f":"'14'!K31","v":0}]
[14,{"$f":"'14'!A32","v":0},{"$f":"'14'!B32","v":0},{"$f":"'14'!C32","v":0},{"$f":"'14'!D32","v":0},{"$f":"'14'!E32","v":0},{"$f":"'14'!F32","v":0},{"$f":"'14'!G32","v":0},{"$f":"'14'!H32","v":0},{"$f":"'14'!I32","v":0},{"$f":"'14'!J32","v":0},{"$f":"'14'!K32","v":0}]
[14,{"$f":"'14'!A33","v":0},{"$f":"'14'!B33","v":0},{"$f":"'14'!C33","v":0},{"$f":"'14'!D33","v":0},{"$f":"'14'!E33","v":0},{"$f":"'14'!F33","v":0},{"$f":"'14'!G33","v":0},{"$f":"'14'!H33","v":0},{"$f":"'14'!I33","v":0},{"$f":"'14'!J33","v":0},{"$f":"'14'!K33","v":0}]
[14,{"$f":"'14'!A36","v":"Minipelle SV17 - oss - D1002929"},null,null,null,null,{"$f":"'14'!F36","v":0},{"$f":"'14'!G36","v":0},{"$f":"'14'!E36","v":0},{"$f":"'14'!D36","v":0},{"$f":"'14'!B36","v":"2291"},{"$f":"'14'!C36","v":"2291"}]
[14,{"$f":"'14'!A37","v":"Manitou M30 - C8100689"},null,null,null,null,{"$f":"'14'!F37","v":0},{"$f":"'14'!G37","v":0},{"$f":"'14'!E37","v":5},{"$f":"'14'!D37","v":0},{"$f":"'14'!B37","v":"7141"},{"$f":"'14'!C37","v":"7146"}]
[14,{"$f":"'14'!A38","v":0},null,null,null,null,{"$f":"'14'!F38","v":0},{"$f":"'14'!G38","v":0},{"$f":"'14'!E38","v":0},{"$f":"'14'!D38","v":0},{"$f":"'14'!B38","v":0},{"$f":"'14'!C38","v":0}]
[15,{"$f":"'15'!A28","v":"Chargeur L566 - D3101014"},{"$f":"'15'!B28","v":"TRAVAUX DIVERS SUR PISTE 200950"},{"$f":"'15'!C28","v":1},{"$f":"'15'!D28","v":0},{"$f":"'15'!E28","v":0},{"$f":"'15'!F28","v":0},{"$f":"'15'!G28","v":0},{"$f":"'15'!H28","v":1},{"$f":"'15'!I28","v":0},{"$f":"'15'!J28","v":"16763"},{"$f":"'15'!K28","v":"16764"},{"$f":"SUM(J128:J136)","v":100}]
[{"$f":"A128","v":15},{"$f":"'15'!A29","v":"Chargeur 966G - D3102742"},{"$f":"'15'!B29","v":"CHARGEMENT CLIENT /200200"},{"$f":"'15'!C29","v":1},{"$f":"'15'!D29","v":0},{"$f":"'15'!E29","v":0},{"$f":"'15'!F29","v":0},{"$f":"'15'!G29","v":0},{"$f":"'15'!H29","v":1},{"$f":"'15'!I29","v":100},{"$f":"'15'!J29","v":"2424"},{"$f":"'15'!K29","v":"2425"}]
[{"$f":"A129","v":15},{"$f":"'15'!A30","v":"CAMION MERCEDES OSSELLE-P2100552"},{"$f":"'15'!B30","v":0},{"$f":"'15'!C30","v":0},{"$f":"'15'!D30","v":0},{"$f":"'15'!E30","v":0},{"$f":"'15'!F30","v":0},{"$f":"'15'!G30","v":0},{"$f":"'15'!H30","v":0},{"$f":"'15'!I30","v":0},{"$f":"'15'!J30","v":0},{"$f":"'15'!K30","v":0}]
[15,{"$f":"'15'!A31","v":0},{"$f":"'15'!B31","v":0},{"$f":"'15'!C31","v":0},{"$f":"'15'!D31","v":0},{"$f":"'15'!E31","v":0},{"$f":"'15'!F31","v":0},{"$f":"'15'!G31","v":0},{"$f":"'15'!H31","v":0},{"$f":"'15'!I31","v":0},{"$f":"'15'!J31","v":0},{"$f":"'15'!K31","v":0}]
[15,{"$f":"'15'!A32","v":0},{"$f":"'15'!B32","v":0},{"$f":"'15'!C32","v":0},{"$f":"'15'!D32","v":0},{"$f":"'15'!E32","v":0},{"$f":"'15'!F32","v":0},{"$f":"'15'!G32","v":0},{"$f":"'15'!H32","v":0},{"$f":"'15'!I32","v":0},{"$f":"'15'!J32","v":0},{"$f":"'15'!K32","v":0}]
[15,{"$f":"'15'!A33","v":0},{"$f":"'15'!B33","v":0},{"$f":"'15'!C33","v":0},{"$f":"'15'!D33","v":0},{"$f":"'15'!E33","v":0},{"$f":"'15'!F33","v":0},{"$f":"'15'!G33","v":0},{"$f":"'15'!H33","v":0},{"$f":"'15'!I33","v":0},{"$f":"'15'!J33","v":0},{"$f":"'15'!K33","v":0}]
[15,{"$f":"'15'!A36","v":"Minipelle SV17 - oss - D1002929"},null,null,null,null,{"$f":"'15'!F36","v":0},{"$f":"'15'!G36","v":0},{"$f":"'15'!E36","v":0},{"$f":"'15'!D36","v":0},{"$f":"'15'!B36","v":"2291"},{"$f":"'15'!C36","v":"2291"}]
[15,{"$f":"'15'!A37","v":"Manitou M30 - C8100689"},null,null,null,null,{"$f":"'15'!F37","v":0},{"$f":"'15'!G37","v":0},{"$f":"'15'!E37","v":5},{"$f":"'15'!D37","v":0},{"$f":"'15'!B37","v":"7141"},{"$f":"'15'!C37","v":"7146"}]
[15,{"$f":"'15'!A38","v":0},null,null,null,null,{"$f":"'15'!F38","v":0},{"$f":"'15'!G38","v":0},{"$f":"'15'!E38","v":0},{"$f":"'15'!D38","v":0},{"$f":"'15'!B38","v":0},{"$f":"'15'!C38","v":0}]
[16,{"$f":"'16'!A28","v":"Chargeur L566 - D3101014"},{"$f":"'16'!B28","v":0},{"$f":"'16'!C28","v":0},{"$f":"'16'!D28","v":0},{"$f":"'16'!E28","v":0},{"$f":"'16'!F28","v":0},{"$f":"'16'!G28","v":0},{"$f":"'16'!H28","v":0},{"$f":"'16'!I28","v":0},{"$f":"'16'!J28","v":"16764"},{"$f":"'16'!K28","v":"16764"},{"$f":"SUM(J137:J145)","v":100}]
[{"$f":"A137","v":16},{"$f":"'16'!A29","v":"Chargeur 966G - D3102742"},{"$f":"'16'!B29","v":"CHARGEMENT CLIENT /200200"},{"$f":"'16'!C29","v":2},{"$f":"'16'!D29","v":0},{"$f":"'16'!E29","v":0},{"$f":"'16'!F29","v":0},{"$f":"'16'!G29","v":0},{"$f":"'16'!H29","v":2},{"$f":"'16'!I29","v":0},{"$f":"'16'!J29","v":"2425"},{"$f":"'16'!K29","v":"2427"}]
[{"$f":"A138","v":16},{"$f":"'16'!A30","v":"CAMION MERCEDES OSSELLE-P2100552"},{"$f":"'16'!B30","v":0},{"$f":"'16'!C30","v":0},{"$f":"'16'!D30","v":0},{"$f":"'16'!E30","v":0},{"$f":"'16'!F30","v":0},{"$f":"'16'!G30","v":0},{"$f":"'16'!H30","v":0},{"$f":"'16'!I30","v":0},{"$f":"'16'!J30","v":0},{"$f":"'16'!K30","v":0}]
[16,{"$f":"'16'!A31","v":0},{"$f":"'16'!B31","v":0},{"$f":"'16'!C31","v":0},{"$f":"'16'!D31","v":0},{"$f":"'16'!E31","v":0},{"$f":"'16'!F31","v":0},{"$f":"'16'!G31","v":0},{"$f":"'16'!H31","v":0},{"$f":"'16'!I31","v":0},{"$f":"'16'!J31","v":0},{"$f":"'16'!K31","v":0}]
[16,{"$f":"'16'!A32","v":0},{"$f":"'16'!B32","v":0},{"$f":"'16'!C32","v":0},{"$f":"'16'!D32","v":0},{"$f":"'16'!E32","v":0},{"$f":"'16'!F32","v":0},{"$f":"'16'!G32","v":0},{"$f":"'16'!H32","v":0},{"$f":"'16'!I32","v":0},{"$f":"'16'!J32","v":0},{"$f":"'16'!K32","v":0}]
[16,{"$f":"'16'!A33","v":0},{"$f":"'16'!B33","v":0},{"$f":"'16'!C33","v":0},{"$f":"'16'!D33","v":0},{"$f":"'16'!E33","v":0},{"$f":"'16'!F33","v":0},{"$f":"'16'!G33","v":0},{"$f":"'16'!H33","v":0},{"$f":"'16'!I33","v":0},{"$f":"'16'!J33","v":0},{"$f":"'16'!K33","v":0}]
[16,{"$f":"'16'!A36","v":"Minipelle SV17 - oss - D1002929"},null,null,null,null,{"$f":"'16'!F36","v":0},{"$f":"'16'!G36","v":0},{"$f":"'16'!E36","v":0},{"$f":"'16'!D36","v":0},{"$f":"'16'!B36","v":"2291"},{"$f":"'16'!C36","v":"2291"}]
[16,{"$f":"'16'!A37","v":"Manitou M30 - C8100689"},null,null,null,null,{"$f":"'16'!F37","v":0},{"$f":"'16'!G37","v":0},{"$f":"'16'!E37","v":5},{"$f":"'16'!D37","v":0},{"$f":"'16'!B37","v":"7141"},{"$f":"'16'!C37","v":"7146"}]
[16,{"$f":"'16'!A38","v":"PELLE TP JOLY"},null,null,null,null,{"$f":"'16'!F38","v":0},{"$f":"'16'!G38","v":0},{"$f":"'16'!E38","v":0},{"$f":"'16'!D38","v":100},{"$f":"'16'!B38","v":0},{"$f":"'16'!C38","v":0}]
[17,{"$f":"'17'!A28","v":0},{"$f":"'17'!B28","v":0},{"$f":"'17'!C28","v":0},{"$f":"'17'!D28","v":0},{"$f":"'17'!E28","v":0},{"$f":"'17'!F28","v":0},{"$f":"'17'!G28","v":0},{"$f":"'17'!H28","v":0},{"$f":"'17'!I28","v":0},{"$f":"'17'!J28","v":0},{"$f":"'17'!K28","v":0},{"$f":"SUM(J146:J154)","v":0}]
[{"$f":"A146","v":17},{"$f":"'17'!A29","v":0},{"$f":"'17'!B29","v":0},{"$f":"'17'!C29","v":0},{"$f":"'17'!D29","v":0},{"$f":"'17'!E29","v":0},{"$f":"'17'!F29","v":0},{"$f":"'17'!G29","v":0},{"$f":"'17'!H29","v":0},{"$f":"'17'!I29","v":0},{"$f":"'17'!J29","v":0},{"$f":"'17'!K29","v":0}]
[{"$f":"A147","v":17},{"$f":"'17'!A30","v":0},{"$f":"'17'!B30","v":0},{"$f":"'17'!C30","v":0},{"$f":"'17'!D30","v":0},{"$f":"'17'!E30","v":0},{"$f":"'17'!F30","v":0},{"$f":"'17'!G30","v":0},{"$f":"'17'!H30","v":0},{"$f":"'17'!I30","v":0},{"$f":"'17'!J30","v":0},{"$f":"'17'!K30","v":0}]
[17,{"$f":"'17'!A31","v":0},{"$f":"'17'!B31","v":0},{"$f":"'17'!C31","v":0},{"$f":"'17'!D31","v":0},{"$f":"'17'!E31","v":0},{"$f":"'17'!F31","v":0},{"$f":"'17'!G31","v":0},{"$f":"'17'!H31","v":0},{"$f":"'17'!I31","v":0},{"$f":"'17'!J31","v":0},{"$f":"'17'!K31","v":0}]
[17,{"$f":"'17'!A32","v":0},{"$f":"'17'!B32","v":0},{"$f":"'17'!C32","v":0},{"$f":"'17'!D32","v":0},{"$f":"'17'!E32","v":0},{"$f":"'17'!F32","v":0},{"$f":"'17'!G32","v":0},{"$f":"'17'!H32","v":0},{"$f":"'17'!I32","v":0},{"$f":"'17'!J32","v":0},{"$f":"'17'!K32","v":0}]
[17,{"$f":"'17'!A33","v":0},{"$f":"'17'!B33","v":0},{"$f":"'17'!C33","v":0},{"$f":"'17'!D33","v":0},{"$f":"'17'!E33","v":0},{"$f":"'17'!F33","v":0},{"$f":"'17'!G33","v":0},{"$f":"'17'!H33","v":0},{"$f":"'17'!I33","v":0},{"$f":"'17'!J33","v":0},{"$f":"'17'!K33","v":0}]
[17,{"$f":"'17'!A36","v":0},null,null,null,null,{"$f":"'17'!F36","v":0},{"$f":"'17'!G36","v":0},{"$f":"'17'!E36","v":0},{"$f":"'17'!D36","v":0},{"$f":"'17'!B36","v":0},{"$f":"'17'!C36","v":0}]
[17,{"$f":"'17'!A37","v":0},null,null,null,null,{"$f":"'17'!F37","v":0},{"$f":"'17'!G37","v":0},{"$f":"'17'!E37","v":0},{"$f":"'17'!D37","v":0},{"$f":"'17'!B37","v":0},{"$f":"'17'!C37","v":0}]
[17,{"$f":"'17'!A38","v":0},null,null,null,null,{"$f":"'17'!F38","v":0},{"$f":"'17'!G38","v":0},{"$f":"'17'!E38","v":0},{"$f":"'17'!D38","v":0},{"$f":"'17'!B38","v":0},{"$f":"'17'!C38","v":0}]
[18,{"$f":"'18'!A28","v":0},{"$f":"'18'!B28","v":0},{"$f":"'18'!C28","v":0},{"$f":"'18'!D28","v":0},{"$f":"'18'!E28","v":0},{"$f":"'18'!F28","v":0},{"$f":"'18'!G28","v":0},{"$f":"'18'!H28","v":0},{"$f":"'18'!I28","v":0},{"$f":"'18'!J28","v":0},{"$f":"'18'!K28","v":0},{"$f":"SUM(J155:J163)","v":0}]
[{"$f":"A155","v":18},{"$f":"'18'!A29","v":0},{"$f":"'18'!B29","v":0},{"$f":"'18'!C29","v":0},{"$f":"'18'!D29","v":0},{"$f":"'18'!E29","v":0},{"$f":"'18'!F29","v":0},{"$f":"'18'!G29","v":0},{"$f":"'18'!H29","v":0},{"$f":"'18'!I29","v":0},{"$f":"'18'!J29","v":0},{"$f":"'18'!K29","v":0}]
[{"$f":"A156","v":18},{"$f":"'18'!A30","v":0},{"$f":"'18'!B30","v":0},{"$f":"'18'!C30","v":0},{"$f":"'18'!D30","v":0},{"$f":"'18'!E30","v":0},{"$f":"'18'!F30","v":0},{"$f":"'18'!G30","v":0},{"$f":"'18'!H30","v":0},{"$f":"'18'!I30","v":0},{"$f":"'18'!J30","v":0},{"$f":"'18'!K30","v":0}]
[18,{"$f":"'18'!A31","v":0},{"$f":"'18'!B31","v":0},{"$f":"'18'!C31","v":0},{"$f":"'18'!D31","v":0},{"$f":"'18'!E31","v":0},{"$f":"'18'!F31","v":0},{"$f":"'18'!G31","v":0},{"$f":"'18'!H31","v":0},{"$f":"'18'!I31","v":0},{"$f":"'18'!J31","v":0},{"$f":"'18'!K31","v":0}]
[18,{"$f":"'18'!A32","v":0},{"$f":"'18'!B32","v":0},{"$f":"'18'!C32","v":0},{"$f":"'18'!D32","v":0},{"$f":"'18'!E32","v":0},{"$f":"'18'!F32","v":0},{"$f":"'18'!G32","v":0},{"$f":"'18'!H32","v":0},{"$f":"'18'!I32","v":0},{"$f":"'18'!J32","v":0},{"$f":"'18'!K32","v":0}]
[18,{"$f":"'18'!A33","v":0},{"$f":"'18'!B33","v":0},{"$f":"'18'!C33","v":0},{"$f":"'18'!D33","v":0},{"$f":"'18'!E33","v":0},{"$f":"'18'!F33","v":0},{"$f":"'18'!G33","v":0},{"$f":"'18'!H33","v":0},{"$f":"'18'!I33","v":0},{"$f":"'18'!J33","v":0},{"$f":"'18'!K33","v":0}]
[18,{"$f":"'18'!A36","v":0},null,null,null,null,{"$f":"'18'!F36","v":0},{"$f":"'18'!G36","v":0},{"$f":"'18'!E36","v":0},{"$f":"'18'!D36","v":0},{"$f":"'18'!B36","v":0},{"$f":"'18'!C36","v":0}]
[18,{"$f":"'18'!A37","v":0},null,null,null,null,{"$f":"'18'!F37","v":0},{"$f":"'18'!G37","v":0},{"$f":"'18'!E37","v":0},{"$f":"'18'!D37","v":0},{"$f":"'18'!B37","v":0},{"$f":"'18'!C37","v":0}]
[18,{"$f":"'18'!A38","v":0},null,null,null,null,{"$f":"'18'!F38","v":0},{"$f":"'18'!G38","v":0},{"$f":"'18'!E38","v":0},{"$f":"'18'!D38","v":0},{"$f":"'18'!B38","v":0},{"$f":"'18'!C38","v":0}]
[19,{"$f":"'19'!A28","v":0},{"$f":"'19'!B28","v":0},{"$f":"'19'!C28","v":0},{"$f":"'19'!D28","v":0},{"$f":"'19'!E28","v":0},{"$f":"'19'!F28","v":0},{"$f":"'19'!G28","v":0},{"$f":"'19'!H28","v":0},{"$f":"'19'!I28","v":0},{"$f":"'19'!J28","v":0},{"$f":"'19'!K28","v":0},{"$f":"SUM(J164:J172)","v":0}]
[{"$f":"A164","v":19},{"$f":"'19'!A29","v":0},{"$f":"'19'!B29","v":0},{"$f":"'19'!C29","v":0},{"$f":"'19'!D29","v":0},{"$f":"'19'!E29","v":0},{"$f":"'19'!F29","v":0},{"$f":"'19'!G29","v":0},{"$f":"'19'!H29","v":0},{"$f":"'19'!I29","v":0},{"$f":"'19'!J29","v":0},{"$f":"'19'!K29","v":0}]
[{"$f":"A165","v":19},{"$f":"'19'!A30","v":0},{"$f":"'19'!B30","v":0},{"$f":"'19'!C30","v":0},{"$f":"'19'!D30","v":0},{"$f":"'19'!E30","v":0},{"$f":"'19'!F30","v":0},{"$f":"'19'!G30","v":0},{"$f":"'19'!H30","v":0},{"$f":"'19'!I30","v":0},{"$f":"'19'!J30","v":0},{"$f":"'19'!K30","v":0}]
[19,{"$f":"'19'!A31","v":0},{"$f":"'19'!B31","v":0},{"$f":"'19'!C31","v":0},{"$f":"'19'!D31","v":0},{"$f":"'19'!E31","v":0},{"$f":"'19'!F31","v":0},{"$f":"'19'!G31","v":0},{"$f":"'19'!H31","v":0},{"$f":"'19'!I31","v":0},{"$f":"'19'!J31","v":0},{"$f":"'19'!K31","v":0}]
[19,{"$f":"'19'!A32","v":0},{"$f":"'19'!B32","v":0},{"$f":"'19'!C32","v":0},{"$f":"'19'!D32","v":0},{"$f":"'19'!E32","v":0},{"$f":"'19'!F32","v":0},{"$f":"'19'!G32","v":0},{"$f":"'19'!H32","v":0},{"$f":"'19'!I32","v":0},{"$f":"'19'!J32","v":0},{"$f":"'19'!K32","v":0}]
[19,{"$f":"'19'!A33","v":0},{"$f":"'19'!B33","v":0},{"$f":"'19'!C33","v":0},{"$f":"'19'!D33","v":0},{"$f":"'19'!E33","v":0},{"$f":"'19'!F33","v":0},{"$f":"'19'!G33","v":0},{"$f":"'19'!H33","v":0},{"$f":"'19'!I33","v":0},{"$f":"'19'!J33","v":0},{"$f":"'19'!K33","v":0}]
[19,{"$f":"'19'!A36","v":0},null,null,null,null,{"$f":"'19'!F36","v":0},{"$f":"'19'!G36","v":0},{"$f":"'19'!E36","v":0},{"$f":"'19'!D36","v":0},{"$f":"'19'!B36","v":0},{"$f":"'19'!C36","v":0}]
[19,{"$f":"'19'!A37","v":0},null,null,null,null,{"$f":"'19'!F37","v":0},{"$f":"'19'!G37","v":0},{"$f":"'19'!E37","v":0},{"$f":"'19'!D37","v":0},{"$f":"'19'!B37","v":0},{"$f":"'19'!C37","v":0}]
[19,{"$f":"'19'!A38","v":0},null,null,null,null,{"$f":"'19'!F38","v":0},{"$f":"'19'!G38","v":0},{"$f":"'19'!E38","v":0},{"$f":"'19'!D38","v":0},{"$f":"'19'!B38","v":0},{"$f":"'19'!C38","v":0}]
[20,{"$f":"'20'!A28","v":0},{"$f":"'20'!B28","v":0},{"$f":"'20'!C28","v":0},{"$f":"'20'!D28","v":0},{"$f":"'20'!E28","v":0},{"$f":"'20'!F28","v":0},{"$f":"'20'!G28","v":0},{"$f":"'20'!H28","v":0},{"$f":"'20'!I28","v":0},{"$f":"'20'!J28","v":0},{"$f":"'20'!K28","v":0},{"$f":"SUM(J173:J181)","v":0}]
[{"$f":"A173","v":20},{"$f":"'20'!A29","v":0},{"$f":"'20'!B29","v":0},{"$f":"'20'!C29","v":0},{"$f":"'20'!D29","v":0},{"$f":"'20'!E29","v":0},{"$f":"'20'!F29","v":0},{"$f":"'20'!G29","v":0},{"$f":"'20'!H29","v":0},{"$f":"'20'!I29","v":0},{"$f":"'20'!J29","v":0},{"$f":"'20'!K29","v":0}]
[{"$f":"A174","v":20},{"$f":"'20'!A30","v":0},{"$f":"'20'!B30","v":0},{"$f":"'20'!C30","v":0},{"$f":"'20'!D30","v":0},{"$f":"'20'!E30","v":0},{"$f":"'20'!F30","v":0},{"$f":"'20'!G30","v":0},{"$f":"'20'!H30","v":0},{"$f":"'20'!I30","v":0},{"$f":"'20'!J30","v":0},{"$f":"'20'!K30","v":0}]
[20,{"$f":"'20'!A31","v":0},{"$f":"'20'!B31","v":0},{"$f":"'20'!C31","v":0},{"$f":"'20'!D31","v":0},{"$f":"'20'!E31","v":0},{"$f":"'20'!F31","v":0},{"$f":"'20'!G31","v":0},{"$f":"'20'!H31","v":0},{"$f":"'20'!I31","v":0},{"$f":"'20'!J31","v":0},{"$f":"'20'!K31","v":0}]
[20,{"$f":"'20'!A32","v":0},{"$f":"'20'!B32","v":0},{"$f":"'20'!C32","v":0},{"$f":"'20'!D32","v":0},{"$f":"'20'!E32","v":0},{"$f":"'20'!F32","v":0},{"$f":"'20'!G32","v":0},{"$f":"'20'!H32","v":0},{"$f":"'20'!I32","v":0},{"$f":"'20'!J32","v":0},{"$f":"'20'!K32","v":0}]
[20,{"$f":"'20'!A33","v":0},{"$f":"'20'!B33","v":0},{"$f":"'20'!C33","v":0},{"$f":"'20'!D33","v":0},{"$f":"'20'!E33","v":0},{"$f":"'20'!F33","v":0},{"$f":"'20'!G33","v":0},{"$f":"'20'!H33","v":0},{"$f":"'20'!I33","v":0},{"$f":"'20'!J33","v":0},{"$f":"'20'!K33","v":0}]
[20,{"$f":"'20'!A36","v":0},null,null,null,null,{"$f":"'20'!F36","v":0},{"$f":"'20'!G36","v":0},{"$f":"'20'!E36","v":0},{"$f":"'20'!D36","v":0},{"$f":"'20'!B36","v":0},{"$f":"'20'!C36","v":0}]
[20,{"$f":"'20'!A37","v":0},null,null,null,null,{"$f":"'20'!F37","v":0},{"$f":"'20'!G37","v":0},{"$f":"'20'!E37","v":0},{"$f":"'20'!D37","v":0},{"$f":"'20'!B37","v":0},{"$f":"'20'!C37","v":0}]
[20,{"$f":"'20'!A38","v":0},null,null,null,null,{"$f":"'20'!F38","v":0},{"$f":"'20'!G38","v":0},{"$f":"'20'!E38","v":0},{"$f":"'20'!D38","v":0},{"$f":"'20'!B38","v":0},{"$f":"'20'!C38","v":0}]
[21,{"$f":"'21'!A28","v":0},{"$f":"'21'!B28","v":0},{"$f":"'21'!C28","v":0},{"$f":"'21'!D28","v":0},{"$f":"'21'!E28","v":0},{"$f":"'21'!F28","v":0},{"$f":"'21'!G28","v":0},{"$f":"'21'!H28","v":0},{"$f":"'21'!I28","v":0},{"$f":"'21'!J28","v":0},{"$f":"'21'!K28","v":0},{"$f":"SUM(J182:J190)","v":0}]
[{"$f":"A182","v":21},{"$f":"'21'!A29","v":0},{"$f":"'21'!B29","v":0},{"$f":"'21'!C29","v":0},{"$f":"'21'!D29","v":0},{"$f":"'21'!E29","v":0},{"$f":"'21'!F29","v":0},{"$f":"'21'!G29","v":0},{"$f":"'21'!H29","v":0},{"$f":"'21'!I29","v":0},{"$f":"'21'!J29","v":0},{"$f":"'21'!K29","v":0}]
[{"$f":"A183","v":21},{"$f":"'21'!A30","v":0},{"$f":"'21'!B30","v":0},{"$f":"'21'!C30","v":0},{"$f":"'21'!D30","v":0},{"$f":"'21'!E30","v":0},{"$f":"'21'!F30","v":0},{"$f":"'21'!G30","v":0},{"$f":"'21'!H30","v":0},{"$f":"'21'!I30","v":0},{"$f":"'21'!J30","v":0},{"$f":"'21'!K30","v":0}]
[21,{"$f":"'21'!A31","v":0},{"$f":"'21'!B31","v":0},{"$f":"'21'!C31","v":0},{"$f":"'21'!D31","v":0},{"$f":"'21'!E31","v":0},{"$f":"'21'!F31","v":0},{"$f":"'21'!G31","v":0},{"$f":"'21'!H31","v":0},{"$f":"'21'!I31","v":0},{"$f":"'21'!J31","v":0},{"$f":"'21'!K31","v":0}]
[21,{"$f":"'21'!A32","v":0},{"$f":"'21'!B32","v":0},{"$f":"'21'!C32","v":0},{"$f":"'21'!D32","v":0},{"$f":"'21'!E32","v":0},{"$f":"'21'!F32","v":0},{"$f":"'21'!G32","v":0},{"$f":"'21'!H32","v":0},{"$f":"'21'!I32","v":0},{"$f":"'21'!J32","v":0},{"$f":"'21'!K32","v":0}]
[21,{"$f":"'21'!A33","v":0},{"$f":"'21'!B33","v":0},{"$f":"'21'!C33","v":0},{"$f":"'21'!D33","v":0},{"$f":"'21'!E33","v":0},{"$f":"'21'!F33","v":0},{"$f":"'21'!G33","v":0},{"$f":"'21'!H33","v":0},{"$f":"'21'!I33","v":0},{"$f":"'21'!J33","v":0},{"$f":"'21'!K33","v":0}]
[21,{"$f":"'21'!A36","v":0},null,null,null,null,{"$f":"'21'!F36","v":0},{"$f":"'21'!G36","v":0},{"$f":"'21'!E36","v":0},{"$f":"'21'!D36","v":0},{"$f":"'21'!B36","v":0},{"$f":"'21'!C36","v":0}]
[21,{"$f":"'21'!A37","v":0},null,null,null,null,{"$f":"'21'!F37","v":0},{"$f":"'21'!G37","v":0},{"$f":"'21'!E37","v":0},{"$f":"'21'!D37","v":0},{"$f":"'21'!B37","v":0},{"$f":"'21'!C37","v":0}]
[21,{"$f":"'21'!A38","v":0},null,null,null,null,{"$f":"'21'!F38","v":0},{"$f":"'21'!G38","v":0},{"$f":"'21'!E38","v":0},{"$f":"'21'!D38","v":0},{"$f":"'21'!B38","v":0},{"$f":"'21'!C38","v":0}]
[22,{"$f":"'22'!A28","v":0},{"$f":"'22'!B28","v":0},{"$f":"'22'!C28","v":0},{"$f":"'22'!D28","v":0},{"$f":"'22'!E28","v":0},{"$f":"'22'!F28","v":0},{"$f":"'22'!G28","v":0},{"$f":"'22'!H28","v":0},{"$f":"'22'!I28","v":0},{"$f":"'22'!J28","v":0},{"$f":"'22'!K28","v":0},{"$f":"SUM(J191:J199)","v":0}]
[{"$f":"A191","v":22},{"$f":"'22'!A29","v":0},{"$f":"'22'!B29","v":0},{"$f":"'22'!C29","v":0},{"$f":"'22'!D29","v":0},{"$f":"'22'!E29","v":0},{"$f":"'22'!F29","v":0},{"$f":"'22'!G29","v":0},{"$f":"'22'!H29","v":0},{"$f":"'22'!I29","v":0},{"$f":"'22'!J29","v":0},{"$f":"'22'!K29","v":0}]
[{"$f":"A192","v":22},{"$f":"'22'!A30","v":0},{"$f":"'22'!B30","v":0},{"$f":"'22'!C30","v":0},{"$f":"'22'!D30","v":0},{"$f":"'22'!E30","v":0},{"$f":"'22'!F30","v":0},{"$f":"'22'!G30","v":0},{"$f":"'22'!H30","v":0},{"$f":"'22'!I30","v":0},{"$f":"'22'!J30","v":0},{"$f":"'22'!K30","v":0}]
[22,{"$f":"'22'!A31","v":0},{"$f":"'22'!B31","v":0},{"$f":"'22'!C31","v":0},{"$f":"'22'!D31","v":0},{"$f":"'22'!E31","v":0},{"$f":"'22'!F31","v":0},{"$f":"'22'!G31","v":0},{"$f":"'22'!H31","v":0},{"$f":"'22'!I31","v":0},{"$f":"'22'!J31","v":0},{"$f":"'22'!K31","v":0}]
[22,{"$f":"'22'!A32","v":0},{"$f":"'22'!B32","v":0},{"$f":"'22'!C32","v":0},{"$f":"'22'!D32","v":0},{"$f":"'22'!E32","v":0},{"$f":"'22'!F32","v":0},{"$f":"'22'!G32","v":0},{"$f":"'22'!H32","v":0},{"$f":"'22'!I32","v":0},{"$f":"'22'!J32","v":0},{"$f":"'22'!K32","v":0}]
[22,{"$f":"'22'!A33","v":0},{"$f":"'22'!B33","v":0},{"$f":"'22'!C33","v":0},{"$f":"'22'!D33","v":0},{"$f":"'22'!E33","v":0},{"$f":"'22'!F33","v":0},{"$f":"'22'!G33","v":0},{"$f":"'22'!H33","v":0},{"$f":"'22'!I33","v":0},{"$f":"'22'!J33","v":0},{"$f":"'22'!K33","v":0}]
[22,{"$f":"'22'!A36","v":0},null,null,null,null,{"$f":"'22'!F36","v":0},{"$f":"'22'!G36","v":0},{"$f":"'22'!E36","v":0},{"$f":"'22'!D36","v":0},{"$f":"'22'!B36","v":0},{"$f":"'22'!C36","v":0}]
[22,{"$f":"'22'!A37","v":0},null,null,null,null,{"$f":"'22'!F37","v":0},{"$f":"'22'!G37","v":0},{"$f":"'22'!E37","v":0},{"$f":"'22'!D37","v":0},{"$f":"'22'!B37","v":0},{"$f":"'22'!C37","v":0}]
[22,{"$f":"'22'!A38","v":0},null,null,null,null,{"$f":"'22'!F38","v":0},{"$f":"'22'!G38","v":0},{"$f":"'22'!E38","v":0},{"$f":"'22'!D38","v":0},{"$f":"'22'!B38","v":0},{"$f":"'22'!C38","v":0}]
[23,{"$f":"'23'!A28","v":0},{"$f":"'23'!B28","v":0},{"$f":"'23'!C28","v":0},{"$f":"'23'!D28","v":0},{"$f":"'23'!E28","v":0},{"$f":"'23'!F28","v":0},{"$f":"'23'!G28","v":0},{"$f":"'23'!H28","v":0},{"$f":"'23'!I28","v":0},{"$f":"'23'!J28","v":0},{"$f":"'23'!K28","v":0},{"$f":"SUM(J200:J208)","v":0}]
[{"$f":"A200","v":23},{"$f":"'23'!A29","v":0},{"$f":"'23'!B29","v":0},{"$f":"'23'!C29","v":0},{"$f":"'23'!D29","v":0},{"$f":"'23'!E29","v":0},{"$f":"'23'!F29","v":0},{"$f":"'23'!G29","v":0},{"$f":"'23'!H29","v":0},{"$f":"'23'!I29","v":0},{"$f":"'23'!J29","v":0},{"$f":"'23'!K29","v":0}]
[{"$f":"A201","v":23},{"$f":"'23'!A30","v":0},{"$f":"'23'!B30","v":0},{"$f":"'23'!C30","v":0},{"$f":"'23'!D30","v":0},{"$f":"'23'!E30","v":0},{"$f":"'23'!F30","v":0},{"$f":"'23'!G30","v":0},{"$f":"'23'!H30","v":0},{"$f":"'23'!I30","v":0},{"$f":"'23'!J30","v":0},{"$f":"'23'!K30","v":0}]
[23,{"$f":"'23'!A31","v":0},{"$f":"'23'!B31","v":0},{"$f":"'23'!C31","v":0},{"$f":"'23'!D31","v":0},{"$f":"'23'!E31","v":0},{"$f":"'23'!F31","v":0},{"$f":"'23'!G31","v":0},{"$f":"'23'!H31","v":0},{"$f":"'23'!I31","v":0},{"$f":"'23'!J31","v":0},{"$f":"'23'!K31","v":0}]
[23,{"$f":"'23'!A32","v":0},{"$f":"'23'!B32","v":0},{"$f":"'23'!C32","v":0},{"$f":"'23'!D32","v":0},{"$f":"'23'!E32","v":0},{"$f":"'23'!F32","v":0},{"$f":"'23'!G32","v":0},{"$f":"'23'!H32","v":0},{"$f":"'23'!I32","v":0},{"$f":"'23'!J32","v":0},{"$f":"'23'!K32","v":0}]
[23,{"$f":"'23'!A33","v":0},{"$f":"'23'!B33","v":0},{"$f":"'23'!C33","v":0},{"$f":"'23'!D33","v":0},{"$f":"'23'!E33","v":0},{"$f":"'23'!F33","v":0},{"$f":"'23'!G33","v":0},{"$f":"'23'!H33","v":0},{"$f":"'23'!I33","v":0},{"$f":"'23'!J33","v":0},{"$f":"'23'!K33","v":0}]
[23,{"$f":"'23'!A36","v":0},null,null,null,null,{"$f":"'23'!F36","v":0},{"$f":"'23'!G36","v":0},{"$f":"'23'!E36","v":0},{"$f":"'23'!D36","v":0},{"$f":"'23'!B36","v":0},{"$f":"'23'!C36","v":0}]
[23,{"$f":"'23'!A37","v":0},null,null,null,null,{"$f":"'23'!F37","v":0},{"$f":"'23'!G37","v":0},{"$f":"'23'!E37","v":0},{"$f":"'23'!D37","v":0},{"$f":"'23'!B37","v":0},{"$f":"'23'!C37","v":0}]
[23,{"$f":"'23'!A38","v":0},null,null,null,null,{"$f":"'23'!F38","v":0},{"$f":"'23'!G38","v":0},{"$f":"'23'!E38","v":0},{"$f":"'23'!D38","v":0},{"$f":"'23'!B38","v":0},{"$f":"'23'!C38","v":0}]
[24,{"$f":"'24'!A28","v":0},{"$f":"'24'!B28","v":0},{"$f":"'24'!C28","v":0},{"$f":"'24'!D28","v":0},{"$f":"'24'!E28","v":0},{"$f":"'24'!F28","v":0},{"$f":"'24'!G28","v":0},{"$f":"'24'!H28","v":0},{"$f":"'24'!I28","v":0},{"$f":"'24'!J28","v":0},{"$f":"'24'!K28","v":0},{"$f":"SUM(J209:J217)","v":0}]
[{"$f":"A209","v":24},{"$f":"'24'!A29","v":0},{"$f":"'24'!B29","v":0},{"$f":"'24'!C29","v":0},{"$f":"'24'!D29","v":0},{"$f":"'24'!E29","v":0},{"$f":"'24'!F29","v":0},{"$f":"'24'!G29","v":0},{"$f":"'24'!H29","v":0},{"$f":"'24'!I29","v":0},{"$f":"'24'!J29","v":0},{"$f":"'24'!K29","v":0}]
[{"$f":"A210","v":24},{"$f":"'24'!A30","v":0},{"$f":"'24'!B30","v":0},{"$f":"'24'!C30","v":0},{"$f":"'24'!D30","v":0},{"$f":"'24'!E30","v":0},{"$f":"'24'!F30","v":0},{"$f":"'24'!G30","v":0},{"$f":"'24'!H30","v":0},{"$f":"'24'!I30","v":0},{"$f":"'24'!J30","v":0},{"$f":"'24'!K30","v":0}]
[24,{"$f":"'24'!A31","v":0},{"$f":"'24'!B31","v":0},{"$f":"'24'!C31","v":0},{"$f":"'24'!D31","v":0},{"$f":"'24'!E31","v":0},{"$f":"'24'!F31","v":0},{"$f":"'24'!G31","v":0},{"$f":"'24'!H31","v":0},{"$f":"'24'!I31","v":0},{"$f":"'24'!J31","v":0},{"$f":"'24'!K31","v":0}]
[24,{"$f":"'24'!A32","v":0},{"$f":"'24'!B32","v":0},{"$f":"'24'!C32","v":0},{"$f":"'24'!D32","v":0},{"$f":"'24'!E32","v":0},{"$f":"'24'!F32","v":0},{"$f":"'24'!G32","v":0},{"$f":"'24'!H32","v":0},{"$f":"'24'!I32","v":0},{"$f":"'24'!J32","v":0},{"$f":"'24'!K32","v":0}]
[24,{"$f":"'24'!A33","v":0},{"$f":"'24'!B33","v":0},{"$f":"'24'!C33","v":0},{"$f":"'24'!D33","v":0},{"$f":"'24'!E33","v":0},{"$f":"'24'!F33","v":0},{"$f":"'24'!G33","v":0},{"$f":"'24'!H33","v":0},{"$f":"'24'!I33","v":0},{"$f":"'24'!J33","v":0},{"$f":"'24'!K33","v":0}]
[24,{"$f":"'24'!A36","v":0},null,null,null,null,{"$f":"'24'!F36","v":0},{"$f":"'24'!G36","v":0},{"$f":"'24'!E36","v":0},{"$f":"'24'!D36","v":0},{"$f":"'24'!B36","v":0},{"$f":"'24'!C36","v":0}]
[24,{"$f":"'24'!A37","v":0},null,null,null,null,{"$f":"'24'!F37","v":0},{"$f":"'24'!G37","v":0},{"$f":"'24'!E37","v":0},{"$f":"'24'!D37","v":0},{"$f":"'24'!B37","v":0},{"$f":"'24'!C37","v":0}]
[24,{"$f":"'24'!A38","v":0},null,null,null,null,{"$f":"'24'!F38","v":0},{"$f":"'24'!G38","v":0},{"$f":"'24'!E38","v":0},{"$f":"'24'!D38","v":0},{"$f":"'24'!B38","v":0},{"$f":"'24'!C38","v":0}]
[25,{"$f":"'25'!A28","v":0},{"$f":"'25'!B28","v":0},{"$f":"'25'!C28","v":0},{"$f":"'25'!D28","v":0},{"$f":"'25'!E28","v":0},{"$f":"'25'!F28","v":0},{"$f":"'25'!G28","v":0},{"$f":"'25'!H28","v":0},{"$f":"'25'!I28","v":0},{"$f":"'25'!J28","v":0},{"$f":"'25'!K28","v":0},{"$f":"SUM(J218:J226)","v":0}]
[{"$f":"A218","v":25},{"$f":"'25'!A29","v":0},{"$f":"'25'!B29","v":0},{"$f":"'25'!C29","v":0},{"$f":"'25'!D29","v":0},{"$f":"'25'!E29","v":0},{"$f":"'25'!F29","v":0},{"$f":"'25'!G29","v":0},{"$f":"'25'!H29","v":0},{"$f":"'25'!I29","v":0},{"$f":"'25'!J29","v":0},{"$f":"'25'!K29","v":0}]
[{"$f":"A219","v":25},{"$f":"'25'!A30","v":0},{"$f":"'25'!B30","v":0},{"$f":"'25'!C30","v":0},{"$f":"'25'!D30","v":0},{"$f":"'25'!E30","v":0},{"$f":"'25'!F30","v":0},{"$f":"'25'!G30","v":0},{"$f":"'25'!H30","v":0},{"$f":"'25'!I30","v":0},{"$f":"'25'!J30","v":0},{"$f":"'25'!K30","v":0}]
[25,{"$f":"'25'!A31","v":0},{"$f":"'25'!B31","v":0},{"$f":"'25'!C31","v":0},{"$f":"'25'!D31","v":0},{"$f":"'25'!E31","v":0},{"$f":"'25'!F31","v":0},{"$f":"'25'!G31","v":0},{"$f":"'25'!H31","v":0},{"$f":"'25'!I31","v":0},{"$f":"'25'!J31","v":0},{"$f":"'25'!K31","v":0}]
[25,{"$f":"'25'!A32","v":0},{"$f":"'25'!B32","v":0},{"$f":"'25'!C32","v":0},{"$f":"'25'!D32","v":0},{"$f":"'25'!E32","v":0},{"$f":"'25'!F32","v":0},{"$f":"'25'!G32","v":0},{"$f":"'25'!H32","v":0},{"$f":"'25'!I32","v":0},{"$f":"'25'!J32","v":0},{"$f":"'25'!K32","v":0}]
[25,{"$f":"'25'!A33","v":0},{"$f":"'25'!B33","v":0},{"$f":"'25'!C33","v":0},{"$f":"'25'!D33","v":0},{"$f":"'25'!E33","v":0},{"$f":"'25'!F33","v":0},{"$f":"'25'!G33","v":0},{"$f":"'25'!H33","v":0},{"$f":"'25'!I33","v":0},{"$f":"'25'!J33","v":0},{"$f":"'25'!K33","v":0}]
[25,{"$f":"'25'!A36","v":0},null,null,null,null,{"$f":"'25'!F36","v":0},{"$f":"'25'!G36","v":0},{"$f":"'25'!E36","v":0},{"$f":"'25'!D36","v":0},{"$f":"'25'!B36","v":0},{"$f":"'25'!C36","v":0}]
[25,{"$f":"'25'!A37","v":0},null,null,null,null,{"$f":"'25'!F37","v":0},{"$f":"'25'!G37","v":0},{"$f":"'25'!E37","v":0},{"$f":"'25'!D37","v":0},{"$f":"'25'!B37","v":0},{"$f":"'25'!C37","v":0}]
[25,{"$f":"'25'!A38","v":0},null,null,null,null,{"$f":"'25'!F38","v":0},{"$f":"'25'!G38","v":0},{"$f":"'25'!E38","v":0},{"$f":"'25'!D38","v":0},{"$f":"'25'!B38","v":0},{"$f":"'25'!C38","v":0}]
[26,{"$f":"'26'!A28","v":0},{"$f":"'26'!B28","v":0},{"$f":"'26'!C28","v":0},{"$f":"'26'!D28","v":0},{"$f":"'26'!E28","v":0},{"$f":"'26'!F28","v":0},{"$f":"'26'!G28","v":0},{"$f":"'26'!H28","v":0},{"$f":"'26'!I28","v":0},{"$f":"'26'!J28","v":0},{"$f":"'26'!K28","v":0},{"$f":"SUM(J227:J235)","v":0}]
[{"$f":"A227","v":26},{"$f":"'26'!A29","v":0},{"$f":"'26'!B29","v":0},{"$f":"'26'!C29","v":0},{"$f":"'26'!D29","v":0},{"$f":"'26'!E29","v":0},{"$f":"'26'!F29","v":0},{"$f":"'26'!G29","v":0},{"$f":"'26'!H29","v":0},{"$f":"'26'!I29","v":0},{"$f":"'26'!J29","v":0},{"$f":"'26'!K29","v":0}]
[{"$f":"A228","v":26},{"$f":"'26'!A30","v":0},{"$f":"'26'!B30","v":0},{"$f":"'26'!C30","v":0},{"$f":"'26'!D30","v":0},{"$f":"'26'!E30","v":0},{"$f":"'26'!F30","v":0},{"$f":"'26'!G30","v":0},{"$f":"'26'!H30","v":0},{"$f":"'26'!I30","v":0},{"$f":"'26'!J30","v":0},{"$f":"'26'!K30","v":0}]
[26,{"$f":"'26'!A31","v":0},{"$f":"'26'!B31","v":0},{"$f":"'26'!C31","v":0},{"$f":"'26'!D31","v":0},{"$f":"'26'!E31","v":0},{"$f":"'26'!F31","v":0},{"$f":"'26'!G31","v":0},{"$f":"'26'!H31","v":0},{"$f":"'26'!I31","v":0},{"$f":"'26'!J31","v":0},{"$f":"'26'!K31","v":0}]
[26,{"$f":"'26'!A32","v":0},{"$f":"'26'!B32","v":0},{"$f":"'26'!C32","v":0},{"$f":"'26'!D32","v":0},{"$f":"'26'!E32","v":0},{"$f":"'26'!F32","v":0},{"$f":"'26'!G32","v":0},{"$f":"'26'!H32","v":0},{"$f":"'26'!I32","v":0},{"$f":"'26'!J32","v":0},{"$f":"'26'!K32","v":0}]
[26,{"$f":"'26'!A33","v":0},{"$f":"'26'!B33","v":0},{"$f":"'26'!C33","v":0},{"$f":"'26'!D33","v":0},{"$f":"'26'!E33","v":0},{"$f":"'26'!F33","v":0},{"$f":"'26'!G33","v":0},{"$f":"'26'!H33","v":0},{"$f":"'26'!I33","v":0},{"$f":"'26'!J33","v":0},{"$f":"'26'!K33","v":0}]
[26,{"$f":"'26'!A36","v":0},null,null,null,null,{"$f":"'26'!F36","v":0},{"$f":"'26'!G36","v":0},{"$f":"'26'!E36","v":0},{"$f":"'26'!D36","v":0},{"$f":"'26'!B36","v":0},{"$f":"'26'!C36","v":0}]
[26,{"$f":"'26'!A37","v":0},null,null,null,null,{"$f":"'26'!F37","v":0},{"$f":"'26'!G37","v":0},{"$f":"'26'!E37","v":0},{"$f":"'26'!D37","v":0},{"$f":"'26'!B37","v":0},{"$f":"'26'!C37","v":0}]
[26,{"$f":"'26'!A38","v":0},null,null,null,null,{"$f":"'26'!F38","v":0},{"$f":"'26'!G38","v":0},{"$f":"'26'!E38","v":0},{"$f":"'26'!D38","v":0},{"$f":"'26'!B38","v":0},{"$f":"'26'!C38","v":0}]
[28,{"$f":"'28'!A28","v":0},{"$f":"'28'!B28","v":0},{"$f":"'28'!C28","v":0},{"$f":"'28'!D28","v":0},{"$f":"'28'!E28","v":0},{"$f":"'28'!F28","v":0},{"$f":"'28'!G28","v":0},{"$f":"'28'!H28","v":0},{"$f":"'28'!I28","v":0},{"$f":"'28'!J28","v":0},{"$f":"'28'!K28","v":0},{"$f":"SUM(J236:J244)","v":0}]
[{"$f":"A236","v":28},{"$f":"'28'!A29","v":0},{"$f":"'28'!B29","v":0},{"$f":"'28'!C29","v":0},{"$f":"'28'!D29","v":0},{"$f":"'28'!E29","v":0},{"$f":"'28'!F29","v":0},{"$f":"'28'!G29","v":0},{"$f":"'28'!H29","v":0},{"$f":"'28'!I29","v":0},{"$f":"'28'!J29","v":0},{"$f":"'28'!K29","v":0}]
[{"$f":"A237","v":28},{"$f":"'28'!A30","v":0},{"$f":"'28'!B30","v":0},{"$f":"'28'!C30","v":0},{"$f":"'28'!D30","v":0},{"$f":"'28'!E30","v":0},{"$f":"'28'!F30","v":0},{"$f":"'28'!G30","v":0},{"$f":"'28'!H30","v":0},{"$f":"'28'!I30","v":0},{"$f":"'28'!J30","v":0},{"$f":"'28'!K30","v":0}]
[28,{"$f":"'28'!A31","v":0},{"$f":"'28'!B31","v":0},{"$f":"'28'!C31","v":0},{"$f":"'28'!D31","v":0},{"$f":"'28'!E31","v":0},{"$f":"'28'!F31","v":0},{"$f":"'28'!G31","v":0},{"$f":"'28'!H31","v":0},{"$f":"'28'!I31","v":0},{"$f":"'28'!J31","v":0},{"$f":"'28'!K31","v":0}]
[28,{"$f":"'28'!A32","v":0},{"$f":"'28'!B32","v":0},{"$f":"'28'!C32","v":0},{"$f":"'28'!D32","v":0},{"$f":"'28'!E32","v":0},{"$f":"'28'!F32","v":0},{"$f":"'28'!G32","v":0},{"$f":"'28'!H32","v":0},{"$f":"'28'!I32","v":0},{"$f":"'28'!J32","v":0},{"$f":"'28'!K32","v":0}]
[28,{"$f":"'28'!A33","v":0},{"$f":"'28'!B33","v":0},{"$f":"'28'!C33","v":0},{"$f":"'28'!D33","v":0},{"$f":"'28'!E33","v":0},{"$f":"'28'!F33","v":0},{"$f":"'28'!G33","v":0},{"$f":"'28'!H33","v":0},{"$f":"'28'!I33","v":0},{"$f":"'28'!J33","v":0},{"$f":"'28'!K33","v":0}]
[28,{"$f":"'28'!A36","v":0},null,null,null,null,{"$f":"'28'!F36","v":0},{"$f":"'28'!G36","v":0},{"$f":"'28'!E36","v":0},{"$f":"'28'!D36","v":0},{"$f":"'28'!B36","v":0},{"$f":"'28'!C36","v":0}]
[28,{"$f":"'28'!A37","v":0},null,null,null,null,{"$f":"'28'!F37","v":0},{"$f":"'28'!G37","v":0},{"$f":"'28'!E37","v":0},{"$f":"'28'!D37","v":0},{"$f":"'28'!B37","v":0},{"$f":"'28'!C37","v":0}]
[28,{"$f":"'28'!A38","v":0},null,null,null,null,{"$f":"'28'!F38","v":0},{"$f":"'28'!G38","v":0},{"$f":"'28'!E38","v":0},{"$f":"'28'!D38","v":0},{"$f":"'28'!B38","v":0},{"$f":"'28'!C38","v":0}]
[29,{"$f":"'29'!A28","v":0},{"$f":"'29'!B28","v":0},{"$f":"'29'!C28","v":0},{"$f":"'29'!D28","v":0},{"$f":"'29'!E28","v":0},{"$f":"'29'!F28","v":0},{"$f":"'29'!G28","v":0},{"$f":"'29'!H28","v":0},{"$f":"'29'!I28","v":0},{"$f":"'29'!J28","v":0},{"$f":"'29'!K28","v":0},{"$f":"SUM(J245:J253)","v":0}]
[{"$f":"A245","v":29},{"$f":"'29'!A29","v":0},{"$f":"'29'!B29","v":0},{"$f":"'29'!C29","v":0},{"$f":"'29'!D29","v":0},{"$f":"'29'!E29","v":0},{"$f":"'29'!F29","v":0},{"$f":"'29'!G29","v":0},{"$f":"'29'!H29","v":0},{"$f":"'29'!I29","v":0},{"$f":"'29'!J29","v":0},{"$f":"'29'!K29","v":0}]
[{"$f":"A246","v":29},{"$f":"'29'!A30","v":0},{"$f":"'29'!B30","v":0},{"$f":"'29'!C30","v":0},{"$f":"'29'!D30","v":0},{"$f":"'29'!E30","v":0},{"$f":"'29'!F30","v":0},{"$f":"'29'!G30","v":0},{"$f":"'29'!H30","v":0},{"$f":"'29'!I30","v":0},{"$f":"'29'!J30","v":0},{"$f":"'29'!K30","v":0}]
[29,{"$f":"'29'!A31","v":0},{"$f":"'29'!B31","v":0},{"$f":"'29'!C31","v":0},{"$f":"'29'!D31","v":0},{"$f":"'29'!E31","v":0},{"$f":"'29'!F31","v":0},{"$f":"'29'!G31","v":0},{"$f":"'29'!H31","v":0},{"$f":"'29'!I31","v":0},{"$f":"'29'!J31","v":0},{"$f":"'29'!K31","v":0}]
[29,{"$f":"'29'!A32","v":0},{"$f":"'29'!B32","v":0},{"$f":"'29'!C32","v":0},{"$f":"'29'!D32","v":0},{"$f":"'29'!E32","v":0},{"$f":"'29'!F32","v":0},{"$f":"'29'!G32","v":0},{"$f":"'29'!H32","v":0},{"$f":"'29'!I32","v":0},{"$f":"'29'!J32","v":0},{"$f":"'29'!K32","v":0}]
[29,{"$f":"'29'!A33","v":0},{"$f":"'29'!B33","v":0},{"$f":"'29'!C33","v":0},{"$f":"'29'!D33","v":0},{"$f":"'29'!E33","v":0},{"$f":"'29'!F33","v":0},{"$f":"'29'!G33","v":0},{"$f":"'29'!H33","v":0},{"$f":"'29'!I33","v":0},{"$f":"'29'!J33","v":0},{"$f":"'29'!K33","v":0}]
[29,{"$f":"'29'!A36","v":0},null,null,null,null,{"$f":"'29'!F36","v":0},{"$f":"'29'!G36","v":0},{"$f":"'29'!E36","v":0},{"$f":"'29'!D36","v":0},{"$f":"'29'!B36","v":0},{"$f":"'29'!C36","v":0}]
[29,{"$f":"'29'!A37","v":0},null,null,null,null,{"$f":"'29'!F37","v":0},{"$f":"'29'!G37","v":0},{"$f":"'29'!E37","v":0},{"$f":"'29'!D37","v":0},{"$f":"'29'!B37","v":0},{"$f":"'29'!C37","v":0}]
[29,{"$f":"'29'!A38","v":0},null,null,null,null,{"$f":"'29'!F38","v":0},{"$f":"'29'!G38","v":0},{"$f":"'29'!E38","v":0},{"$f":"'29'!D38","v":0},{"$f":"'29'!B38","v":0},{"$f":"'29'!C38","v":0}]
[30,{"$f":"'30'!A28","v":0},{"$f":"'30'!B28","v":0},{"$f":"'30'!C28","v":0},{"$f":"'30'!D28","v":0},{"$f":"'30'!E28","v":0},{"$f":"'30'!F28","v":0},{"$f":"'30'!G28","v":0},{"$f":"'30'!H28","v":0},{"$f":"'30'!I28","v":0},{"$f":"'30'!J28","v":0},{"$f":"'30'!K28","v":0},{"$f":"SUM(J254:J262)","v":0}]
[{"$f":"A254","v":30},{"$f":"'30'!A29","v":0},{"$f":"'30'!B29","v":0},{"$f":"'30'!C29","v":0},{"$f":"'30'!D29","v":0},{"$f":"'30'!E29","v":0},{"$f":"'30'!F29","v":0},{"$f":"'30'!G29","v":0},{"$f":"'30'!H29","v":0},{"$f":"'30'!I29","v":0},{"$f":"'30'!J29","v":0},{"$f":"'30'!K29","v":0}]
[{"$f":"A255","v":30},{"$f":"'30'!A30","v":0},{"$f":"'30'!B30","v":0},{"$f":"'30'!C30","v":0},{"$f":"'30'!D30","v":0},{"$f":"'30'!E30","v":0},{"$f":"'30'!F30","v":0},{"$f":"'30'!G30","v":0},{"$f":"'30'!H30","v":0},{"$f":"'30'!I30","v":0},{"$f":"'30'!J30","v":0},{"$f":"'30'!K30","v":0}]
[30,{"$f":"'30'!A31","v":0},{"$f":"'30'!B31","v":0},{"$f":"'30'!C31","v":0},{"$f":"'30'!D31","v":0},{"$f":"'30'!E31","v":0},{"$f":"'30'!F31","v":0},{"$f":"'30'!G31","v":0},{"$f":"'30'!H31","v":0},{"$f":"'30'!I31","v":0},{"$f":"'30'!J31","v":0},{"$f":"'30'!K31","v":0}]
[30,{"$f":"'30'!A32","v":0},{"$f":"'30'!B32","v":0},{"$f":"'30'!C32","v":0},{"$f":"'30'!D32","v":0},{"$f":"'30'!E32","v":0},{"$f":"'30'!F32","v":0},{"$f":"'30'!G32","v":0},{"$f":"'30'!H32","v":0},{"$f":"'30'!I32","v":0},{"$f":"'30'!J32","v":0},{"$f":"'30'!K32","v":0}]
[30,{"$f":"'30'!A33","v":0},{"$f":"'30'!B33","v":0},{"$f":"'30'!C33","v":0},{"$f":"'30'!D33","v":0},{"$f":"'30'!E33","v":0},{"$f":"'30'!F33","v":0},{"$f":"'30'!G33","v":0},{"$f":"'30'!H33","v":0},{"$f":"'30'!I33","v":0},{"$f":"'30'!J33","v":0},{"$f":"'30'!K33","v":0}]
[30,{"$f":"'30'!A36","v":0},null,null,null,null,{"$f":"'30'!F36","v":0},{"$f":"'30'!G36","v":0},{"$f":"'30'!E36","v":0},{"$f":"'30'!D36","v":0},{"$f":"'30'!B36","v":0},{"$f":"'30'!C36","v":0}]
[30,{"$f":"'30'!A37","v":0},null,null,null,null,{"$f":"'30'!F37","v":0},{"$f":"'30'!G37","v":0},{"$f":"'30'!E37","v":0},{"$f":"'30'!D37","v":0},{"$f":"'30'!B37","v":0},{"$f":"'30'!C37","v":0}]
[30,{"$f":"'30'!A38","v":0},null,null,null,null,{"$f":"'30'!F38","v":0},{"$f":"'30'!G38","v":0},{"$f":"'30'!E38","v":0},{"$f":"'30'!D38","v":0},{"$f":"'30'!B38","v":0},{"$f":"'30'!C38","v":0}]
[31,{"$f":"'31'!A28","v":0},{"$f":"'31'!B28","v":0},{"$f":"'31'!C28","v":0},{"$f":"'31'!D28","v":0},{"$f":"'31'!E28","v":0},{"$f":"'31'!F28","v":0},{"$f":"'31'!G28","v":0},{"$f":"'31'!H28","v":0},{"$f":"'31'!I28","v":0},{"$f":"'31'!J28","v":0},{"$f":"'31'!K28","v":0},{"$f":"SUM(J263:J271)","v":0}]
[{"$f":"A263","v":31},{"$f":"'31'!A29","v":0},{"$f":"'31'!B29","v":0},{"$f":"'31'!C29","v":0},{"$f":"'31'!D29","v":0},{"$f":"'31'!E29","v":0},{"$f":"'31'!F29","v":0},{"$f":"'31'!G29","v":0},{"$f":"'31'!H29","v":0},{"$f":"'31'!I29","v":0},{"$f":"'31'!J29","v":0},{"$f":"'31'!K29","v":0}]
[{"$f":"A264","v":31},{"$f":"'31'!A30","v":0},{"$f":"'31'!B30","v":0},{"$f":"'31'!C30","v":0},{"$f":"'31'!D30","v":0},{"$f":"'31'!E30","v":0},{"$f":"'31'!F30","v":0},{"$f":"'31'!G30","v":0},{"$f":"'31'!H30","v":0},{"$f":"'31'!I30","v":0},{"$f":"'31'!J30","v":0},{"$f":"'31'!K30","v":0}]
[31,{"$f":"'31'!A31","v":0},{"$f":"'31'!B31","v":0},{"$f":"'31'!C31","v":0},{"$f":"'31'!D31","v":0},{"$f":"'31'!E31","v":0},{"$f":"'31'!F31","v":0},{"$f":"'31'!G31","v":0},{"$f":"'31'!H31","v":0},{"$f":"'31'!I31","v":0},{"$f":"'31'!J31","v":0},{"$f":"'31'!K31","v":0}]
[31,{"$f":"'31'!A32","v":0},{"$f":"'31'!B32","v":0},{"$f":"'31'!C32","v":0},{"$f":"'31'!D32","v":0},{"$f":"'31'!E32","v":0},{"$f":"'31'!F32","v":0},{"$f":"'31'!G32","v":0},{"$f":"'31'!H32","v":0},{"$f":"'31'!I32","v":0},{"$f":"'31'!J32","v":0},{"$f":"'31'!K32","v":0}]
[31,{"$f":"'31'!A33","v":0},{"$f":"'31'!B33","v":0},{"$f":"'31'!C33","v":0},{"$f":"'31'!D33","v":0},{"$f":"'31'!E33","v":0},{"$f":"'31'!F33","v":0},{"$f":"'31'!G33","v":0},{"$f":"'31'!H33","v":0},{"$f":"'31'!I33","v":0},{"$f":"'31'!J33","v":0},{"$f":"'31'!K33","v":0}]
[31,{"$f":"'31'!A36","v":0},null,null,null,null,{"$f":"'31'!F36","v":0},{"$f":"'31'!G36","v":0},{"$f":"'31'!E36","v":0},{"$f":"'31'!D36","v":0},{"$f":"'31'!B36","v":0},{"$f":"'31'!C36","v":0}]
[31,{"$f":"'31'!A37","v":0},null,null,null,null,{"$f":"'31'!F37","v":0},{"$f":"'31'!G37","v":0},{"$f":"'31'!E37","v":0},{"$f":"'31'!D37","v":0},{"$f":"'31'!B37","v":0},{"$f":"'31'!C37","v":0}]
[31,{"$f":"'31'!A38","v":0},null,null,null,null,{"$f":"'31'!F38","v":0},{"$f":"'31'!G38","v":0},{"$f":"'31'!E38","v":0},{"$f":"'31'!D38","v":0},{"$f":"'31'!B38","v":0},{"$f":"'31'!C38","v":0}]
[]
[]
[]
[null,"TOTAUX",null,null,null,null,null,null,null,{"$f":"SUM(J2:J272)","v":1248}]

{"sheet":"RECAP MOIS PRODUCTION","index":35,"n_rows":40,"n_cols":28,"rows_kept":40,"cut":false,"hidden":false,"merged":[[2,0,4,26]]}
[null,null,"debit théorique t/h",null,250,null,null,null,230,null,null,null,150]
[null,0,"a","b","c=b/a",null,null,"f","g=b/f","h=f*g/(i1*0)","i","j","k=j/i","l","m","n","o","p\n0/4 N","q","r","s","t","u","v","w","x","y","z"]
["RECAPITULATIF PRODUCTION DU MOIS"]
[]
[]
["JOUR","heures de prod prévues","Primaire Plaine\nheure de fonction","Primaire Plaine\ntonnes","DEBIT","trs","Bascule Tunnel\nheures de fonction.","Tunnel Bascule\ntonnes ","DEBIT","trs","concassés\nheures de fonct","concassés\ntonnes produites","debit","trs","Roulés\nfab\n0/4SCL","Roulés\nfab\nM 0/16","Roulés\nfab\nM 0/8","PROD\n0/4 N","PROD\n4/8R","PROD\n8/16R","PROD\n11/22R","PROD\n22/80","PROD\n2/4CL","PROD\n4/6CL","PROD\n4/10CL","PROD\n6/10C","TOTAL"]
[1,{"$f":"'1'!$E7","v":8},{"$f":"'1'!C44","v":0},{"$f":"'1'!C54","v":0},{"$f":"IFERROR(D7/C7,0)","v":0},{"$f":"IFERROR(E7*C7/(B7*E1),\"\")","v":0},{"$f":"'1'!C45","v":6},{"$f":"'1'!C53","v":509},{"$f":"IFERROR(H7/G7,\"\")","v":84.833333333333329},{"$f":"IFERROR(G7*I7/(B7*I1),\"\")","v":0.27663043478260868},{"$f":"'1'!C46","v":0},{"$f":"'1'!I62","v":0},{"$f":"IFERROR(L7/K7,\"\")","v":""},{"$f":"IFERROR(M7*K7/(M1*B7),\"\")","v":""},{"$f":"'1'!F53","v":0},{"$f":"'1'!F54","v":0},{"$f":"'1'!F55","v":0},{"$f":"'1'!F57","v":111.98},{"$f":"'1'!F58","v":81.44},{"$f":"'1'!F59","v":91.61999999999999},{"$f":"'1'!F60","v":71.260000000000005},{"$f":"'1'!F61","v":0},{"$f":"'1'!I53","v":0},{"$f":"'1'!I55","v":0},{"$f":"'1'!I56","v":0},{"$f":"'1'!I57","v":0},{"$f":"SUM(O7:Z7)","v":356.3}]
[2,{"$f":"'2'!$E7","v":7},{"$f":"'2'!$C44","v":0},{"$f":"'2'!C54","v":0},{"$f":"IFERROR(D8/C8,0)","v":0},{"$f":"IFERROR(E8*C8/(B8*E1),\"\")","v":0},{"$f":"'2'!C45","v":0},{"$f":"'2'!C53","v":0},"",{"$f":"IFERROR(G8*I8/(B8*I1),\"\")","v":""},{"$f":"'2'!C46","v":0},{"$f":"'2'!I62","v":0},{"$f":"IFERROR(L8/K8,\"\")","v":""},{"$f":"IFERROR(M8*K8/(M1*B8),\"\")","v":""},{"$f":"'2'!F53","v":0},{"$f":"'2'!F54","v":0},{"$f":"'2'!F55","v":0},{"$f":"'2'!F57","v":0},{"$f":"'2'!F58","v":0},{"$f":"'2'!F59","v":0},{"$f":"'2'!F60","v":0},{"$f":"'2'!F61","v":0},{"$f":"'2'!I53","v":0},{"$f":"'2'!I55","v":0},{"$f":"'2'!I56","v":0},{"$f":"'2'!I57","v":0},{"$f":"SUM(O8:Z8)","v":0}]
[3,{"$f":"'3'!$E7","v":7},{"$f":"'3'!$C44","v":0},{"$f":"'3'!C54","v":0},0,{"$f":"IFERROR(E9*C9/(B9*E1),\"\")","v":0},{"$f":"'3'!C45","v":0},{"$f":"'3'!C53","v":0},"",{"$f":"IFERROR(G9*I9/(B9*I1),\"\")","v":""},{"$f":"'3'!C46","v":0},{"$f":"'3'!I62","v":0},"",{"$f":"IFERROR(M9*K9/(M1*B9),\"\")","v":""},{"$f":"'3'!F53","v":0},{"$f":"'3'!F54","v":0},{"$f":"'3'!F55","v":0},{"$f":"'3'!F57","v":0},{"$f":"'3'!F58","v":0},{"$f":"'3'!F59","v":0},{"$f":"'3'!F60","v":0},{"$f":"'3'!F61","v":0},{"$f":"'3'!I53","v":0},{"$f":"'3'!I55","v":0},{"$f":"'3'!I56","v":0},{"$f":"'3'!I57","v":0},0]
[4,{"$f":"'4'!$E7","v":7},{"$f":"'4'!$C44","v":0},{"$f":"'4'!C54","v":0},0,{"$f":"IFERROR(E10*C10/(B10*E1),\"\")","v":0},{"$f":"'4'!C45","v":0},{"$f":"'4'!C53","v":0},"",{"$f":"IFERROR(G10*I10/(B10*I1),\"\")","v":""},{"$f":"'4'!C46","v":0},{"$f":"'4'!I62","v":0},"",{"$f":"IFERROR(M10*K10/(M1*B10),\"\")","v":""},{"$f":"'4'!F53","v":0},{"$f":"'4'!F54","v":0},{"$f":"'4'!F55","v":0},{"$f":"'4'!F57","v":0},{"$f":"'4'!F58","v":0},{"$f":"'4'!F59","v":0},{"$f":"'4'!F60","v":0},{"$f":"'4'!F61","v":0},{"$f":"'4'!I53","v":0},{"$f":"'4'!I55","v":0},{"$f":"'4'!I56","v":0},{"$f":"'4'!I57","v":0},0]
[5,{"$f":"'5'!$E7","v":8},{"$f":"'5'!$C44","v":0},{"$f":"'5'!C54","v":0},0,{"$f":"IFERROR(E11*C11/(B11*E1),\"\")","v":0},{"$f":"'5'!C45","v":4},{"$f":"'5'!C53","v":283},70.75,{"$f":"IFERROR(G11*I11/(B11*I1),\"\")","v":0.15380434782608696},{"$f":"'5'!C46","v":0},{"$f":"'5'!I62","v":0},"",{"$f":"IFERROR(M11*K11/(M1*B11),\"\")","v":""},{"$f":"'5'!F53","v":0},{"$f":"'5'!F54","v":0},{"$f":"'5'!F55","v":0},{"$f":"'5'!F57","v":62.26},{"$f":"'5'!F58","v":45.28},{"$f":"'5'!F59","v":50.94},{"$f":"'5'!F60","v":39.620000000000005},{"$f":"'5'!F61","v":0},{"$f":"'5'!I53","v":0},{"$f":"'5'!I55","v":0},{"$f":"'5'!I56","v":0},{"$f":"'5'!I57","v":0},198.1]
[6,{"$f":"'6'!$E7","v":8},{"$f":"'6'!$C44","v":0},{"$f":"'6'!C54","v":0},0,{"$f":"IFERROR(E12*C12/(B12*E1),\"\")","v":0},{"$f":"'6'!C45","v":2},{"$f":"'6'!C53","v":135},67.5,{"$f":"IFERROR(G12*I12/(B12*I1),\"\")","v":7.3369565217391311E-2},{"$f":"'6'!C46","v":0},{"$f":"'6'!I62","v":0},"",{"$f":"IFERROR(M12*K12/(M1*B12),\"\")","v":""},{"$f":"'6'!F53","v":0},{"$f":"'6'!F54","v":0},{"$f":"'6'!F55","v":0},{"$f":"'6'!F57","v":29.7},{"$f":"'6'!F58","v":21.6},{"$f":"'6'!F59","v":24.3},{"$f":"'6'!F60","v":18.900000000000002},{"$f":"'6'!F61","v":0},{"$f":"'6'!I53","v":0},{"$f":"'6'!I55","v":0},{"$f":"'6'!I56","v":0},{"$f":"'6'!I57","v":0},94.5]
[7,{"$f":"'7'!$E7","v":8},{"$f":"'7'!$C44","v":0},{"$f":"'7'!C54","v":0},0,{"$f":"IFERROR(E13*C13/(B13*E1),\"\")","v":0},{"$f":"'7'!C45","v":0},{"$f":"'7'!C53","v":0},"",{"$f":"IFERROR(G13*I13/(B13*I1),\"\")","v":""},{"$f":"'7'!C46","v":0},{"$f":"'7'!I62","v":87.44},"",{"$f":"IFERROR(M13*K13/(M1*B13),\"\")","v":""},{"$f":"'7'!F53","v":0},{"$f":"'7'!F54","v":0},{"$f":"'7'!F55","v":0},{"$f":"'7'!F57","v":0},{"$f":"'7'!F58","v":0},{"$f":"'7'!F59","v":0},{"$f":"'7'!F60","v":0},{"$f":"'7'!F61","v":0},{"$f":"'7'!I53","v":0},{"$f":"'7'!I55","v":0},{"$f":"'7'!I56","v":0},{"$f":"'7'!I57","v":0},0]
[8,{"$f":"'8'!$E7","v":8},{"$f":"'8'!$C44","v":0},{"$f":"'8'!C54","v":0},0,{"$f":"IFERROR(E14*C14/(B14*E1),\"\")","v":0},{"$f":"'8'!C45","v":0},{"$f":"'8'!C53","v":0},"",{"$f":"IFERROR(G14*I14/(B14*I1),\"\")","v":""},{"$f":"'8'!C46","v":0},{"$f":"'8'!I62","v":803.9},"",{"$f":"IFERROR(M14*K14/(M1*B14),\"\")","v":""},{"$f":"'8'!F53","v":0},{"$f":"'8'!F54","v":0},{"$f":"'8'!F55","v":0},{"$f":"'8'!F57","v":0},{"$f":"'8'!F58","v":0},{"$f":"'8'!F59","v":0},{"$f":"'8'!F60","v":0},{"$f":"'8'!F61","v":0},{"$f":"'8'!I53","v":0},{"$f":"'8'!I55","v":0},{"$f":"'8'!I56","v":266.24},{"$f":"'8'!I57","v":0},266.24]
[9,{"$f":"'9'!$E7","v":7},{"$f":"'9'!$C44","v":0},{"$f":"'9'!C54","v":0},0,{"$f":"IFERROR(E15*C15/(B15*E1),\"\")","v":0},{"$f":"'9'!C45","v":7},{"$f":"'9'!C53","v":381},54.428571428571431,{"$f":"IFERROR(G15*I15/(B15*I1),\"\")","v":0.23664596273291927},{"$f":"'9'!C46","v":0},{"$f":"'9'!I62","v":798.24000000000012},"",{"$f":"IFERROR(M15*K15/(M1*B15),\"\")","v":""},{"$f":"'9'!F53","v":0},{"$f":"'9'!F54","v":0},{"$f":"'9'!F55","v":0},{"$f":"'9'!F57","v":83.820000000000007},{"$f":"'9'!F58","v":60.96},{"$f":"'9'!F59","v":68.58},{"$f":"'9'!F60","v":53.34},{"$f":"'9'!F61","v":0},{"$f":"'9'!I53","v":0},{"$f":"'9'!I55","v":0},{"$f":"'9'!I56","v":181.86},{"$f":"'9'!I57","v":0},448.56000000000006]
[10,{"$f":"'10'!$E7","v":0},{"$f":"'10'!$C44","v":0},{"$f":"'10'!C54","v":0},0,{"$f":"IFERROR(E16*C16/(B16*E1),\"\")","v":""},{"$f":"'10'!C45","v":0},{"$f":"'10'!C53","v":0},"",{"$f":"IFERROR(G16*I16/(B16*I1),\"\")","v":""},{"$f":"'10'!C46","v":0},{"$f":"'10'!I62","v":0},"",{"$f":"IFERROR(M16*K16/(M1*B16),\"\")","v":""},{"$f":"'10'!F53","v":0},{"$f":"'10'!F54","v":0},{"$f":"'10'!F55","v":0},{"$f":"'10'!F57","v":0},{"$f":"'10'!F58","v":0},{"$f":"'10'!F59","v":0},{"$f":"'10'!F60","v":0},{"$f":"'10'!F61","v":0},{"$f":"'10'!I53","v":0},{"$f":"'10'!I55","v":0},{"$f":"'10'!I56","v":0},{"$f":"'10'!I57","v":0},0]
[11,{"$f":"'11'!$E7","v":0},{"$f":"'11'!$C44","v":0},{"$f":"'11'!C54","v":0},0,{"$f":"IFERROR(E17*C17/(B17*E1),\"\")","v":""},{"$f":"'11'!C45","v":0},{"$f":"'11'!C53","v":0},"",{"$f":"IFERROR(G17*I17/(B17*I1),\"\")","v":""},{"$f":"'11'!C46","v":0},{"$f":"'11'!I62","v":0},"",{"$f":"IFERROR(M17*K17/(M1*B17),\"\")","v":""},{"$f":"'11'!F53","v":0},{"$f":"'11'!F54","v":0},{"$f":"'11'!F55","v":0},{"$f":"'11'!F57","v":0},{"$f":"'11'!F58","v":0},{"$f":"'11'!F59","v":0},{"$f":"'11'!F60","v":0},{"$f":"'11'!F61","v":0},{"$f":"'11'!I53","v":0},{"$f":"'11'!I55","v":0},{"$f":"'11'!I56","v":0},{"$f":"'11'!I57","v":0},0]
[12,{"$f":"'12'!$E7","v":8},{"$f":"'12'!$C44","v":0},{"$f":"'12'!C54","v":0},0,{"$f":"IFERROR(E18*C18/(B18*E1),\"\")","v":0},{"$f":"'12'!C45","v":0},{"$f":"'12'!C53","v":0},"",{"$f":"IFERROR(G18*I18/(B18*I1),\"\")","v":""},{"$f":"'12'!C46","v":0},{"$f":"'12'!I62","v":443.56},"",{"$f":"IFERROR(M18*K18/(M1*B18),\"\")","v":""},{"$f":"'12'!F53","v":0},{"$f":"'12'!F54","v":0},{"$f":"'12'!F55","v":0},{"$f":"'12'!F57","v":0},{"$f":"'12'!F58","v":0},{"$f":"'12'!F59","v":0},{"$f":"'12'!F60","v":0},{"$f":"'12'!F61","v":0},{"$f":"'12'!I53","v":0},{"$f":"'12'!I55","v":0},{"$f":"'12'!I56","v":0},{"$f":"'12'!I57","v":0},0]
[13,{"$f":"'13'!$E7","v":8},{"$f":"'13'!$C44","v":0},{"$f":"'13'!C54","v":0},0,{"$f":"IFERROR(E19*C19/(B19*E1),\"\")","v":0},{"$f":"'13'!C45","v":0},{"$f":"'13'!C53","v":0},"",{"$f":"IFERROR(G19*I19/(B19*I1),\"\")","v":""},{"$f":"'13'!C46","v":0},{"$f":"'13'!I62","v":239.07999999999998},"",{"$f":"IFERROR(M19*K19/(M1*B19),\"\")","v":""},{"$f":"'13'!F53","v":0},{"$f":"'13'!F54","v":0},{"$f":"'13'!F55","v":0},{"$f":"'13'!F57","v":0},{"$f":"'13'!F58","v":0},{"$f":"'13'!F59","v":0},{"$f":"'13'!F60","v":0},{"$f":"'13'!F61","v":0},{"$f":"'13'!I53","v":0},{"$f":"'13'!I55","v":0},{"$f":"'13'!I56","v":0},{"$f":"'13'!I57","v":0},0]
[14,{"$f":"'14'!$E7","v":8},{"$f":"'14'!$C44","v":0},{"$f":"'14'!C54","v":0},0,{"$f":"IFERROR(E20*C20/(B20*E1),\"\")","v":0},{"$f":"'14'!C45","v":0},{"$f":"'14'!C53","v":0},"",{"$f":"IFERROR(G20*I20/(B20*I1),\"\")","v":""},{"$f":"'14'!C46","v":0},{"$f":"'14'!I62","v":0},"",{"$f":"IFERROR(M20*K20/(M1*B20),\"\")","v":""},{"$f":"'14'!F53","v":0},{"$f":"'14'!F54","v":0},{"$f":"'14'!F55","v":0},{"$f":"'14'!F57","v":0},{"$f":"'14'!F58","v":0},{"$f":"'14'!F59","v":0},{"$f":"'14'!F60","v":0},{"$f":"'14'!F61","v":0},{"$f":"'14'!I53","v":0},{"$f":"'14'!I55","v":0},{"$f":"'14'!I56","v":0},{"$f":"'14'!I57","v":0},0]
[15,{"$f":"'15'!$E7","v":8},{"$f":"'15'!$C44","v":0},{"$f":"'15'!C54","v":0},0,{"$f":"IFERROR(E21*C21/(B21*E1),\"\")","v":0},{"$f":"'15'!C45","v":0},{"$f":"'15'!C53","v":0},"",{"$f":"IFERROR(G21*I21/(B21*I1),\"\")","v":""},{"$f":"'15'!C46","v":0},{"$f":"'15'!I62","v":0},"",{"$f":"IFERROR(M21*K21/(M1*B21),\"\")","v":""},{"$f":"'15'!F53","v":0},{"$f":"'15'!F54","v":0},{"$f":"'15'!F55","v":0},{"$f":"'15'!F57","v":0},{"$f":"'15'!F58","v":0},{"$f":"'15'!F59","v":0},{"$f":"'15'!F60","v":0},{"$f":"'15'!F61","v":0},{"$f":"'15'!I53","v":0},{"$f":"'15'!I55","v":0},{"$f":"'15'!I56","v":0},{"$f":"'15'!I57","v":0},0]
[16,{"$f":"'16'!$E7","v":7},{"$f":"'16'!$C44","v":0},{"$f":"'16'!C54","v":0},0,{"$f":"IFERROR(E22*C22/(B22*E1),\"\")","v":0},{"$f":"'16'!C45","v":0},{"$f":"'16'!C53","v":0},"",{"$f":"IFERROR(G22*I22/(B22*I1),\"\")","v":""},{"$f":"'16'!C46","v":0},{"$f":"'16'!I62","v":0},"",{"$f":"IFERROR(M22*K22/(M1*B22),\"\")","v":""},{"$f":"'16'!F53","v":0},{"$f":"'16'!F54","v":0},{"$f":"'16'!F55","v":0},{"$f":"'16'!F57","v":0},{"$f":"'16'!F58","v":0},{"$f":"'16'!F59","v":0},{"$f":"'16'!F60","v":0},{"$f":"'16'!F61","v":0},{"$f":"'16'!I53","v":0},{"$f":"'16'!I55","v":0},{"$f":"'16'!I56","v":0},{"$f":"'16'!I57","v":0},0]
[17,{"$f":"'17'!$E7","v":0},{"$f":"'17'!$C44","v":0},{"$f":"'17'!C54","v":0},0,{"$f":"IFERROR(E23*C23/(B23*E1),\"\")","v":""},{"$f":"'17'!C45","v":0},{"$f":"'17'!C53","v":0},"",{"$f":"IFERROR(G23*I23/(B23*I1),\"\")","v":""},{"$f":"'17'!C46","v":0},{"$f":"'17'!I62","v":0},"",{"$f":"IFERROR(M23*K23/(M1*B23),\"\")","v":""},{"$f":"'17'!F53","v":0},{"$f":"'17'!F54","v":0},{"$f":"'17'!F55","v":0},{"$f":"'17'!F57","v":0},{"$f":"'17'!F58","v":0},{"$f":"'17'!F59","v":0},{"$f":"'17'!F60","v":0},{"$f":"'17'!F61","v":0},{"$f":"'17'!I53","v":0},{"$f":"'17'!I55","v":0},{"$f":"'17'!I56","v":0},{"$f":"'17'!I57","v":0},0]
[18,{"$f":"'18'!$E7","v":0},{"$f":"'18'!$C44","v":0},{"$f":"'18'!C54","v":0},0,{"$f":"IFERROR(E24*C24/(B24*E1),\"\")","v":""},{"$f":"'18'!C45","v":0},{"$f":"'18'!C53","v":0},"",{"$f":"IFERROR(G24*I24/(B24*I1),\"\")","v":""},{"$f":"'18'!C46","v":0},{"$f":"'18'!I62","v":0},"",{"$f":"IFERROR(M24*K24/(M1*B24),\"\")","v":""},{"$f":"'18'!F53","v":0},{"$f":"'18'!F54","v":0},{"$f":"'18'!F55","v":0},{"$f":"'18'!F57","v":0},{"$f":"'18'!F58","v":0},{"$f":"'18'!F59","v":0},{"$f":"'18'!F60","v":0},{"$f":"'18'!F61","v":0},{"$f":"'18'!I53","v":0},{"$f":"'18'!I55","v":0},{"$f":"'18'!I56","v":0},{"$f":"'18'!I57","v":0},0]
[19,{"$f":"'19'!$E7","v":0},{"$f":"'19'!$C44","v":0},{"$f":"'19'!C54","v":0},0,{"$f":"IFERROR(E25*C25/(B25*E1),\"\")","v":""},{"$f":"'19'!C45","v":0},{"$f":"'19'!C53","v":0},"",{"$f":"IFERROR(G25*I25/(B25*I1),\"\")","v":""},{"$f":"'19'!C46","v":0},{"$f":"'19'!I62","v":0},"",{"$f":"IFERROR(M25*K25/(M1*B25),\"\")","v":""},{"$f":"'19'!F53","v":0},{"$f":"'19'!F54","v":0},{"$f":"'19'!F55","v":0},{"$f":"'19'!F57","v":0},{"$f":"'19'!F58","v":0},{"$f":"'19'!F59","v":0},{"$f":"'19'!F60","v":0},{"$f":"'19'!F61","v":0},{"$f":"'19'!I53","v":0},{"$f":"'19'!I55","v":0},{"$f":"'19'!I56","v":0},{"$f":"'19'!I57","v":0},0]
[20,{"$f":"'20'!$E7","v":0},{"$f":"'20'!$C44","v":0},{"$f":"'20'!C54","v":0},0,{"$f":"IFERROR(E26*C26/(B26*E1),\"\")","v":""},{"$f":"'20'!C45","v":0},{"$f":"'20'!C53","v":0},"",{"$f":"IFERROR(G26*I26/(B26*I1),\"\")","v":""},{"$f":"'20'!C46","v":0},{"$f":"'20'!I62","v":0},"",{"$f":"IFERROR(M26*K26/(M1*B26),\"\")","v":""},{"$f":"'20'!F53","v":0},{"$f":"'20'!F54","v":0},{"$f":"'20'!F55","v":0},{"$f":"'20'!F57","v":0},{"$f":"'20'!F58","v":0},{"$f":"'20'!F59","v":0},{"$f":"'20'!F60","v":0},{"$f":"'20'!F61","v":0},{"$f":"'20'!I53","v":0},{"$f":"'20'!I55","v":0},{"$f":"'20'!I56","v":0},{"$f":"'20'!I57","v":0},0]
[21,{"$f":"'21'!$E7","v":0},{"$f":"'21'!$C44","v":0},{"$f":"'21'!C54","v":0},0,{"$f":"IFERROR(E27*C27/(B27*E1),\"\")","v":""},{"$f":"'21'!C45","v":0},{"$f":"'21'!C53","v":0},"",{"$f":"IFERROR(G27*I27/(B27*I1),\"\")","v":""},{"$f":"'21'!C46","v":0},{"$f":"'21'!I62","v":0},"",{"$f":"IFERROR(M27*K27/(M1*B27),\"\")","v":""},{"$f":"'21'!F53","v":0},{"$f":"'21'!F54","v":0},{"$f":"'21'!F55","v":0},{"$f":"'21'!F57","v":0},{"$f":"'21'!F58","v":0},{"$f":"'21'!F59","v":0},{"$f":"'21'!F60","v":0},{"$f":"'21'!F61","v":0},{"$f":"'21'!I53","v":0},{"$f":"'21'!I55","v":0},{"$f":"'21'!I56","v":0},{"$f":"'21'!I57","v":0},0]
[22,{"$f":"'22'!$E7","v":0},{"$f":"'22'!$C44","v":0},{"$f":"'22'!C54","v":0},0,{"$f":"IFERROR(E28*C28/(B28*E1),\"\")","v":""},{"$f":"'22'!C45","v":0},{"$f":"'22'!C53","v":0},"",{"$f":"IFERROR(G28*I28/(B28*I1),\"\")","v":""},{"$f":"'22'!C46","v":0},{"$f":"'22'!I62","v":0},"",{"$f":"IFERROR(M28*K28/(M1*B28),\"\")","v":""},{"$f":"'22'!F53","v":0},{"$f":"'22'!F54","v":0},{"$f":"'22'!F55","v":0},{"$f":"'22'!F57","v":0},{"$f":"'22'!F58","v":0},{"$f":"'22'!F59","v":0},{"$f":"'22'!F60","v":0},{"$f":"'22'!F61","v":0},{"$f":"'22'!I53","v":0},{"$f":"'22'!I55","v":0},{"$f":"'22'!I56","v":0},{"$f":"'22'!I57","v":0},0]
[23,{"$f":"'23'!$E7","v":0},{"$f":"'23'!$C44","v":0},{"$f":"'23'!C54","v":0},0,{"$f":"IFERROR(E29*C29/(B29*E1),\"\")","v":""},{"$f":"'23'!C45","v":0},{"$f":"'23'!C53","v":0},"",{"$f":"IFERROR(G29*I29/(B29*I1),\"\")","v":""},{"$f":"'23'!C46","v":0},{"$f":"'23'!I62","v":0},"",{"$f":"IFERROR(M29*K29/(M1*B29),\"\")","v":""},{"$f":"'23'!F53","v":0},{"$f":"'23'!F54","v":0},{"$f":"'23'!F55","v":0},{"$f":"'23'!F57","v":0},{"$f":"'23'!F58","v":0},{"$f":"'23'!F59","v":0},{"$f":"'23'!F60","v":0},{"$f":"'23'!F61","v":0},{"$f":"'23'!I53","v":0},{"$f":"'23'!I55","v":0},{"$f":"'23'!I56","v":0},{"$f":"'23'!I57","v":0},0]
[24,{"$f":"'24'!$E7","v":0},{"$f":"'24'!$C44","v":0},{"$f":"'24'!C54","v":0},0,{"$f":"IFERROR(E30*C30/(B30*E1),\"\")","v":""},{"$f":"'24'!C45","v":0},{"$f":"'24'!C53","v":0},"",{"$f":"IFERROR(G30*I30/(B30*I1),\"\")","v":""},{"$f":"'24'!C46","v":0},{"$f":"'24'!I62","v":0},"",{"$f":"IFERROR(M30*K30/(M1*B30),\"\")","v":""},{"$f":"'24'!F53","v":0},{"$f":"'24'!F54","v":0},{"$f":"'24'!F55","v":0},{"$f":"'24'!F57","v":0},{"$f":"'24'!F58","v":0},{"$f":"'24'!F59","v":0},{"$f":"'24'!F60","v":0},{"$f":"'24'!F61","v":0},{"$f":"'24'!I53","v":0},{"$f":"'24'!I55","v":0},{"$f":"'24'!I56","v":0},{"$f":"'24'!I57","v":0},0]
[25,{"$f":"'25'!$E7","v":0},{"$f":"'25'!$C44","v":0},{"$f":"'25'!C54","v":0},0,{"$f":"IFERROR(E31*C31/(B31*E1),\"\")","v":""},{"$f":"'25'!C45","v":0},{"$f":"'25'!C53","v":0},"",{"$f":"IFERROR(G31*I31/(B31*I1),\"\")","v":""},{"$f":"'25'!C46","v":0},{"$f":"'25'!I62","v":0},"",{"$f":"IFERROR(M31*K31/(M1*B31),\"\")","v":""},{"$f":"'25'!F53","v":0},{"$f":"'25'!F54","v":0},{"$f":"'25'!F55","v":0},{"$f":"'25'!F57","v":0},{"$f":"'25'!F58","v":0},{"$f":"'25'!F59","v":0},{"$f":"'25'!F60","v":0},{"$f":"'25'!F61","v":0},{"$f":"'25'!I53","v":0},{"$f":"'25'!I55","v":0},{"$f":"'25'!I56","v":0},{"$f":"'25'!I57","v":0},0]
[26,{"$f":"'26'!$E7","v":0},{"$f":"'26'!$C44","v":0},{"$f":"'26'!C54","v":0},0,{"$f":"IFERROR(E32*C32/(B32*E1),\"\")","v":""},{"$f":"'26'!C45","v":0},{"$f":"'26'!C53","v":0},"",{"$f":"IFERROR(G32*I32/(B32*I1),\"\")","v":""},{"$f":"'26'!C46","v":0},{"$f":"'26'!I62","v":0},"",{"$f":"IFERROR(M32*K32/(M1*B32),\"\")","v":""},{"$f":"'26'!F53","v":0},{"$f":"'26'!F54","v":0},{"$f":"'26'!F55","v":0},{"$f":"'26'!F57","v":0},{"$f":"'26'!F58","v":0},{"$f":"'26'!F59","v":0},{"$f":"'26'!F60","v":0},{"$f":"'26'!F61","v":0},{"$f":"'26'!I53","v":0},{"$f":"'26'!I55","v":0},{"$f":"'26'!I56","v":0},{"$f":"'26'!I57","v":0},0]
[27,{"$f":"'27'!$E7","v":0},{"$f":"'27'!$C44","v":0},{"$f":"'27'!C54","v":0},0,{"$f":"IFERROR(E33*C33/(B33*E1),\"\")","v":""},{"$f":"'27'!C45","v":0},{"$f":"'27'!C53","v":0},"",{"$f":"IFERROR(G33*I33/(B33*I1),\"\")","v":""},{"$f":"'27'!C46","v":0},{"$f":"'27'!I62","v":0},"",{"$f":"IFERROR(M33*K33/(M1*B33),\"\")","v":""},{"$f":"'27'!F53","v":0},{"$f":"'27'!F54","v":0},{"$f":"'27'!F55","v":0},{"$f":"'26'!F57","v":0},{"$f":"'27'!F58","v":0},{"$f":"'27'!F59","v":0},{"$f":"'27'!F60","v":0},{"$f":"'27'!F61","v":0},{"$f":"'27'!I53","v":0},{"$f":"'27'!I55","v":0},{"$f":"'27'!I56","v":0},{"$f":"'27'!I57","v":0},0]
[28,{"$f":"'28'!$E7","v":0},{"$f":"'28'!$C44","v":0},{"$f":"'28'!C54","v":0},0,{"$f":"IFERROR(E34*C34/(B34*E1),\"\")","v":""},{"$f":"'28'!C45","v":0},{"$f":"'28'!C53","v":0},"",{"$f":"IFERROR(G34*I34/(B34*I1),\"\")","v":""},{"$f":"'28'!C46","v":0},{"$f":"'28'!I62","v":0},"",{"$f":"IFERROR(M34*K34/(M1*B34),\"\")","v":""},{"$f":"'28'!F53","v":0},{"$f":"'28'!F54","v":0},{"$f":"'28'!F55","v":0},{"$f":"'27'!F57","v":0},{"$f":"'28'!F58","v":0},{"$f":"'28'!F59","v":0},{"$f":"'28'!F60","v":0},{"$f":"'28'!F61","v":0},{"$f":"'28'!I53","v":0},{"$f":"'28'!I55","v":0},{"$f":"'28'!I56","v":0},{"$f":"'28'!I57","v":0},0]
[29,{"$f":"'29'!$E7","v":0},{"$f":"'29'!$C44","v":0},{"$f":"'29'!C54","v":0},0,{"$f":"IFERROR(E35*C35/(B35*E1),\"\")","v":""},{"$f":"'29'!C45","v":0},{"$f":"'29'!C53","v":0},"",{"$f":"IFERROR(G35*I35/(B35*I1),\"\")","v":""},{"$f":"'29'!C46","v":0},{"$f":"'29'!I62","v":0},"",{"$f":"IFERROR(M35*K35/(M1*B35),\"\")","v":""},{"$f":"'29'!F53","v":0},{"$f":"'29'!F54","v":0},{"$f":"'29'!F55","v":0},{"$f":"'28'!F57","v":0},{"$f":"'29'!F58","v":0},{"$f":"'29'!F59","v":0},{"$f":"'29'!F60","v":0},{"$f":"'29'!F61","v":0},{"$f":"'29'!I53","v":0},{"$f":"'29'!I55","v":0},{"$f":"'29'!I56","v":0},{"$f":"'29'!I57","v":0},0]
[30,{"$f":"'30'!$E7","v":0},{"$f":"'30'!$C44","v":0},{"$f":"'30'!C54","v":0},0,{"$f":"IFERROR(E36*C36/(B36*E1),\"\")","v":""},{"$f":"'30'!C45","v":0},{"$f":"'30'!C53","v":0},"",{"$f":"IFERROR(G36*I36/(B36*I1),\"\")","v":""},{"$f":"'30'!C46","v":0},{"$f":"'30'!I62","v":0},"",{"$f":"IFERROR(M36*K36/(M1*B36),\"\")","v":""},{"$f":"'30'!F53","v":0},{"$f":"'30'!F54","v":0},{"$f":"'30'!F55","v":0},{"$f":"'30'!F57","v":0},{"$f":"'30'!F58","v":0},{"$f":"'30'!F59","v":0},{"$f":"'30'!F60","v":0},{"$f":"'30'!F61","v":0},{"$f":"'30'!I53","v":0},{"$f":"'30'!I55","v":0},{"$f":"'30'!I56","v":0},{"$f":"'30'!I57","v":0},0]
[31,{"$f":"'31'!$E7","v":0},{"$f":"'4'!$C44","v":0},{"$f":"'31'!C54","v":0},0,{"$f":"IFERROR(E37*C37/(B37*E1),\"\")","v":""},{"$f":"'31'!C45","v":0},{"$f":"'31'!C53","v":0},"",{"$f":"IFERROR(G37*I37/(B37*I1),\"\")","v":""},{"$f":"'31'!C46","v":0},{"$f":"'31'!I62","v":0},"",{"$f":"IFERROR(M37*K37/(M1*B37),\"\")","v":""},{"$f":"'31'!F53","v":0},{"$f":"'31'!F54","v":0},{"$f":"'31'!F55","v":0},{"$f":"'31'!F57","v":0},{"$f":"'31'!F58","v":0},{"$f":"'31'!F59","v":0},{"$f":"'31'!F60","v":0},{"$f":"'31'!F61","v":0},{"$f":"'31'!I53","v":0},{"$f":"'31'!I55","v":0},{"$f":"'31'!I56","v":0},{"$f":"'31'!I57","v":0},0]
[]
[]
["TOTAUX",{"$f":"SUM(B7:B38)","v":107},{"$f":"SUM(C7:C38)","v":0},{"$f":"SUM(D7:D37)","v":0},0,{"$f":"IFERROR(E40*C40/(B40*E1),\"\")","v":0},{"$f":"SUM(G7:G39)","v":19},{"$f":"SUM(H7:H39)","v":1308},{"$f":"IFERROR(H40/G40,\"\")","v":68.84210526315789},{"$f":"IFERROR(G40*I40/(B40*I1),\"\")","v":5.314912637139374E-2},{"$f":"SUM(K7:K38)","v":0},{"$f":"SUM(L7:L38)","v":2372.2199999999998},{"$f":"IFERROR(L40/K40,\"\")","v":""},{"$f":"IFERROR(M40*K40/(M1*B40),\"\")","v":""},{"$f":"SUM(O7:O38)","v":0},0,0,287.76,209.28,235.44,183.12,0,0,0,448.1,0,{"$f":"SUM(O40:Z40)","v":1363.7}]

{"sheet":"GNR ET ELEMENTS DE PROD","index":36,"n_rows":10,"n_cols":15,"rows_kept":10,"cut":false,"hidden":false,"merged":[[2,9,2,15],[1,0,1,2]]}
[]
["GNR"]
["CITERNE PLEINE ",null,12820,null,null,null,null,null,null,"COMPOSITION DE FAB"]
["RESTE                  ",null,{"$f":"C3-'RECAP MOIS MATERIEL'!J275","v":11572}]
[null,null,null,null,null,null,null,null,null,null,"0/4c","0/4n","6/10c","8/16r","m0/16"]
[null,null,null,null,null,null,null,null,null,null,4.5,8.25,4,8.25,25]
[null,null,null,null,null,null,null,null,null,null,0.18,0.33,0.16,0.33,1]
[]
[null,null,null,null,null,null,null,null,null,null,null,null,null,null,"0/4SCL"]
[null,null,null,null,null,null,null,null,null,null,0.33,0.66,null,null,0.99]

{"sheet":"ACHATS","index":37,"n_rows":35,"n_cols":7,"rows_kept":35,"cut":false,"hidden":false,"merged":[[0,0,2,6]]}
["RECAPITULATIF ACHATS DU MOIS"]
[]
[]
["JOUR","PRODUIT","TONNAGE","PRODUIT","TONNAGE","PRODUIT","TONNAGE"]
[1,{"$f":"'1'!A$66","v":0},{"$f":"'1'!B$66","v":0},{"$f":"'1'!D$66","v":0},{"$f":"'1'!E$66","v":0},{"$f":"'1'!H$66","v":0},{"$f":"'1'!I$66","v":0}]
[2,{"$f":"'2'!A$66","v":0},{"$f":"'2'!B$66","v":0},{"$f":"'2'!D$66","v":0},{"$f":"'2'!E$66","v":0},{"$f":"'2'!H$66","v":0},{"$f":"'2'!I$66","v":0}]
[3,{"$f":"'3'!A$66","v":0},{"$f":"'3'!B$66","v":0},{"$f":"'3'!D$66","v":0},{"$f":"'3'!E$66","v":0},{"$f":"'3'!H$66","v":0},{"$f":"'3'!I$66","v":0}]
[4,{"$f":"'4'!A$66","v":0},{"$f":"'4'!B$66","v":0},{"$f":"'4'!D$66","v":0},{"$f":"'4'!E$66","v":0},{"$f":"'4'!H$66","v":0},{"$f":"'4'!I$66","v":0}]
[5,{"$f":"'5'!A$66","v":0},{"$f":"'5'!B$66","v":0},{"$f":"'5'!D$66","v":0},{"$f":"'5'!E$66","v":0},{"$f":"'5'!H$66","v":0},{"$f":"'5'!I$66","v":0}]
[6,{"$f":"'6'!A$66","v":0},{"$f":"'6'!B$66","v":0},{"$f":"'6'!D$66","v":0},{"$f":"'6'!E$66","v":0},{"$f":"'6'!H$66","v":0},{"$f":"'6'!I$66","v":0}]
[7,{"$f":"'7'!A$66","v":0},{"$f":"'7'!B$66","v":0},{"$f":"'7'!D$66","v":0},{"$f":"'7'!E$66","v":0},{"$f":"'7'!H$66","v":0},{"$f":"'7'!I$66","v":0}]
[8,{"$f":"'8'!A$66","v":0},{"$f":"'8'!B$66","v":0},{"$f":"'8'!D$66","v":0},{"$f":"'8'!E$66","v":0},{"$f":"'8'!H$66","v":0},{"$f":"'8'!I$66","v":0}]
[9,{"$f":"'9'!A$66","v":0},{"$f":"'9'!B$66","v":0},{"$f":"'9'!D$66","v":0},{"$f":"'9'!E$66","v":0},{"$f":"'9'!H$66","v":0},{"$f":"'9'!I$66","v":0}]
[10,{"$f":"'10'!A$66","v":0},{"$f":"'10'!B$66","v":0},{"$f":"'10'!D$66","v":0},{"$f":"'10'!E$66","v":0},{"$f":"'10'!H$66","v":0},{"$f":"'10'!I$66","v":0}]
[11,{"$f":"'11'!A$66","v":0},{"$f":"'11'!B$66","v":0},{"$f":"'11'!D$66","v":0},{"$f":"'11'!E$66","v":0},{"$f":"'11'!H$66","v":0},{"$f":"'11'!I$66","v":0}]
[12,{"$f":"'12'!A$66","v":0},{"$f":"'12'!B$66","v":0},{"$f":"'12'!D$66","v":0},{"$f":"'12'!E$66","v":0},{"$f":"'12'!H$66","v":0},{"$f":"'12'!I$66","v":0}]
[13,{"$f":"'13'!A$66","v":0},{"$f":"'13'!B$66","v":0},{"$f":"'13'!D$66","v":0},{"$f":"'13'!E$66","v":0},{"$f":"'13'!H$66","v":0},{"$f":"'13'!I$66","v":0}]
[14,{"$f":"'14'!A$66","v":0},{"$f":"'14'!B$66","v":0},{"$f":"'14'!D$66","v":0},{"$f":"'14'!E$66","v":0},{"$f":"'14'!H$66","v":0},{"$f":"'14'!I$66","v":0}]
[15,{"$f":"'15'!A$66","v":0},{"$f":"'15'!B$66","v":0},{"$f":"'15'!D$66","v":0},{"$f":"'15'!E$66","v":0},{"$f":"'15'!H$66","v":0},{"$f":"'15'!I$66","v":0}]
[16,{"$f":"'16'!A$66","v":0},{"$f":"'16'!B$66","v":0},{"$f":"'16'!D$66","v":0},{"$f":"'16'!E$66","v":0},{"$f":"'16'!H$66","v":0},{"$f":"'16'!I$66","v":0}]
[17,{"$f":"'17'!A$66","v":0},{"$f":"'17'!B$66","v":0},{"$f":"'17'!D$66","v":0},{"$f":"'17'!E$66","v":0},{"$f":"'17'!H$66","v":0},{"$f":"'17'!I$66","v":0}]
[18,{"$f":"'18'!A$66","v":0},{"$f":"'18'!B$66","v":0},{"$f":"'18'!D$66","v":0},{"$f":"'18'!E$66","v":0},{"$f":"'18'!H$66","v":0},{"$f":"'18'!I$66","v":0}]
[19,{"$f":"'19'!A$66","v":0},{"$f":"'19'!B$66","v":0},{"$f":"'19'!D$66","v":0},{"$f":"'19'!E$66","v":0},{"$f":"'19'!H$66","v":0},{"$f":"'19'!I$66","v":0}]
[20,{"$f":"'20'!A$66","v":0},{"$f":"'20'!B$66","v":0},{"$f":"'20'!D$66","v":0},{"$f":"'20'!E$66","v":0},{"$f":"'20'!H$66","v":0},{"$f":"'20'!I$66","v":0}]
[21,{"$f":"'21'!A$66","v":0},{"$f":"'21'!B$66","v":0},{"$f":"'21'!D$66","v":0},{"$f":"'21'!E$66","v":0},{"$f":"'21'!H$66","v":0},{"$f":"'21'!I$66","v":0}]
[22,{"$f":"'22'!A$66","v":0},{"$f":"'22'!B$66","v":0},{"$f":"'22'!D$66","v":0},{"$f":"'22'!E$66","v":0},{"$f":"'22'!H$66","v":0},{"$f":"'22'!I$66","v":0}]
[23,{"$f":"'23'!A$66","v":0},{"$f":"'23'!B$66","v":0},{"$f":"'23'!D$66","v":0},{"$f":"'23'!E$66","v":0},{"$f":"'23'!H$66","v":0},{"$f":"'23'!I$66","v":0}]
[24,{"$f":"'24'!A$66","v":0},{"$f":"'24'!B$66","v":0},{"$f":"'24'!D$66","v":0},{"$f":"'24'!E$66","v":0},{"$f":"'24'!H$66","v":0},{"$f":"'24'!I$66","v":0}]
[25,{"$f":"'25'!A$66","v":0},{"$f":"'25'!B$66","v":0},{"$f":"'25'!D$66","v":0},{"$f":"'25'!E$66","v":0},{"$f":"'25'!H$66","v":0},{"$f":"'25'!I$66","v":0}]
[26,{"$f":"'26'!A$66","v":0},{"$f":"'26'!B$66","v":0},{"$f":"'26'!D$66","v":0},{"$f":"'26'!E$66","v":0},{"$f":"'26'!H$66","v":0},{"$f":"'26'!I$66","v":0}]
[27,{"$f":"'27'!A$66","v":0},{"$f":"'27'!B$66","v":0},{"$f":"'27'!D$66","v":0},{"$f":"'27'!E$66","v":0},{"$f":"'27'!H$66","v":0},{"$f":"'27'!I$66","v":0}]
[28,{"$f":"'28'!A$66","v":0},{"$f":"'28'!B$66","v":0},{"$f":"'28'!D$66","v":0},{"$f":"'28'!E$66","v":0},{"$f":"'28'!H$66","v":0},{"$f":"'28'!I$66","v":0}]
[29,{"$f":"'29'!A$66","v":0},{"$f":"'29'!B$66","v":0},{"$f":"'29'!D$66","v":0},{"$f":"'29'!E$66","v":0},{"$f":"'29'!H$66","v":0},{"$f":"'29'!I$66","v":0}]
[30,{"$f":"'30'!A$66","v":0},{"$f":"'30'!B$66","v":0},{"$f":"'30'!D$66","v":0},{"$f":"'30'!E$66","v":0},{"$f":"'30'!H$66","v":0},{"$f":"'30'!I$66","v":0}]
[31,{"$f":"'31'!A$66","v":0},{"$f":"'31'!B$66","v":0},{"$f":"'31'!D$66","v":0},{"$f":"'31'!E$66","v":0},{"$f":"'31'!H$66","v":0},{"$f":"'31'!I$66","v":0}]

{"sheet":"liste","index":38,"n_rows":62,"n_cols":19,"rows_kept":62,"cut":false,"hidden":false,"merged":[]}
["Matériel",null,"Véhicules de liaison",null,"Personnel",null,"resp. production : ",null,"liste des sites SCE",null,"Météo",null,"AFFECTATION",null,"AFFECTATION ENGIN",null,"JOURS",null,"PRODUITS"]
["Chargeur 966G - D3100230",null,"VL Clio - P0401808",null,"AIGNELOT Sylvain",null,"Paul GARNIER",null,"Dampvalley",null,"Sec",null,"210258 Travaux divers sans engins",null,"FORAGE /210452",null,1,null,"GALETS 80/120"]
["Chargeur L110E - D3100655",null,"VL Berlingo - P1001930",null,"ANTAL Pascal",null,"Denis MARESCOT",null,"Courchaton",null,"Humide",null,"install primaire 210252",null,"ALIM TV BRUT/210454",null,2,null,"GALETS 22/80"]
["Chargeur L566 - D3101014",null,"VL Kangoo - P1002588",null,"BAGUE Alain",null,"Maxime PARIS",null,"Scey sur saône",null,"Pluie",null,"Install secondaire  210256",null,"DESTOCKAGE/200308",null,3,null,"PIERRE PORPHYRE 31/50"]
["Chargeur 972H - Courc - D3101054",null,"VL Partner - P1003740",null,"CAUTENET Sébastien",null,"Alain JAMEAUX",null,"Boult",null,"Neige",null,"Install tertiaire 210258",null,"TRAVAUX DECH/210402",null,4,null,"GRAVILONS 10/14 PORPHYRE"]
["Chargeur 972H - Div - D3101253",null,"VL Kangoo - P1004191",null,"CAUTENET Sylvain",null,"Rémy COLLIN",null,"Vergranne",null,"Orage",null,"Bascule 200200",null,"CHARGEMENT CLIENT /200200",null,5,null,"SABLE ROULE 0/3"]
["Chargeur L150 - D3101347",null,"VL Kangoo - P1004262",null,"CHAINHO Jean-Edouard",null,"Jérémy COURTOT",null,"Chemaudin",null,"Gel",null,"Sur Engin Alim TV Brut",null,"big bag",null,6,null,"6/10 ARNAY LE DUC"]
["Chargeur L180E - Div - D3101527",null,"VL Nemo - P1004268",null,"COURTET  Pascal",null,"Manuel DE SOUSA",null,"Sombacour",null,"soleil",null,"Sur Engin Destockage",null,"TRAVAUX DIVERS SUR PISTE 200950",null,7]
["Chargeur ZW 220 - D3101615",null,"VL Kangoo Arval Lucie - P1004817",null,"COURTOT Jérémy",null,"Laurent FLAJEOLET ",null,"Etalans",null,"Forte chaleur",null,"Sur Engin Chargement client",null,null,null,8]
["Chargeur L220G - Div - D3101870",null,"VL Kangoo Arval - P1004818",null,"CRETIN Brigitte",null,"Guy MARLE",null,"Epeugney",null,null,null,"Sur Engin Travaux divers site",null,null,null,9]
["Chargeur 980K - Monni - D3101896",null,"VL Kangoo Arval  Mickael - P1004819",null,"DE SOUSA Manuel",null,"Richard DROUIN ",null,"Mouthe",null,null,null,"confection Big Bag",null,null,null,10]
["Chargeur 972M XE - Monni - D3102156",null,"VL Kangoo Arval - P1004820",null,"DELAITRE Jean Claude",null,"AIGNELOT Sylvain",null,"PIN",null,null,null,null,null,null,null,11]
["Chargeur L220H - Dampv - D3102168",null,"VL Kangoo Arval - P1004821",null,"DORKELD Didier",null,null,null,"Osselle",null,null,null,null,null,null,null,12]
["Chargeur 972M XE - Chem - D3102273",null,"PARTNER 1.6L - P1005454",null,"DROUIN Richard",null,null,null,"Monnières",null,null,null,null,null,null,null,13]
["Chargeur 972 M XE - Somb - D3102366",null,"VL Berlingo - P1006235",null,"FACCHIN Mehdi",null,null,null,null,null,null,null,null,null,null,null,14]
["Chargeur 966G - D3102586",null,"VL Berlingo - P1006667",null,"FAIVRE Jean-Pierre",null,null,null,null,null,null,null,null,null,null,null,15]
["Chargeur 966G - D3102742",null,"VL Berlingo SAGUIN - P1006687",null,"FLAJEOLET Laurent",null,null,null,null,null,null,null,null,null,null,null,16]
["Chargeur 966G - D3102747",null,"VL Berlingo - P1006688",null,"GARNACHE Thierry",null,null,null,null,null,null,null,null,null,null,null,17]
["Chargeur 972 M XE - D3102775",null,"VL Berlingo HACQUARD - P1006690",null,"GARNERY Franck",null,null,null,null,null,null,null,null,null,null,null,18]
["Chargeur 972 M XE - D3102776",null,"VL Berlingo HACQUARD - P1006691",null,"GARNERY Gérard",null,null,null,null,null,null,null,null,null,null,null,19]
[null,null,"VL Berlingo HACQUARD - P1006692",null,"GATRAT Virgile",null,null,null,null,null,null,null,null,null,null,null,20]
[null,null,"fourgonnette COURTOT  - P1007440",null,"GRANDGERARD Didier",null,null,null,null,null,null,null,null,null,null,null,21]
["Foreuse DX800 - K0120003",null,"FOURGONNETTE 4X2 - P1007441",null,"GUIVIER Claudy",null,null,null,null,null,null,null,null,null,null,null,22]
[null,null,"FOURGONNETTE 4X2 - P1020035",null,"HACQUARD Denis",null,null,null,null,null,null,null,null,null,null,null,23]
[null,null,"FOURGONNETTE 4X4 - P1100064",null,"HOLTZ Mathieu",null,null,null,null,null,null,null,null,null,null,null,24]
["Pelle 330D - D1001721",null,"FOURGONNETTE 4X4 - P1100259",null,"JAMEAUX Alain",null,null,null,null,null,null,null,null,null,null,null,25]
["Pelle ZX350 - Divers - D1002015",null,"Fourgon Master - P1201721",null,"JAMEAUX Michel",null,null,null,null,null,null,null,null,null,null,null,26]
["Pelle ZX350 - Scey - D1002023",null,"Fourgon Master - P1201949",null,"JUY Ghislaine",null,null,null,null,null,null,null,null,null,null,null,27]
["PELLE ZX350 - Mobile KR - D1002627",null,"PICK UP 4X4 - P1300054",null,"MAIRE Mickael",null,null,null,null,null,null,null,null,null,null,null,28]
["Pelle 349 E - Chem - D1002946",null,"PICK UP 4X4 - P1300207",null,"MARLE Guy",null,null,null,null,null,null,null,null,null,null,null,29]
["Pelle 352 FLME - D1003109",null,"Fourgon Master - P1501682",null,"MONNOT Nicolas",null,null,null,null,null,null,null,null,null,null,null,30]
["Pelle EC250NL - D1003544",null,"Fourgon Trafic - P1507122",null,"PERRETIER Pierrick",null,null,null,null,null,null,null,null,null,null,null,31]
["Pelle EC380EL - D1020059",null,"Fourgon Master - P1508928",null,"PERTON Florence"]
[null,null,"Fourgon Trafic - P1513622",null,"POISSENOT Pierre-Luc"]
["Tombereau 735 - D6100313",null,"FOURGON 4X2 - P1514081",null,"PRINT Lucie"]
["Tombereau 740 - D6100155",null,"PEUGEOT Mathieu -P1020162",null,"ROBAREY François"]
["Tombereau A35 - D6100270",null,"Minipelle Dampv - D1003178",null,"SAGUIN Claude"]
["Tombereau Rig 769 - Courc - D6000137",null,"Minipelle E14 - Couc - D1002838",null,"SAGUIN Yann,"]
["Tombereau Rig 769D - Scey - D6000112",null,"Minipelle E14 - Monni - D1002840",null,"THEVENIN Dominique"]
["Tombereau Rig 771D  - Dampv - D6000133",null,"Minipelle SV17 - oss - D1002929",null,"TOUVREY Sébastien"]
["Tombereau Rig 772 -  D6000224",null,"Minipelle EB150 - chem - D1002168",null,"VAUDREY Geoffrey"]
[null,null,"Bobcat 463 - Dampv - D3300068",null,"VAUDREY Sylvain"]
[null,null,"Bobcat 463 - Scey - D3300067"]
["CAMION MERCEDES OSSELLE-P2100552",null,"GE 4,8KW PIN - R0000307"]
[null,null,"GE 4,8KW VERGR - R0000322"]
["GE 330Kw - R0100612",null,"GE 330Kw - R0100612"]
[null,null,"GE T17 SOMB - R0200064"]
[null,null,"Manitou M30 - C8100689"]
[]
[]
["Crible Mobile 883 - A2000257"]
["Crible Mobile 694 - A2000266"]
["Conc Mobile 1412T - A7000066",null,null,null,"LORIOL André"]
["Crible Mobile 984 - A7100066",null,null,null,"LEBRUN Martial"]
["Conc Mobile MR122Z - Z0900107",null,null,null,"GAY Corentin"]
["Conc Mobile BP1  - Z0900168",null,null,null,"BOUZID Mickael"]
["Conc Mobile 13*15 - Z0900169"]
["Conc Mobile Gipo R131 - A7020004"]
["Location engin extérieur Trax    "]
["Location engin extérieur Pelle   "]
["Location engin extérieur Dumper  "]
["Location engin extérieur Chargeur"]

{"sheet":"Modèle vide","index":39,"n_rows":78,"n_cols":14,"rows_kept":78,"cut":false,"hidden":false,"merged":[[77,0,77,2],[0,0,0,11],[26,1,26,6],[51,0,51,2],[51,3,51,5],[51,6,51,8],[67,0,67,11],[68,0,69,0],[68,1,69,1],[68,2,69,2],[68,3,69,3],[68,4,68,6],[68,7,69,11]]}
["RAPPORT JOURNALIER"]
[]
["DATE :"]
["EXPLOITATION DE:",null,null,"RESPONSABLE",null,"METEO"]
[]
[]
[null,null,null,"H DE PRODUCTIONS PREVUES"]
["POINTAGE PERSONNEL"]
[]
["NOM PRENOM","AFFECTATION","Nombre\nd'heure","AFFECTATION","Nombre\nd'heure","AFFECTATION","Nombre\nd'heure","TOTAL HORAIRE JOUR"]
[null,null,null,null,null,null,null,{"$f":"C11+E11+G11","v":0}]
[null,null,null,null,null,null,null,{"$f":"C12+E12+G12","v":0}]
[null,null,null,null,null,null,null,{"$f":"C13+E13+G13","v":0}]
[null,null,null,null,null,null,null,0]
[null,null,null,null,null,null,null,0]
[null,null,null,null,null,null,null,0]
[null,null,null,null,null,null,null,{"$f":"C17+E17+G17","v":0}]
[null,null,null,null,null,null,null,{"$f":"C18+E18+G18","v":0}]
[null,null,null,null,null,null,null,{"$f":"C19+E19+G19","v":0}]
[null,null,null,null,null,null,null,0]
[null,null,null,null,null,null,null,0]
[null,null,null,null,null,null,null,0]
[]
["POINTAGE MATERIEL"]
[]
["ENGINS DE PRODUCTION"]
["TYPE","AFFECTATION HORAIRE",null,null,null,null,null,"TOTAL\n HORAIRE JOUR","GNR","HORAMETRE \nMATIN","HORAMETRE \nSOIR","CONTRÔLE"]
[null,null,null,null,null,null,null,{"$f":"C28+E28+G28","v":0},null,null,null,{"$f":"IF(K28-J28=H28,\"OK\",\"FAUX\")","v":"OK"}]
[null,null,null,null,null,null,null,{"$f":"C29+E29+G29","v":0},null,null,null,{"$f":"IF(K29-J29=H29,\"OK\",\"FAUX\")","v":"OK"}]
[null,null,null,null,null,null,null,0,null,null,null,"OK"]
[null,null,null,null,null,null,null,0,null,null,null,"OK"]
[null,null,null,null,null,null,null,0,null,null,null,"OK"]
[null,null,null,null,null,null,null,0,null,null,null,"OK"]
[]
["VEHICULES DE LIAISON","HORAMETRE MATIN","SOIR","GNR","HEURE\n FONTIONNEMENT"]
[null,null,null,null,{"$f":"C36-B36","v":0}]
[null,null,null,null,{"$f":"C37-B37","v":0}]
[null,null,null,null,0]
[]
[]
["RAPPORT DE PRODUCTION "]
[]
[null,"COMPTEUR HORAIRE","H/FONCT"]
["PRIMAIRE (Production Plaine)"]
["SECONDAIRE (Production Bascule  Tunnel)"]
["TERTIAIRE (frabrication concassée)"]
["BIG BAG"]
["Compteur d'eau"]
[]
[]
[null,null,null,null,"BIG BAG"]
["PRIMAIRE",null,null,"SECONDAIRE",null,null,"TERTIAIRE"]
["ALIMENTATION","Tout venant Brut",null,"FABRICATION","0/4SCL",null,"CONCASSES","0/2C"]
["Plaine","Tout venant Brut",null,"FABRICATION","M0/16",null,"CONCASSES","2/4C"]
["T120","Tout venant écreté",{"$f":"C54*0.95","v":0},"FABRICATION","M0/8",null,"CONCASSES","4/6C"]
["Débit mesuré en T/h","GRANULOMETRIE","TONNAGES",null,"GRANULOMETRIE","TONNAGES","CONCASSES","4/10C"]
[50,"04 NATUREL",{"$f":"C53*D57","v":0},0.22,"SABLE 0/4R",0,"CONCASSES","6/10C"]
[36,"4/8R",{"$f":"C53*D58","v":0},0.16,"4/8R",{"$f":"C58","v":0},"CONCASSES"]
[42,"8/16R",{"$f":"C53*D59","v":0},0.18,"8/16R",0,"CONCASSES"]
[32,"11/22R",{"$f":"C53*D60","v":0},0.14000000000000001,"11/22R",{"$f":"C60","v":0},"CONCASSES","0/4C",0,null,null,null,null,""]
[68,"22/80",{"$f":"C53*D61","v":0},0.3,"22/80",{"$f":"C67-I55-I5-ABS(I57)","v":0},"CONCASSES","6,3/10",0,null,null,null,null,""]
[{"$f":"SUM(A57:B61)","v":228},null,{"$f":"SUM(C57:C61)","v":0},null,null,{"$f":"SUM(F57:F61)","v":0},null,null,{"$f":"SUM(I53:I61)","v":0},null,null,null,null,""]
[null,null,null,null,null,null,null,null,null,null,null,null,null,""]
["ACHATS",null,null,null,null,null,null,null,null,null,null,null,null,""]
[null,null,null,null,null,null,null,null,null,null,null,null,null,""]
[null,null,null,null,null,null,null,null,null,null,null,null,null,""]
[null,null,null,null,null,null,null,null,null,null,null,null,null,""]
["ARRETS",null,null,null,null,null,null,null,null,null,null,null,null,""]
["Horamètre","CIRCUIT","MACHINE","CAUSE","DUREE (en mn)",null,null,"COMMENTAIRES",null,null,null,null,null,""]
[null,null,null,null,"Panne","Entretien","AUTRE",null,null,null,null,null,null,""]
[null,null,null,null,null,null,null,null,null,null,null,null,null,""]
[null,null,null,null,null,null,null,null,null,null,null,null,null,""]
[null,null,null,null,null,null,null,null,null,null,null,null,null,""]
[]
[]
[]
[]
["Observations\n  (pour garder une trace d'un fait particulier)"]

{"sheet":"RAZ_Globale","index":40,"n_rows":0,"n_cols":0,"rows_kept":0,"cut":false,"hidden":false,"merged":[]}