{"text_format":"1","workbook":"xlsx","n_sheets":3,"sheets":["Tirage","Alea","Gains"],"not_rendered":{"charts":0,"images":24,"macros":1,"external_links":0,"defined_names":12,"comments":0,"pivot_tables":0},"unopened":[],"bounds":{"document_bytes":16777216,"sheet_cells":100000,"rows_first":2000,"rows_last":500,"rows_between":2000,"halvings":0,"cell_chars":16384,"cell_head_chars":4096},"cells_cut":0,"cells_raw":0,"read":"whole","date_system":"1900"}

{"sheet":"Tirage","index":0,"n_rows":22,"n_cols":15,"rows_kept":22,"cut":false,"hidden":false,"merged":[[3,11,3,13],[4,11,4,13],[5,11,5,13],[18,21,23,22],[6,11,6,13],[7,11,7,13],[13,12,13,13],[14,11,15,13],[19,11,19,13],[20,11,20,13],[21,11,21,13],[8,7,13,7],[8,8,13,8],[8,9,13,9],[15,9,16,9],[8,11,9,13],[10,11,12,13],[16,11,18,13]]}
[]
[{"$f":"INDEX(Alea!$A$1:$A$5,MATCH(LARGE(Alea!$B$1:$B$5,ROW()),Alea!$B$1:$B$5,0))","v":4},{"$f":"INDEX(Alea!$D$1:$D$5,MATCH(LARGE(Alea!$E$1:$E$5,ROW()),Alea!$E$1:$E$5,0))","v":5},{"$f":"INDEX(Alea!$G$1:$G$5,MATCH(LARGE(Alea!$H$1:$H$5,ROW()),Alea!$H$1:$H$5,0))","v":1},{"$f":"INDEX(Alea!$J$1:$J$5,MATCH(LARGE(Alea!$K$1:$K$5,ROW()),Alea!$K$1:$K$5,0))","v":1}]
[null,null,null,null,null,null,null,null,null,null,null,null,null,null,"GAINS"]
[null,null,null,null,null,null,null,null,null,null,null,null,null,null,20]
[null,null,null,null,null,null,null,null,null,null,null,null,null,null,30]
[null,null,null,null,null,null,null,null,null,null,null,null,null,null,40]
[null,null,null,null,null,null,null,null,null,null,null,null,null,null,50]
[null,null,null,null,null,null,null,null,null,null,null,null,null,null,60]
[null,null,null,null,null,null,null,{"$f":"A2","v":4},{"$f":"B2","v":5},{"$f":"C2","v":1},null,null,null,null,80]
[]
[null,null,null,null,null,null,null,null,null,null,null,null,null,null,100]
[]
[]
[null,null,null,null,null,null,null,null,null,null,null,null,null,null,10]
[null,null,null,null,null,null,null,null,null,null,null,null,null,null,15]
[null,null,null,null,null,null,null,"Credits",{"$f":"I19","v":-0.5},327]
[]
[null,null,null,null,null,null,null,null,null,null,null,null,null,null,25]
[null,null,null,null,null,null,null,null,{"$f":"IFERROR(INDEX(Gain,MATCH(A2&B2&C2,Tirage,0)),-0.5)","v":-0.5}]
[null,null,null,null,null,null,null,null,null,null,null,null,null,null,250]
[null,null,null,null,null,null,null,null,null,null,null,null,null,null,45]
[null,null,null,null,null,null,null,null,null,null,null,null,null,null,400]

{"sheet":"Alea","index":1,"n_rows":5,"n_cols":11,"rows_kept":5,"cut":false,"hidden":false,"merged":[]}
[1,{"$f":"RAND()","v":0.97851053140686095},null,1,{"$f":"RAND()","v":9.0693276873457962E-2},null,1,{"$f":"RAND()","v":0.71886818302786071},null,1,{"$f":"RAND()","v":0.74813483477213472}]
[2,7.5021944629490633E-2,null,2,0.76388130281155942,null,2,0.2544941668348536,null,2,2.0217801147713099E-2]
[3,0.65086068862989865,null,3,7.8545183448198941E-2,null,3,0.68839747867116907,null,3,0.92052005947232496]
[4,0.65314781483761941,null,4,0.21467297221884507,null,4,0.30296779929607265,null,4,0.50445896686047353]
[5,0.15363108812300308,null,5,0.62613269774897018,null,5,0.73568019909436411,null,5,0.41982475283303611]

{"sheet":"Gains","index":2,"n_rows":106,"n_cols":7,"rows_kept":106,"cut":false,"hidden":false,"merged":[]}
["Tirage","Gain",null,"Tirage",null,null,"Gain"]
["111",20,null,"1","1","1",20]
["155",10,null,"2","2","2",30]
["166",15,null,"3","3","3",40]
["177",25,null,"4","4","4",50]
["188",45,null,"5","5",null,10]
["222",30,null,"5",null,"5",10]
["255",10,null,null,"5","5",10]
["266",15,null,"5","5","5",60]
["277",25,null,"6","6",null,15]
["288",45,null,"6",null,"6",15]
["333",40,null,null,"6","6",15]
["355",10,null,"6","6","6",80]
["366",15,null,"7","7",null,25]
["377",25,null,"7",null,"7",25]
["388",45,null,null,"7","7",25]
["444",50,null,"7","7","7",100]
["455",10,null,"8","8",null,45]
["466",15,null,"8",null,"8",45]
["477",25,null,null,"8","8",45]
["488",45,null,"8","8","8",250]
["515",10,null,"9","9","9",400]
["525",10]
["535",10]
["545",10]
["551",10]
["552",10]
["553",10]
["554",10]
["555",60]
["556",10]
["557",10]
["558",10]
["559",10]
["565",10]
["566",15]
["575",10]
["577",25]
["585",10]
["588",45]
["595",10]
["616",15]
["626",15]
["636",15]
["646",15]
["655",10]
["656",15]
["661",15]
["662",15]
["663",15]
["664",15]
["665",15]
["666",80]
["667",15]
["668",15]
["669",15]
["676",15]
["677",25]
["686",15]
["688",45]
["696",15]
["717",25]
["727",25]
["737",25]
["747",25]
["755",10]
["757",25]
["766",15]
["767",25]
["771",25]
["772",25]
["773",25]
["774",25]
["775",25]
["776",25]
["777",45]
["778",25]
["779",25]
["787",25]
["788",45]
["797",25]
["818",45]
["828",45]
["838",45]
["848",45]
["855",10]
["858",45]
["866",15]
["868",45]
["877",25]
["878",45]
["881",45]
["882",45]
["883",45]
["884",45]
["885",45]
["886",45]
["887",45]
["888",250]
["889",45]
["898",45]
["955",10]
["966",10]
["977",25]
["988",45]
["999",400]