{"text_format":"1","workbook":"xlsx","n_sheets":3,"sheets":["Classement de la FIFA","matchs amicaux","coupe du monde 2014"],"not_rendered":{"charts":0,"images":209,"macros":1,"external_links":0,"defined_names":3,"comments":0,"pivot_tables":0},"unopened":[],"bounds":{"document_bytes":16777216,"sheet_cells":100000,"rows_first":2000,"rows_last":500,"rows_between":2000,"halvings":0,"cell_chars":16384,"cell_head_chars":4096},"cells_cut":0,"cells_raw":0,"read":"whole","date_system":"1900"}

{"sheet":"Classement de la FIFA","index":0,"n_rows":60,"n_cols":42,"rows_kept":60,"cut":false,"hidden":false,"merged":[]}
[]
[null,1,null,null,null,"Espagne                           1485 points",null,31,null,null,null,"Panama                              743 points",null,61,null,null,null,"Finlande                             532 points",null,91,null,null,null,"Arabie Saoudite              381 points",null,120,null,null,null,"Aruba                                  254 points",null,151,null,null,null,"Antigua-et-Barbuda      158 points",null,181,null,null,null,"Seychelles                           66 points"]
[]
[null,2,null,null,null,"Allemagne                      1300 points",null,32,null,null,null,"Suède                                  741 points",null,62,null,null,null,"Australie                            526 points",null,92,null,null,null,"Botswana                           375 points",null,122,null,null,null,"Malawi                                247 points",null,152,null,null,null,"Belize                                  152 points",null,182,null,null,null,"Curaçao                                 65 points"]
[]
[null,3,null,null,null,"Brésil                                 1242 points",null,33,null,null,null,"Honduras                           731 points",null,63,null,null,null,"Jordanie                             510 points",null,93,null,null,null,"Angola                                364 points",null,123,null,null,null,"Viêt-Nam                           242 points",null,153,null,null,null,"Malaisie                             149 points",null,183,null,null,null,"Yémen                                   61 points"]
[]
[null,4,null,null,null,"Portugal                           1189 points",null,34,null,null,null,"République Tchèque    724 points",null,64,null,null,null,"Libye                                    498 points",null,94,null,null,null,"Palestine                           358 points",null,124,null,null,null,"Kazakhstan                        241 points",null,154,null,null,null,"Inde                                     144 points",null,184,null,null,null,"Maurice                                57 points"]
[]
[null,5,null,null,null,"Argentine                        1175 points",null,35,null,null,null,"Turquie                               722 points",null,65,null,null,null,"Afrique du Sud                496 points",null,95,null,null,null,"Cuba                                    354 points",null,125,null,null,null,"Liban                                    233 points",null,155,null,null,null,"Singapour                          141 points",null,185,null,null,null,"Soudan du Sud                   47 points"]
[]
[null,6,null,null,null,"Suisse                               1149 points",null,36,null,null,null,"Egypte                                 715 points",null,66,null,null,null,"Albanie                               495 points",null,96,null,null,null,"Géorgie                              349 points",null,126,null,null,null,"Tadjikistan                        229 points",null,156,null,null,null,"Guyana                               137 points",null,186,null,null,null,"Bahamas                               40 points"]
[]
[null,7,null,null,null,"Uruguay                           1147 points",null,37,null,null,null,"Ghana                                  704 points",null,67,null,null,null,"Bolivie                                483 points",null,97,null,null,null,"Nouvelle-Zélande         347 points",null,127,null,null,null,"Guatemala                        226 points",null,157,null,null,null,"Indonésie                          135 points",null,187,null,null,null,"Mongolie                             35 points"]
[]
[null,8,null,null,null,"Colombie                        1137 points",null,38,null,null,null,"Arménie                             682 points",null,68,null,null,null,"El Salvador                        481 points",null,98,null,null,null,"Estonie                               343 points",null,128,null,null,null,"Burundi                              221 points",null,158,null,null,null,"Porto Rico                          134 points",null,188,null,null,null,"Fidji                                        34 points"]
[]
[null,9,null,null,null,"Italie                                  1104 points",null,39,null,null,null,"Cap-Vert                            674 points",null,69,null,null,null,"Pologne                              474 points",null,99,null,null,null,"Zimbabwe                         340 points",null,129,null,null,null,"Philippines                       217 points",null,159,null,null,null,"Myanmar                           133 points",null,189,null,null,null,"Samoa                                   32 points"]
[]
[null,10,null,null,null,"Angleterre                      1090 points",null,40,null,null,null,"Venezuela                         672 points",null,70,null,null,null,"Irlande                                473 points",null,100,null,null,null,"Qatar                                   339 points",null,130,null,null,null,"Afghanistan                      215 points",null,160,null,null,null,"Saint-Kitts-et-Nevis      124 points",null,190,null,null,null,"Cambodge                           28 points"]
[]
[null,11,null,null,null,"Belgique                          1074 points",null,41,null,null,null,"Pays de Galles                 644 points",null,71,null,null,null,"Trinité-et-Tobago          470 points",null,101,null,null,null,"Moldavie                           334 points",null,131,null,null,null,"République dominicaine 212 points",null,161,null,null,null,"Tahiti                                   122 points",null,190,null,null,null,"Vanuatu                                28 points"]
[]
[null,12,null,null,null,"Grèce                                1064 points",null,42,null,null,null,"Autriche                             643 points",null,72,null,null,null,"Emirats arabes unis       460 points",null,102,null,null,null,"Guinée Équatoriale       333 points",null,132,null,null,null,"Malte                                   204 points",null,162,null,null,null,"Liechtenstein                   118 points",null,192,null,null,null,"Brunei                                   26 points"]
[]
[null,13,null,null,null,"Etats-Unis                        1035 points",null,43,null,null,null,"Iran                                       641 points",null,73,null,null,null,"Haïti                                     452 points",null,103,null,null,null,"Chine                                   331 points",null,133,null,null,null,"Saint-Vincent-et-les-Grenadines                       203 points",null,163,null,null,null,"Hongkong                          112 points",null,192,null,null,null,"Timor Oriental                   26 points"]
[]
[null,14,null,null,null,"Chili                                   1026 points",null,44,null,null,null,"Nigéria                                640 points",null,74,null,null,null,"Sénégal                              451 points",null,104,null,null,null,"Irak                                       329 points",null,134,null,null,null,"Guinée-Bissau                 201 points",null,164,null,null,null,"Pakistan                             102 points",null,192,null,null,null,"Tonga                                     26 points"]
[]
[null,15,null,null,null,"Pays-Bas                             981 points",null,45,null,null,null,"Pérou                                  627 points",null,75,null,null,null,"Israël                                   444 points",null,105,null,null,null,"République centrafricaine                  321 points",null,134,null,null,null,"Tchad                                   201 points",null,164,null,null,null,"Népal                                  102 points",null,195,null,null,null,"Iles Vierges Américaines 23 points"]
[]
[null,16,null,null,null,"Ukraine                               915 points",null,46,null,null,null,"Japon                                   626 points",null,76,null,null,null,"Zambie                               441 points",null,106,null,null,null,"Lituanie                              319 points",null,136,null,null,null,"Suriname                           197 points",null,166,null,null,null,"Montserrat                          99 points",null,196,null,null,null,"Iles Caïmans                        21 points"]
[]
[null,17,null,null,null,"France                                 913 points",null,47,null,null,null,"Hongrie                              624 points",null,77,null,null,null,"Maroc                                  439 points",null,107,null,null,null,"Ethiopie                             317 points",null,137,null,null,null,"Mauritanie                        196 points",null,167,null,null,null,"Bangladesh                         98 points",null,196,null,null,null,"Papouasie-Nouvelle-Guinée                                  21 points"]
[]
[null,18,null,null,null,"Croatie                                903 points",null,48,null,null,null,"Tunisie                                612 points",null,78,null,null,null,"Bulgarie                              425 points",null,108,null,null,null,"Kenya                                  296 points",null,137,null,null,null,"Sainte-Lucie                     196 points",null,168,null,null,null,"Laos                                        97 points",null,198,null,null,null,"Iles Vierges Britanniques 18 points"]
[]
[null,19,null,null,null,"Russie                                 893 points",null,49,null,null,null,"Slovaquie                          591 points",null,79,null,null,null,"Oman                                  420 points",null,109,null,null,null,"Lettonie                             293 points",null,139,null,null,null,"Lesotho                              194 points",null,169,null,null,null,"Dominique                          93 points",null,198,null,null,null,"Samoa américaines         18 points"]
[]
[null,20,null,null,null,"Mexique                            882 points",null,50,null,null,null,"Paraguay                            575 points",null,80,null,null,null,"Macédoine                        419 points",null,110,null,null,null,"Bahreïn                               289 points",null,140,null,null,null,"Nouvelle-Calédonie     190 points",null,170,null,null,null,"Barbade                                92 points",null,200,null,null,null,"Andorre                                16 points"]
[]
[null,21,null,null,null,"Bosnie-Herzégovine     873 points",null,51,null,null,null,"Monténégro                     574 points",null,81,null,null,null,"Jamaïque                           411 points",null,110,null,null,null,"Canada                                289 points",null,140,null,null,null,"Syrie                                    190 points",null,171,null,null,null,"Iles Féroé                             89 points",null,201,null,null,null,"Erythrée                               11 points"]
[]
[null,22,null,null,null,"Algérie                                858 points",null,52,null,null,null,"Guinée                                566 points",null,82,null,null,null,"Bélarus                               397 points",null,112,null,null,null,"Niger                                   284 points",null,142,null,null,null,"Chypre                                189 points",null,172,null,null,null,"Sao Tomé e Principe       86 points",null,202,null,null,null,"Somalie                                   8 points"]
[]
[null,23,null,null,null,"Côte d'Ivoire                    809 points",null,52,null,null,null,"Islande                                566 points",null,83,null,null,null,"Azerbaïdjan                      396  points",null,113,null,null,null,"Tanzanie                            283 points",null,143,null,null,null,"Turkménistan                  183 points",null,173,null,null,null,"Swaziland                            85 points",null,202,null,null,null,"Macau                                      8 points"]
[]
[null,23,null,null,null,"Danemark                          809 points",null,54,null,null,null,"Sierra Leone                     565 points",null,84,null,null,null,"République Démocratique du Congo 395 points",null,114,null,null,null,"Namibie                             277 points",null,144,null,null,null,"Grenade                             182 points",null,174,null,null,null,"Comores                               84 points",null,204,null,null,null,"Djibouti                                   6 points"]
[]
[null,25,null,null,null,"Slovénie                             800 points",null,55,null,null,null,"Norvège                             562 points",null,85,null,null,null,"Congo-Brazzaville          393 points",null,115,null,null,null,"Koweït                                276 points",null,144,null,null,null,"Madagascar                       182 points",null,175,null,null,null,"Bermudes                            83 points",null,205,null,null,null,"Iles Cook                                 5 points"]
[]
[null,26,null,null,null,"Equateur                            791 points",null,56,null,null,null,"Cameroun                         558 points",null,86,null,null,null,"Ouganda                            390 points",null,116,null,null,null,"Libéria                                 271 points",null,146,null,null,null,"Corée du Nord                 175 points",null,176,null,null,null,"Nicaragua                             78 points",null,206,null,null,null,"Anguilla                                  3 points"]
[]
[null,27,null,null,null,"Ecosse                                 786 points",null,57,null,null,null,"Corée du Sud                   547 points",null,87,null,null,null,"Bénin                                   386 points",null,116,null,null,null,"Rwanda                              271 points",null,147,null,null,null,"Iles Maldives                    171 points",null,176,null,null,null,"Chinese Taipei                   78 points",null,207,null,null,null,"Bhoutan                                  0 points"]
[]
[null,28,null,null,null,"Costa Rica                          762 points",null,57,null,null,null,"Mali                                      547 points",null,88,null,null,null,"Togo                                     383 points",null,118,null,null,null,"Mozambique                    269 points",null,148,null,null,null,"Gambie                               166 points",null,178,null,null,null,"Guam                                     77 points",null,207,null,null,null,"Saint-Marin                           0 points"]
[]
[null,29,null,null,null,"Roumanie                          761 points",null,59,null,null,null,"Ouzbékistan                     539 points",null,89,null,null,null,"Gabon                                 382 points",null,119,null,null,null,"Luxembourg                     267 points",null,149,null,null,null,"Kirghizistan                       163 points",null,179,null,null,null,"Sri Lanka                               73 points",null,207,null,null,null,"Turks et Caicos                     0 points"]
[]
[null,30,null,null,null,"Serbie                                 745 points",null,60,null,null,null,"Burkina Faso                     538 points",null,90,null,null,null,"Irlande du Nord              381 points",null,120,null,null,null,"Soudan                               254 points",null,149,null,null,null,"Thaïlande                           163 points",null,180,null,null,null,"Iles Salomon                       70 points"]

{"sheet":"matchs amicaux","index":1,"n_rows":63,"n_cols":36,"rows_kept":63,"cut":false,"hidden":false,"merged":[[61,13,61,14],[61,20,61,21],[62,13,62,14],[62,20,62,21],[58,20,58,21],[59,13,59,14],[59,20,59,21],[60,13,60,14],[60,20,60,21],[50,14,50,16],[50,19,50,21],[51,14,51,16],[51,19,51,21],[52,14,52,16],[52,19,52,21],[46,19,46,21],[47,14,47,16],[47,19,47,21],[48,14,48,16],[48,19,48,21],[49,14,49,16],[49,19,49,21],[62,1,62,2],[62,8,62,9],[53,2,53,4],[53,7,53,9],[43,14,43,21],[44,14,44,16],[44,19,44,21],[45,14,45,16],[45,19,45,21],[46,14,46,16],[58,8,58,9],[59,1,59,2],[59,8,59,9],[60,1,60,2],[60,8,60,9],[61,1,61,2],[61,8,61,9],[50,2,50,4],[50,7,50,9],[51,2,51,4],[51,7,51,9],[52,2,52,4],[52,7,52,9],[47,2,47,4],[47,7,47,9],[48,2,48,4],[48,7,48,9],[49,2,49,4],[49,7,49,9],[43,2,43,9],[44,2,44,4],[44,7,44,9],[45,2,45,4],[45,7,45,9],[46,2,46,4],[46,7,46,9],[39,25,39,26],[39,32,39,33],[40,25,40,26],[40,32,40,33],[33,26,33,28],[33,31,33,33],[32,26,32,28],[32,31,32,33],[36,32,36,33],[37,25,37,26],[37,32,37,33],[38,25,38,26],[38,32,38,33],[29,26,29,28],[29,31,29,33],[30,26,30,28],[30,31,30,33],[31,26,31,28],[31,31,31,33],[26,26,26,28],[26,31,26,33],[27,26,27,28],[27,31,27,33],[28,26,28,28],[28,31,28,33],[22,26,22,33],[23,26,23,28],[23,31,23,33],[24,26,24,28],[24,31,24,33],[25,26,25,28],[25,31,25,33],[38,13,38,14],[38,20,38,21],[26,19,26,21],[27,14,27,16],[27,19,27,21],[28,14,28,16],[28,19,28,21],[29,14,29,16],[29,19,29,21],[22,14,22,21],[23,14,23,16],[23,19,23,21],[24,14,24,16],[24,19,24,21],[25,14,25,16],[25,19,25,21],[26,14,26,16],[39,13,39,14],[39,20,39,21],[40,13,40,14],[40,20,40,21],[30,14,30,16],[30,19,30,21],[31,14,31,16],[31,19,31,21],[36,20,36,21],[37,13,37,14],[37,20,37,21],[32,14,32,16],[32,19,32,21],[39,1,39,2],[39,8,39,9],[40,1,40,2],[40,8,40,9],[36,8,36,9],[37,1,37,2],[37,8,37,9],[38,1,38,2],[38,8,38,9],[31,2,31,4],[31,7,31,9],[28,2,28,4],[28,7,28,9],[29,2,29,4],[29,7,29,9],[30,2,30,4],[30,7,30,9],[25,2,25,4],[25,7,25,9],[26,2,26,4],[26,7,26,9],[27,2,27,4],[27,7,27,9],[22,2,22,9],[23,2,23,4],[23,7,23,9],[24,2,24,4],[24,7,24,9],[17,20,17,21],[16,20,16,21],[15,20,15,21],[19,32,19,33],[18,32,18,33],[17,32,17,33],[16,32,16,33],[15,32,15,33],[19,25,19,26],[18,25,18,26],[17,25,17,26],[16,25,16,26],[19,8,19,9],[18,8,18,9],[17,8,17,9],[16,8,16,9],[19,20,19,21],[18,20,18,21],[16,13,16,14],[5,31,5,33],[4,31,4,33],[3,31,3,33],[2,31,2,33],[5,26,5,28],[4,26,4,28],[3,26,3,28],[2,26,2,28],[11,31,11,33],[10,31,10,33],[9,31,9,33],[8,31,8,33],[7,31,7,33],[6,31,6,33],[11,26,11,28],[10,26,10,28],[9,26,9,28],[8,26,8,28],[7,26,7,28],[6,26,6,28],[17,13,17,14],[18,13,18,14],[19,13,19,14],[8,14,8,16],[8,19,8,21],[9,14,9,16],[9,19,9,21],[10,14,10,16],[10,19,10,21],[7,14,7,16],[7,19,7,21],[1,14,1,21],[2,14,2,16],[2,19,2,21],[3,14,3,16],[3,19,3,21],[4,14,4,16],[4,19,4,21],[19,1,19,2],[18,1,18,2],[17,1,17,2],[16,1,16,2],[15,8,15,9],[13,2,13,4],[12,2,12,4],[11,2,11,4],[10,2,10,4],[13,7,13,9],[12,7,12,9],[11,7,11,9],[10,7,10,9],[54,2,54,4],[54,7,54,9],[9,7,9,9],[8,7,8,9],[7,7,7,9],[6,7,6,9],[1,26,1,33],[5,2,5,4],[4,2,4,4],[3,2,3,4],[2,2,2,4],[1,2,1,9],[9,2,9,4],[8,2,8,4],[7,2,7,4],[6,2,6,4],[5,7,5,9],[4,7,4,9],[3,7,3,9],[2,7,2,9],[5,14,5,16],[5,19,5,21],[6,14,6,16],[6,19,6,21]]}
[]
[null,null,"GROUPE A",null,null,null,null,null,null,null,null,null,null,null,"GROUPE B",null,null,null,null,null,null,null,null,null,null,null,"GROUPE C"]
[null,null,"Brésil",null,null,4,0,"Panama",null,null,null,null,null,null,"Australie",null,null,1,1,"Afrique du Sud",null,"Afrique du Sud",null,null,null,null,"Colombie",null,null,2,2,"Sénégal"]
[null,null,"Brésil",null,null,1,0,"Serbie",null,null,null,null,null,null,"Croatie",null,null,1,0,"Australie",null,"Australie",null,null,null,null,"Colombie",null,null,3,0,"Jordanie"]
[null,null,"Macédoine",null,null,0,2,"Cameroun",null,null,null,null,null,null,"Chili",null,null,3,2,"Egypte",null,"Egypte",null,null,null,null,"Bosnie-Herzégovine",null,null,2,1,"Côte d'Ivoire"]
[null,null,"Cameroun",null,null,1,2,"Paraguay",null,null,null,null,null,null,"Chili",null,null,2,0,"Irlande du Nord",null,"Irlande du Nord",null,null,null,null,"El Salvador",null,null,1,2,"Côte d'Ivoire"]
[null,null,"Allemagne",null,null,2,2,"Cameroun",null,null,null,null,null,null,"Espagne",null,null,2,0,"Bolivie",null,"Bolivie",null,null,null,null,"Portugal",null,null,0,0,"Grèce"]
[null,null,"Cameroun",null,null,1,0,"Moldavie",null,null,null,null,null,null,"El Salvador",null,null,0,2,"Espagne",null,"Espagne",null,null,null,null,"Grèce",null,null,0,0,"Nigéria"]
[null,null,"Croatie",null,null,2,1,"Mali",null,null,null,null,null,null,"Pays-Bas",null,null,1,1,"Equateur",null,"Equateur",null,null,null,null,"Grèce",null,null,2,1,"Bolivie"]
[null,null,"Croatie",null,null,1,0,"Australie",null,null,null,null,null,null,"Pays-Bas",null,null,1,0,"Ghana",null,"Ghana",null,null,null,null,"Japon",null,null,1,0,"Chypre"]
[null,null,"Mexique",null,null,3,0,"Israël",null,null,null,null,null,null,"Pays-Bas",null,null,2,0,"Pays de Galles",null,"Pays de Galles",null,null,null,null,"Costa Rica",null,null,1,3,"Japon"]
[null,null,"Mexique",null,null,3,1,"Equateur",null,null,null,null,null,null,null,null,null,null,null,null,null,null,null,null,null,null,"Japon",null,null,4,3,"Zambie"]
[null,null,"Mexique",null,null,0,1,"Bosnie-Herzégovine"]
[null,null,"Mexique",null,null,0,1,"Portugal"]
[]
[null,null,null,"V","D","N","BP","BC","Moy BP",null,"Moy BC","DIFF",null,null,null,"V","D","N","BP","BC","Moy BP",null,"Moy BC","DIFF",null,null,null,"V","D","N","BP","BC","Moy BP",null,"Moy BC","DIFF"]
[null,"Brésil",null,2,0,0,{"$f":"SUM(F3,F4)","v":5},{"$f":"SUM(G3,G4)","v":0},{"$f":"G17/2","v":2.5},null,{"$f":"H17/2","v":0},{"$f":"I17-K17","v":2.5},null,"Australie",null,0,1,1,{"$f":"SUM(R3,S4)","v":1},{"$f":"SUM(S3,R4)","v":2},{"$f":"S17/2","v":0.5},null,{"$f":"T17/2","v":1},{"$f":"U17-W17","v":-0.5},null,"Colombie",null,1,0,1,{"$f":"SUM(AD3,AD4)","v":5},{"$f":"SUM(AE3,AE4)","v":2},{"$f":"AE17/2","v":2.5},null,{"$f":"AF17/2","v":1},{"$f":"AG17-AI17","v":1.5}]
[null,"Cameroun",null,2,1,1,{"$f":"SUM(F6,G7,F8)","v":4},{"$f":"SUM(F5,G6,F7,G8)","v":4},{"$f":"G18/4","v":1},null,{"$f":"H18/4","v":1},{"$f":"I18-K18","v":0},null,"Chili",null,2,0,0,{"$f":"SUM(R5,R6)","v":5},{"$f":"SUM(S5,S6)","v":2},{"$f":"S18/2","v":2.5},null,{"$f":"T18/2","v":1},{"$f":"U18-W18","v":1.5},null,"Côte d'Ivoire",null,1,1,0,{"$f":"SUM(AE5,AE6)","v":3},{"$f":"SUM(AD5,AD6)","v":3},{"$f":"AE18/2","v":1.5},null,{"$f":"AF18/2","v":1.5},{"$f":"AG18-AI18","v":0}]
[null,"Croatie",null,2,0,0,{"$f":"SUM(F9,F10)","v":3},{"$f":"SUM(G9,G10)","v":1},{"$f":"G19/2","v":1.5},null,{"$f":"H19/2","v":0.5},1,null,"Espagne",null,2,0,0,{"$f":"SUM(R7,S8)","v":4},{"$f":"SUM(S7,R8)","v":0},{"$f":"S19/2","v":2},null,0,2,null,"Grèce",null,1,0,2,{"$f":"SUM(AE7,AD8,AD9)","v":2},{"$f":"SUM(AD7,AE8,AE9)","v":1},{"$f":"AE19/3","v":0.66666666666666663},null,{"$f":"AF19/3","v":0.33333333333333331},0.33333333333333331]
[null,"Mexique",null,2,2,0,{"$f":"SUM(F11,F12,F13,F14)","v":6},{"$f":"SUM(G11,G12,G13,G14)","v":3},{"$f":"G20/4","v":1.5},null,{"$f":"H20/4","v":0.75},0.75,null,"Pays-Bas",null,2,0,1,{"$f":"SUM(R9,R10,R11)","v":4},{"$f":"SUM(S9,S10,S11)","v":1},{"$f":"S20/3","v":1.3333333333333333},null,{"$f":"T20/3","v":0.33333333333333331},1,null,"Japon",null,3,0,0,{"$f":"SUM(AD10,AE11,AD12)","v":8},{"$f":"SUM(AE10,AD11,AE12)","v":4},{"$f":"AE20/3","v":2.6666666666666665},null,{"$f":"AF20/3","v":1.3333333333333333},1.3333333333333333]
[]
[]
[null,null,"GROUPE D",null,null,null,null,null,null,null,null,null,null,null,"GROUPE E",null,null,null,null,null,null,null,null,null,null,null,"GROUPE F"]
[null,null,"Angleterre",null,null,3,0,"Pérou",null,null,null,null,null,null,"Pays-Bas",null,null,1,1,"Equateur",null,"Equateur",null,null,null,null,"Argentine",null,null,3,0,"Trinité-et-Tobago"]
[null,null,"Equateur",null,null,2,2,"Angleterre",null,null,null,null,null,null,"Mexique",null,null,3,1,"Equateur",null,null,null,null,null,null,"Argentine",null,null,2,0,"Slovénie"]
[null,null,"Angleterre",null,null,0,0,"Honduras",null,null,null,null,null,null,"Equateur",null,null,2,2,"Angleterre",null,null,null,null,null,null,"Bosnie-Herzégovine",null,null,2,1,"Côte d'Ivoire"]
[null,null,"Costa Rica",null,null,1,3,"Japon",null,null,null,null,null,null,"France",null,null,4,0,"Norvège",null,null,null,null,null,null,"Mexique",null,null,0,1,"Bosnie-Herzégovine"]
[null,null,"Costa Rica",null,null,1,1,"Irlande",null,null,null,null,null,null,"France",null,null,1,1,"Paraguay",null,null,null,null,null,null,"Iran",null,null,0,0,"Bélarus"]
[null,null,"Italie",null,null,0,0,"Irlande",null,null,null,null,null,null,"France",null,null,8,0,"Jamaïque",null,null,null,null,null,null,"Monténégro",null,null,0,0,"Iran"]
[null,null,"Italie",null,null,1,1,"Luxembourg",null,null,null,null,null,null,"Honduras",null,null,0,2,"Turquie",null,null,null,null,null,null,"Iran",null,null,1,1,"Angola"]
[null,null,"Uruguay",null,null,1,0,"Irlande du Nord",null,null,null,null,null,null,"Honduras",null,null,2,4,"Israël",null,null,null,null,null,null,"Trinité-et-Tobago",null,null,0,2,"Iran"]
[null,null,"Uruguay",null,null,2,0,"Slovénie",null,null,null,null,null,null,"Suisse",null,null,1,0,"Jamaïque",null,null,null,null,null,null,"Nigéria",null,null,2,2,"Ecosse"]
[null,null,null,null,null,null,null,null,null,null,null,null,null,null,"Suisse",null,null,2,0,"Pérou",null,null,null,null,null,null,"Grèce",null,null,0,0,"Nigéria"]
[null,null,null,null,null,null,null,null,null,null,null,null,null,null,null,null,null,null,null,null,null,null,null,null,null,null,"Etats-Unis",null,null,2,1,"Nigéria"]
[]
[]
[null,null,null,"V","D","N","BP","BC","Moy BP",null,"Moy BC","DIFF",null,null,null,"V","D","N","BP","BC","Moy BP",null,"Moy BC","DIFF",null,null,null,"V","D","N","BP","BC","Moy BP",null,"Moy BC","DIFF"]
[null,"Angleterre",null,1,0,2,{"$f":"SUM(F24,G25,F26)","v":5},{"$f":"SUM(G24,F25,G26)","v":2},{"$f":"G38/3","v":1.6666666666666667},null,{"$f":"H38/3","v":0.66666666666666663},{"$f":"I38-K38","v":1},null,"Equateur",null,0,1,2,{"$f":"SUM(S24,S25,R26)","v":4},{"$f":"SUM(R24,R25,S26)","v":6},{"$f":"S38/3","v":1.3333333333333333},null,{"$f":"T38/3","v":2},{"$f":"U38-W38","v":-0.66666666666666674},null,"Argentine",null,2,0,0,{"$f":"SUM(AD24,AD25)","v":5},{"$f":"SUM(AE24,AE25)","v":0},{"$f":"AE38/2","v":2.5},null,{"$f":"AF38/2","v":0},{"$f":"AG38-AI38","v":2.5}]
[null,"Costa Rica",null,0,1,1,{"$f":"SUM(F27,F28)","v":2},{"$f":"SUM(G27,G28)","v":4},{"$f":"G39/2","v":1},null,{"$f":"H39/2","v":2},{"$f":"I39-K39","v":-1},null,"France",null,2,0,1,{"$f":"SUM(R27,R28,R29)","v":13},{"$f":"SUM(S27,S28,S29)","v":1},{"$f":"S39/3","v":4.333333333333333},null,{"$f":"T39/3","v":0.33333333333333331},{"$f":"U39-W39","v":3.9999999999999996},null,"Bosnie-Herzégovine",null,2,0,0,{"$f":"SUM(AD26,AE27)","v":3},{"$f":"SUM(AE26,AD27)","v":1},{"$f":"AE39/2","v":1.5},null,{"$f":"AF39/2","v":0.5},{"$f":"AG39-AI39","v":1}]
[null,"Italie",null,0,0,2,{"$f":"SUM(F29,F30)","v":1},{"$f":"SUM(G29,G30)","v":1},{"$f":"G40/2","v":0.5},null,{"$f":"H40/2","v":0.5},0,null,"Honduras",null,0,2,0,{"$f":"SUM(R30,R31)","v":2},{"$f":"SUM(S30,S31)","v":6},{"$f":"S40/2","v":1},null,{"$f":"T40/2","v":3},-2,null,"Iran",null,1,0,3,{"$f":"SUM(AD28,AE29,AD30,AE31)","v":3},{"$f":"SUM(AE28,AD29,AE30,AD31)","v":1},{"$f":"AE40/4","v":0.75},null,{"$f":"AF40/4","v":0.25},0.5]
[null,"Uruguay",null,2,0,0,{"$f":"SUM(F31,F32)","v":3},{"$f":"SUM(G31,G32)","v":0},{"$f":"G41/2","v":1.5},null,{"$f":"H41/2","v":0},1.5,null,"Suisse",null,2,0,0,{"$f":"SUM(R32,R33)","v":3},{"$f":"SUM(S32,S33)","v":0},{"$f":"S41/2","v":1.5},null,{"$f":"T41/2","v":0},1.5,null,"Nigéria",null,0,1,2,{"$f":"SUM(AD32,AE33,AE34)","v":3},{"$f":"SUM(AE32,AD33,AD34)","v":4},{"$f":"AE41/3","v":1},null,{"$f":"AF41/3","v":1.3333333333333333},-0.33333333333333326]
[]
[]
[null,null,"GROUPE G",null,null,null,null,null,null,null,null,null,null,null,"GROUPE H"]
[null,null,"Allemagne",null,null,0,0,"Pologne",null,null,null,null,null,null,"Algérie",null,null,2,1,"Roumanie"]
[null,null,"Allemagne",null,null,2,2,"Cameroun",null,null,null,null,null,null,"Belgique",null,null,5,1,"Luxembourg"]
[null,null,"Allemagne",null,null,6,1,"Arménie",null,null,null,null,null,null,"Suède",null,null,0,2,"Belgique"]
[null,null,"Etats-Unis",null,null,2,0,"Azerbaïdjan",null,null,null,null,null,null,"Belgique",null,null,1,0,"Tunisie"]
[null,null,"Etats-Unis",null,null,2,1,"Turquie",null,null,null,null,null,null,"Corée du Sud",null,null,0,1,"Tunisie"]
[null,null,"Etats-Unis",null,null,2,1,"Nigéria",null,null,null,null,null,null,"Ghana",null,"Ghana",4,0,"Corée du Sud"]
[null,null,"Pays-Bas",null,null,1,0,"Ghana",null,"Ghana",null,null,null,null,"Russie",null,null,1,0,"Slovaquie"]
[null,null,"Ghana",null,"Ghana",4,0,"Corée du Sud",null,null,null,null,null,null,"Norvège",null,null,1,1,"Russie"]
[null,null,"Portugal",null,null,0,0,"Grèce",null,null,null,null,null,null,"Russie",null,null,2,0,"Maroc"]
[null,null,"Mexique",null,null,0,1,"Portugal"]
[null,null,"Irlande",null,null,1,5,"Portugal"]
[]
[]
[]
[null,null,null,"V","D","N","BP","BC","Moy BP",null,"Moy BC","DIFF",null,null,null,"V","D","N","BP","BC","Moy BP",null,"Moy BC","DIFF"]
[null,"Allemagne",null,1,0,2,{"$f":"SUM(F45,F46,F47)","v":8},{"$f":"SUM(G45,G46,G47)","v":3},{"$f":"G60/3","v":2.6666666666666665},null,{"$f":"H60/3","v":1},{"$f":"I60-K60","v":1.6666666666666665},null,"Algérie","Algérie",1,0,0,{"$f":"SUM(R45)","v":2},{"$f":"SUM(S45)","v":1},{"$f":"S60/1","v":2},null,{"$f":"T60/1","v":1},{"$f":"U60-W60","v":1}]
[null,"Etats-Unis",null,3,0,0,{"$f":"SUM(F48,F49,F50)","v":6},{"$f":"SUM(G48,G49,G50)","v":2},{"$f":"G61/3","v":2},null,{"$f":"H61/3","v":0.66666666666666663},{"$f":"I61-K61","v":1.3333333333333335},null,"Belgique","Belgique",3,0,0,{"$f":"SUM(R46,S47,R48)","v":8},{"$f":"SUM(S46,R47,S48)","v":1},{"$f":"S61/3","v":2.6666666666666665},null,{"$f":"T61/3","v":0.33333333333333331},{"$f":"U61-W61","v":2.333333333333333}]
[null,"Ghana",null,1,1,0,{"$f":"SUM(G51,F52)","v":4},{"$f":"SUM(F51,G52)","v":1},{"$f":"G62/2","v":2},null,{"$f":"H62/2","v":0.5},1.5,null,"Corée du Sud","Corée du Sud",0,2,0,{"$f":"SUM(R49,S50)","v":0},{"$f":"SUM(S49,R50)","v":5},{"$f":"S62/2","v":0},null,{"$f":"T62/2","v":2.5},-2.5]
[null,"Portugal",null,2,0,1,{"$f":"SUM(F53,G54,G55)","v":6},{"$f":"SUM(G53,F54,F55)","v":1},{"$f":"G63/3","v":2},null,{"$f":"H63/3","v":0.33333333333333331},1.6666666666666667,null,"Russie","Russie",2,0,1,{"$f":"SUM(R51,S52,R53)","v":4},{"$f":"SUM(S51,R52,S53)","v":1},{"$f":"S63/2","v":2},null,{"$f":"T63/2","v":0.5},1.5]

{"sheet":"coupe du monde 2014","index":2,"n_rows":64,"n_cols":57,"rows_kept":64,"cut":false,"hidden":false,"merged":[[28,40,29,40],[26,40,27,40],[30,39,31,39],[30,40,31,40],[31,53,32,55],[26,37,27,37],[36,46,37,46],[36,45,37,45],[34,46,35,46],[34,45,35,45],[32,46,33,46],[32,45,33,45],[30,46,31,46],[30,45,31,45],[32,39,33,39],[28,53,30,55],[28,51,30,52],[35,51,36,52],[33,51,34,52],[31,51,32,52],[25,54,26,54],[25,53,26,53],[32,40,33,40],[23,34,25,39],[23,40,25,40],[28,38,29,38],[28,39,29,39],[26,39,27,39],[41,50,42,50],[41,51,42,51],[41,52,42,52],[41,55,42,55],[41,56,42,56],[36,42,37,43],[36,44,37,44],[36,47,37,47],[36,48,37,48],[34,42,35,42],[34,43,35,43],[34,44,35,44],[34,47,35,47],[34,48,35,48],[35,53,36,55],[33,53,34,55],[40,40,41,40],[38,40,39,40],[34,40,35,40],[36,40,37,40],[43,50,44,51],[43,52,44,52],[43,55,44,55],[43,56,44,56],[43,54,44,54],[43,53,44,53],[41,54,42,54],[41,53,42,53],[38,50,40,55],[38,56,40,56],[20,50,22,55],[20,56,22,56],[23,50,24,50],[23,51,24,51],[23,52,24,52],[23,55,24,55],[32,42,33,43],[32,44,33,44],[32,47,33,47],[32,48,33,48],[27,42,29,47],[27,48,29,48],[30,42,31,42],[30,43,31,43],[30,44,31,44],[30,47,31,47],[30,48,31,48],[23,56,24,56],[25,50,26,51],[25,52,26,52],[25,55,26,55],[25,56,26,56],[23,54,24,54],[23,53,24,53],[30,34,31,34],[26,34,27,34],[28,37,29,37],[26,38,27,38],[40,34,41,35],[40,36,41,36],[40,37,41,37],[40,38,41,38],[36,34,37,35],[32,37,33,37],[32,38,33,38],[30,37,31,37],[30,38,31,38],[32,34,33,35],[36,32,37,32],[34,32,35,32],[48,32,49,32],[46,32,47,32],[44,32,45,32],[42,32,43,32],[40,32,41,32],[38,32,39,32],[40,39,41,39],[38,34,39,34],[34,34,35,34],[38,37,39,37],[38,38,39,38],[38,39,39,39],[34,37,35,37],[34,38,35,38],[34,39,35,39],[36,37,37,37],[36,38,37,38],[36,39,37,39],[30,32,31,32],[28,32,29,32],[26,32,27,32],[24,32,25,32],[22,32,23,32],[20,32,21,32],[15,26,17,31],[15,32,17,32],[40,31,41,31],[36,31,37,31],[32,31,33,31],[28,31,29,31],[34,29,35,29],[34,30,35,30],[36,29,37,29],[36,30,37,30],[38,29,39,29],[38,30,39,30],[28,29,29,29],[28,30,29,30],[30,29,31,29],[30,30,31,30],[32,29,33,29],[32,30,33,30],[48,26,49,27],[48,29,49,29],[48,30,49,30],[48,31,49,31],[48,28,49,28],[20,28,21,28],[20,31,21,31],[24,31,25,31],[24,28,25,28],[44,28,45,28],[40,28,41,28],[36,28,37,28],[32,28,33,28],[28,28,29,28],[26,31,27,31],[26,28,27,28],[22,31,23,31],[22,28,23,28],[38,31,39,31],[38,28,39,28],[34,31,35,31],[34,28,35,28],[30,31,31,31],[30,28,31,28],[46,29,47,29],[46,30,47,30],[46,31,47,31],[46,28,47,28],[42,31,43,31],[42,28,43,28],[44,31,45,31],[40,29,41,29],[40,30,41,30],[42,29,43,29],[42,30,43,30],[44,29,45,29],[44,30,45,30],[22,30,23,30],[24,29,25,29],[24,30,25,30],[26,29,27,29],[26,30,27,30],[18,31,19,31],[18,28,19,28],[18,30,19,30],[18,29,19,29],[20,29,21,29],[20,30,21,30],[44,26,45,27],[40,26,41,27],[36,26,37,27],[32,26,33,27],[18,27,19,27],[18,26,19,26],[46,27,47,27],[46,26,47,26],[42,27,43,27],[42,26,43,26],[22,27,23,27],[22,26,23,26],[24,26,25,27],[20,26,21,27],[18,32,19,32],[32,32,33,32],[30,27,31,27],[30,26,31,26],[26,27,27,27],[26,26,27,26],[28,26,29,27],[38,35,39,35],[38,36,39,36],[38,27,39,27],[38,26,39,26],[32,36,33,36],[34,35,35,35],[34,36,35,36],[36,36,37,36],[26,35,27,35],[26,36,27,36],[28,36,29,36],[30,35,31,35],[30,36,31,36],[28,34,29,35],[34,27,35,27],[34,26,35,26],[22,29,23,29]]}
[]
[null,"Groupe A"]
[null,"12 Juin","22h00","Brésil",3,1,"Croatie",{"$f":"IF(E3>F3,3,0)","v":3},{"$f":"IF(E3<F3,0,0)","v":0},{"$f":"IF(AND(E3=F3,ISNUMBER(E3),ISNUMBER(F3)),1,0)","v":0},{"$f":"IF(F3>E3,3,0)","v":0},{"$f":"IF(F3<E3,0,0)","v":0},{"$f":"IF(AND(F3=E3,ISNUMBER(F3),ISNUMBER(E3)),1,0)","v":0},null,null,{"$f":"IF(H3=3,D3,IF(K3=3,G3,IF(OR(J3,M3)=1,\"\",\"\")))","v":"Brésil"},null,null,null,"Groupe A","MJ","Pts","BP","BC",{"$f":"\"+/-\"","v":"+/-"}]
[null,"13 Juin","18h00","Mexique",1,0,"Cameroun",3,0,0,0,0,{"$f":"IF(AND(F4=E4,ISNUMBER(F4),ISNUMBER(E4)),1,0)","v":0},{"$f":"RANK(V4,$V$4:$V$7)","v":4},{"$f":"IF(OR(N4=N5,N4=N6,N4=N7),RANK(Y4,Y4:Y7),N4)","v":4},{"$f":"IF(H4=3,D4,IF(K4=3,G4,IF(OR(J4,M4)=1,\"\",\"\")))","v":"Mexique"},null,null,1,"Cameroun",{"$f":"SUM(IF(ISBLANK(F4),0,1),IF(ISBLANK(E6),0,1),IF(ISBLANK(E7),0,1))","v":3},{"$f":"SUM(K4:M4,H6:J7)","v":0},{"$f":"SUM(F4,E6:E7)","v":1},{"$f":"SUM(E4,F6:F7)","v":9},{"$f":"W4-X4","v":-8}]
[null,"17 Juin","21h00","Brésil",0,0,"Mexique",0,0,1,0,0,1,{"$f":"RANK(V5,$V$4:$V$7)","v":1},{"$f":"IF(OR(N5=N4,N5=N6,N5=N7),RANK(Y5,Y4:Y7),N5)","v":2},{"$f":"IF(H5=3,D5,IF(K5=3,G5,IF(OR(J5,M5)=1,\"\",\"\")))","v":""},null,null,2,"Mexique",{"$f":"SUM(IF(ISBLANK(E4),0,1),IF(ISBLANK(F5),0,1),IF(ISBLANK(F8),0,1))","v":3},{"$f":"SUM(H4:J4,K5:M5,K8:M8)","v":7},{"$f":"SUM(E4,F5,F8)","v":4},{"$f":"SUM(F4,E5,E8)","v":1},{"$f":"W5-X5","v":3}]
[null,"18 Juin","21h00","Cameroun",0,4,"Croatie",0,0,0,3,0,0,3,{"$f":"IF(OR(N6=N4,N6=N7,N6=N8),RANK(Y6,Y4:Y7),N6)","v":3},"Croatie",null,null,3,"Croatie",{"$f":"SUM(IF(ISBLANK(F3),0,1),IF(ISBLANK(F6),0,1),IF(ISBLANK(E8),0,1))","v":3},{"$f":"SUM(K3:M3,K6:M6,H8:J8)","v":3},{"$f":"SUM(F3,F6,E8)","v":6},{"$f":"SUM(E3,E6,F8)","v":6},{"$f":"W6-X6","v":0}]
[null,"23 Juin","22h00","Cameroun",1,4,"Brésil",0,0,0,3,0,0,1,{"$f":"IF(OR(N7=N4,N7=N5,N7=N6),RANK(Y7,Y4:Y7),N7)","v":1},"Brésil",null,null,4,"Brésil",{"$f":"SUM(IF(ISBLANK(E3),0,1),IF(ISBLANK(E5),0,1),IF(ISBLANK(F7),0,1))","v":3},{"$f":"SUM(H3:J3,H5:J5,K7:M7)","v":7},{"$f":"SUM(E3,E5,F7)","v":7},{"$f":"SUM(F3,F5,E7)","v":2},{"$f":"W7-X7","v":5}]
[null,"23 Juin","22h00","Croatie",1,3,"Mexique",0,0,{"$f":"IF(AND(E8=F8,ISNUMBER(E8),ISNUMBER(F8)),1,0)","v":0},3,0,0,null,null,{"$f":"IF(H8=3,D8,IF(K8=3,G8,IF(OR(J8,M8)=1,\"\",\"\")))","v":"Mexique"}]
[]
[null,"Groupe B"]
[null,"13 Juin","21h00","Espagne",1,5,"Pays-Bas",{"$f":"IF(E11>F11,3,0)","v":0},{"$f":"IF(E11<F11,0,0)","v":0},{"$f":"IF(AND(E11=F11,ISNUMBER(E11),ISNUMBER(F11)),1,0)","v":0},{"$f":"IF(F11>E11,3,0)","v":3},{"$f":"IF(F11<E11,0,0)","v":0},{"$f":"IF(AND(F11=E11,ISNUMBER(F11),ISNUMBER(E11)),1,0)","v":0},null,null,{"$f":"IF(H11=3,D11,IF(K11=3,G11,IF(OR(J11,M11)=1,\"\",\"\")))","v":"Pays-Bas"},null,null,null,"Groupe B","MJ","Pts","BP","BC",{"$f":"\"+/-\"","v":"+/-"}]
[null,"14 Juin","00h00","Chili",3,1,"Australie",3,0,0,0,0,{"$f":"IF(AND(F12=E12,ISNUMBER(F12),ISNUMBER(E12)),1,0)","v":0},{"$f":"RANK(V12,$V$12:$V$15)","v":1},{"$f":"IF(OR(N12=N13,N12=N14,N12=N15),RANK(Y12,Y12:Y15),N12)","v":1},{"$f":"IF(H12=3,D12,IF(K12=3,G12,IF(OR(J12,M12)=1,\"\",\"\")))","v":"Chili"},null,null,1,"Pays-Bas",{"$f":"SUM(IF(ISBLANK(F11),0,1),IF(ISBLANK(F14),0,1),IF(ISBLANK(E16),0,1))","v":3},{"$f":"SUM(K11:M11,K14:M14,H16:J16)","v":9},{"$f":"SUM(F11,F14,E16)","v":10},{"$f":"SUM(E11,E14,F16)","v":3},{"$f":"W12-X12","v":7}]
[null,"19 Juin","00h00","Espagne",0,2,"Chili",0,0,0,3,0,0,{"$f":"RANK(V13,$V$12:$V$15)","v":2},{"$f":"IF(OR(N13=N12,N13=N14,N13=N15),RANK(Y13,Y12:Y15),N13)","v":2},{"$f":"IF(H13=3,D13,IF(K13=3,G13,IF(OR(J13,M13)=1,\"\",\"\")))","v":"Chili"},null,null,2,"Chili",{"$f":"SUM(IF(ISBLANK(E12),0,1),IF(ISBLANK(F13),0,1),IF(ISBLANK(F16),0,1))","v":3},{"$f":"SUM(H12:J12,K13:M13,K16:M16)","v":6},{"$f":"SUM(E12,F13,F16)","v":5},{"$f":"SUM(F12,E13,E16)","v":3},{"$f":"W13-X13","v":2}]
[null,"18 Juin","18h00","Australie",2,3,"Pays-Bas",0,0,0,3,0,0,{"$f":"RANK(V14,$V$12:$V$15)","v":3},{"$f":"IF(OR(N14=N12,N14=N15,N14=N16),RANK(Y14,Y12:Y15),N14)","v":3},"Pays-Bas",null,null,3,"Espagne",{"$f":"SUM(IF(ISBLANK(E11),0,1),IF(ISBLANK(E13),0,1),IF(ISBLANK(F15),0,1))","v":3},{"$f":"SUM(H11:J11,H13:J13,K15:M15)","v":3},{"$f":"SUM(E11,E13,F15)","v":4},{"$f":"SUM(F11,F13,E15)","v":7},{"$f":"W14-X14","v":-3}]
[null,"23 Juin","18h00","Australie",0,3,"Espagne",0,0,0,3,0,0,{"$f":"RANK(V15,$V$12:$V$15)","v":4},{"$f":"IF(OR(N15=N12,N15=N13,N15=N14),RANK(Y15,Y12:Y15),N15)","v":4},"Espagne",null,null,4,"Australie",{"$f":"SUM(IF(ISBLANK(F12),0,1),IF(ISBLANK(E14),0,1),IF(ISBLANK(E15),0,1))","v":3},{"$f":"SUM(K12:M12,H14:J14,H15:J15)","v":0},{"$f":"SUM(F12,E14,E15)","v":3},{"$f":"SUM(E12,F14,F15)","v":9},{"$f":"W15-X15","v":-6}]
[null,"23 Juin","18h00","Pays-Bas",2,0,"Chili",3,0,{"$f":"IF(AND(E16=F16,ISNUMBER(E16),ISNUMBER(F16)),1,0)","v":0},0,0,0,null,null,{"$f":"IF(H16=3,D16,IF(K16=3,G16,IF(OR(J16,M16)=1,\"\",\"\")))","v":"Pays-Bas"},null,null,null,null,null,null,null,null,null,null,"Huitièmes de finale",null,null,null,null,null,"Qualifié"]
[]
[null,"Groupe C"]
[null,"14 Juin","18h00","Colombie",3,0,"Grèce",{"$f":"IF(E19>F19,3,0)","v":3},{"$f":"IF(E19<F19,0,0)","v":0},{"$f":"IF(AND(E19=F19,ISNUMBER(E19),ISNUMBER(F19)),1,0)","v":0},{"$f":"IF(F19>E19,3,0)","v":0},{"$f":"IF(F19<E19,0,0)","v":0},{"$f":"IF(AND(F19=E19,ISNUMBER(F19),ISNUMBER(E19)),1,0)","v":0},null,null,{"$f":"IF(H19=3,D19,IF(K19=3,G19,IF(OR(J19,M19)=1,\"\",\"\")))","v":"Colombie"},null,null,null,"Groupe C","MJ","Pts","BP","BC",{"$f":"\"+/-\"","v":"+/-"},null,"28 Juin","18H00",{"$f":"(IF(S4=1,T4,IF(S5=1,T5,IF(S6=1,T6,IF(S7=1,T7)))))","v":"Cameroun"},null,null,{"$f":"IF(S12=2,T12,IF(S13=2,T13,IF(S14=2,T14,IF(S15=2,T15,\"\"))))","v":"Chili"},{"$f":"IF(AD19>AE19,AC19,IF(AE19>AD19,AF19,IF(AD19=AE19,\"TAB\",\"\")))","v":"TAB"}]
[null,"15 Juin","00h00","Côte d'Ivoire",2,1,"Japon",3,0,0,0,0,{"$f":"IF(AND(F20=E20,ISNUMBER(F20),ISNUMBER(E20)),1,0)","v":0},{"$f":"RANK(V20,$V$20:$V$23)","v":1},null,{"$f":"IF(H20=3,D20,IF(K20=3,G20,IF(OR(J20,M20)=1,\"\",\"\")))","v":"Côte d'Ivoire"},null,null,1,"Colombie",{"$f":"SUM(IF(ISBLANK(E19),0,1),IF(ISBLANK(E21),0,1),IF(ISBLANK(F23),0,1))","v":2},{"$f":"SUM(H19:J19,H21:J21,K23:M23)","v":6},{"$f":"SUM(E19,E21,F23)","v":5},{"$f":"SUM(F19,F21,E23)","v":1},{"$f":"W20-X20","v":4}]
[null,"19 Juin","18h00","Colombie",2,1,"Côte d'Ivoire",3,0,0,0,0,0,{"$f":"RANK(V21,$V$20:$V$23)","v":2},null,{"$f":"IF(H21=3,D21,IF(K21=3,G21,IF(OR(J21,M21)=1,\"\",\"\")))","v":"Colombie"},null,null,2,"Côte d'Ivoire",{"$f":"SUM(IF(ISBLANK(E20),0,1),IF(ISBLANK(F21),0,1),IF(ISBLANK(F24),0,1))","v":2},{"$f":"SUM(H20:J20,K21:M21,K24:M24)","v":3},{"$f":"SUM(E20,F21,F24)","v":3},{"$f":"SUM(F20,E21,E24)","v":3},{"$f":"W21-X21","v":0},null,"Tirs aux Buts",null,{"$f":"IF(AD21=\"\",\"\",AC19)","v":""},null,null,{"$f":"IF(AE21=\"\",\"\",AF19)","v":""},{"$f":"IF(AD19=AE19,IF(AD21>AE21,AC21,IF(AE21>AD21,AF21,\" \")),\" \")","v":" "},null,null,null,null,null,null,null,null,null,null,null,null,null,null,null,null,null,"Finale",null,null,null,null,null,"Vainqueur"]
[null,"20 Juin","00h00","Japon",0,0,"Grèce",0,0,1,0,0,1,3,null,"",null,null,3,"Japon",{"$f":"SUM(IF(ISBLANK(F20),0,1),IF(ISBLANK(E22),0,1),IF(ISBLANK(E23),0,1))","v":2},{"$f":"SUM(K20:M20,H22:J22,H23:J23)","v":1},{"$f":"SUM(F20,E22,E23)","v":1},{"$f":"SUM(E20,F22,F23)","v":2},{"$f":"W22-X22","v":-1}]
[null,"24 Juin","22h00","Japon",null,null,"Colombie",0,0,0,0,0,0,3,null,"",null,null,4,"Grèce",{"$f":"SUM(IF(ISBLANK(F19),0,1),IF(ISBLANK(F22),0,1),IF(ISBLANK(E24),0,1))","v":2},{"$f":"SUM(K19:M19,K22:M22,H24:J24)","v":1},{"$f":"SUM(F19,F22,E24)","v":0},{"$f":"SUM(E19,E22,F24)","v":3},{"$f":"W23-X23","v":-3},null,"28 Juin","22H00",{"$f":"IF(S20=1,T20,IF(S21=1,T21,IF(S22=1,T22,IF(S23=1,T23,\"\"))))","v":"Colombie"},null,null,{"$f":"IF(S28=2,T28,IF(S29=2,T29,IF(S30=2,T30,IF(S31=2,T31,\"\"))))","v":"Italie"},{"$f":"IF(AD23>AE23,AC23,IF(AE23>AD23,AF23,IF(AD23=AE23,\"TAB\",\" \")))","v":"TAB"}]
[null,"24 Juin","22h00","Grèce",null,null,"Côte d'Ivoire",0,0,{"$f":"IF(AND(E24=F24,ISNUMBER(E24),ISNUMBER(F24)),1,0)","v":0},0,0,0,null,null,{"$f":"IF(H24=3,D24,IF(K24=3,G24,IF(OR(J24,M24)=1,\"\",\"\")))","v":""},null,null,null,null,null,null,null,null,null,null,null,null,null,null,null,null,null,null,"Quarts de finale",null,null,null,null,null,"Qualifié",null,null,null,null,null,null,null,null,null,"13 Juillet","21h00",{"$f":"IF(AW33=\" \",AW31,AW33)","v":false},1,2,{"$f":"IF(AW37=\" \",AW35,AW37)","v":false},{"$f":"IF(BB24>BC24,BA24,IF(BC24>BB24,BD24,IF(BB24=BC24,\"TAB\",\" \")))","v":false}]
[null,null,null,null,null,null,null,null,null,null,null,null,null,null,null,null,null,null,null,null,null,null,null,null,null,null,"Tirs aux Buts",null,{"$f":"IF(AD25=\"\",\"\",AC23)","v":""},null,null,{"$f":"IF(AE25=\"\",\"\",AF23)","v":""},{"$f":"IF(AD23=AE23,IF(AD25>AE25,AC25,IF(AE25>AD25,AF25)),\" \")","v":false}]
[null,"Groupe D",null,null,null,null,null,null,null,null,null,null,null,null,null,null,null,null,null,null,null,null,null,null,null,null,null,null,null,null,null,null,null,null,null,null,null,null,null,null,null,null,null,null,null,null,null,null,null,null,"Tirs aux Buts",null,{"$f":"IF(BB26=\"\",\"\",BA24)","v":""},null,null,{"$f":"IF(BC26=\"\",\"\",BD24)","v":""},{"$f":"IF(BB24=BC24,IF(BB26>BC26,BA26,IF(BC26>BB26,BD26)),\" \")","v":" "}]
[null,"14 Juin","21h00","Uruguay",1,3,"Costa Rica",{"$f":"IF(E27>F27,3,0)","v":0},{"$f":"IF(E27<F27,0,0)","v":0},{"$f":"IF(AND(E27=F27,ISNUMBER(E27),ISNUMBER(F27)),1,0)","v":0},{"$f":"IF(F27>E27,3,0)","v":3},{"$f":"IF(F27<E27,0,0)","v":0},{"$f":"IF(AND(F27=E27,ISNUMBER(F27),ISNUMBER(E27)),1,0)","v":0},null,null,{"$f":"IF(H27=3,D27,IF(K27=3,G27,IF(OR(J27,M27)=1,\"\",\"\")))","v":"Costa Rica"},null,null,null,"Groupe D","MJ","Pts","BP","BC",{"$f":"\"+/-\"","v":"+/-"},null,"29 Juin","18H00",{"$f":"IF(S12=1,T12,IF(S13=1,T13,IF(S14=1,T14,IF(S15=1,T15))))","v":"Pays-Bas"},null,null,{"$f":"IF(S4=2,T4,IF(S5=2,T5,IF(S6=2,T6,IF(S7=2,T7,\"\"))))","v":"Mexique"},{"$f":"IF(AD27>AE27,AC27,IF(AE27>AD27,AF27,IF(AD27=AE27,\"TAB\",\" \")))","v":"TAB"},null,"4 Juillet","22h00",{"$f":"IF(AG37=\" \",AG35,AG37)","v":false},null,null,{"$f":"IF(AG41=\" \",AG39,AG41)","v":false},{"$f":"IF(AL27>AM27,AK27,IF(AM27>AL27,AN27,IF(AL27=AM27,\"TAB\",\" \")))","v":"TAB"}]
[null,"15 Juin","03h00","Angleterre",1,2,"Italie",0,0,0,3,0,{"$f":"IF(AND(F28=E28,ISNUMBER(F28),ISNUMBER(E28)),1,0)","v":0},{"$f":"RANK(V28,$V$28:$V$31)","v":1},null,{"$f":"IF(H28=3,D28,IF(K28=3,G28,IF(OR(J28,M28)=1,\"\",\"\")))","v":"Italie"},null,null,1,"Costa Rica",{"$f":"SUM(IF(ISBLANK(F27),0,1),IF(ISBLANK(F30),0,1),IF(ISBLANK(E32),0,1))","v":2},{"$f":"SUM(K27:M27,K30:M30,H32:J32)","v":6},{"$f":"SUM(F27,F30,E32)","v":4},{"$f":"SUM(E27,E30,F32)","v":1},{"$f":"W28-X28","v":3},null,null,null,null,null,null,null,null,null,null,null,null,null,null,null,null,null,"Demi-finales",null,null,null,null,null,"Qualifié"]
[null,"19 Juin","21h00","Uruguay",2,1,"Angleterre",3,0,0,0,0,0,{"$f":"RANK(V29,$V$28:$V$31)","v":2},null,{"$f":"IF(H29=3,D29,IF(K29=3,G29,IF(OR(J29,M29)=1,\"\",\"\")))","v":"Uruguay"},null,null,2,"Italie",{"$f":"SUM(IF(ISBLANK(F28),0,1),IF(ISBLANK(E30),0,1),IF(ISBLANK(E31),0,1))","v":2},{"$f":"SUM(K28:M28,H30:J30,H31:J31)","v":3},{"$f":"SUM(F28,E30,E31)","v":2},{"$f":"SUM(E28,F30,F31)","v":2},{"$f":"W29-X29","v":0},null,"Tirs aux Buts",null,{"$f":"IF(AD29=\"\",\"\",AC27)","v":""},null,null,{"$f":"IF(AE29=\"\",\"\",AF27)","v":""},{"$f":"IF(AD27=AE27,IF(AD29>AE29,AC29,IF(AE29>AD29,AF29)),\" \")","v":false},null,"Tirs aux Buts",null,{"$f":"IF(AL29=\"\",\" \",AK27)","v":" "},null,null,{"$f":"IF(AM29=\"\",\" \",AN27)","v":" "},{"$f":"IF(AL27=AM27,IF(AL29>AM29,AK29,IF(AM29>AL29,AN29)),\" \")","v":false},null,null,null,null,null,null,null,null,null,null,"VAINQUEUR",null,{"$f":"IF(BE26=\" \",BE24,BE26)","v":false}]
[null,"20 Juin","18h00","Italie",0,1,"Costa Rica",0,0,0,3,0,0,2,null,"Costa Rica",null,null,3,"Uruguay",{"$f":"SUM(IF(ISBLANK(E27),0,1),IF(ISBLANK(E29),0,1),IF(ISBLANK(F31),0,1))","v":2},{"$f":"SUM(H27:J27,H29:J29,K31:M31)","v":3},{"$f":"SUM(E27,E29,F31)","v":3},{"$f":"SUM(F27,F29,E31)","v":4},{"$f":"W30-X30","v":-1}]
[null,"24 Juin","18h00","Italie",null,null,"Uruguay",0,0,0,0,0,0,4,null,"",null,null,4,"Angleterre",{"$f":"SUM(IF(ISBLANK(E28),0,1),IF(ISBLANK(F29),0,1),IF(ISBLANK(F32),0,1))","v":2},{"$f":"SUM(H28:J28,K29:M29,K32:M32)","v":0},{"$f":"SUM(E28,F29,F32)","v":2},{"$f":"SUM(F28,E29,E32)","v":4},{"$f":"W31-X31","v":-2},null,"29 Juin","22h00",{"$f":"IF(S28=1,T28,IF(S29=1,T29,IF(S30=1,T30,IF(S31=1,T31))))","v":"Costa Rica"},null,null,{"$f":"IF(S20=2,T20,IF(S21=2,T21,IF(S22=2,T22,IF(S23=2,T23,\"\"))))","v":"Côte d'Ivoire"},{"$f":"IF(AD31>AE31,AC31,IF(AE31>AD31,AF31,IF(AD31=AE31,\"TAB\",\" \")))","v":"TAB"},null,"4 Juillet","18h00",{"$f":"IF(AG21=\" \",AG19,AG21)","v":"TAB"},null,null,{"$f":"IF(AG25=\" \",AG23,AG25)","v":false},{"$f":"IF(AL31>AM31,AK31,IF(AM31>AL31,AN31,IF(AL31=AM31,\"TAB\",\" \")))","v":"TAB"},null,"8 Juillet","18h00",{"$f":"IF(AO33=\" \",AO31,AO33)","v":false},null,null,{"$f":"IF(AO29=\" \",AO27,AO29)","v":false},{"$f":"IF(AT31>AU31,AS31,IF(AU31>AT31,AV31,IF(AT31=AU31,\"TAB\",\" \")))","v":"TAB"}]
[null,"24 Juin","18h00","Costa Rica",null,null,"Angleterre",0,0,{"$f":"IF(AND(E32=F32,ISNUMBER(E32),ISNUMBER(F32)),1,0)","v":0},0,0,0,null,null,{"$f":"IF(H32=3,D32,IF(K32=3,G32,IF(OR(J32,M32)=1,\"\",\"\")))","v":""},null,null,null,null,null,null,null,null,null,null,null,null,null,null,null,null,null,null,null,null,null,null,null,null,null,null,null,null,null,null,null,null,null,null,null,"SECOND",null,{"$f":"IF(OR(BE26=BA24,BE24=BA24),BD24,BA24)","v":false}]
[null,null,null,null,null,null,null,null,null,null,null,null,null,null,null,null,null,null,null,null,null,null,null,null,null,null,"Tirs aux Buts",null,{"$f":"IF(AD33=\"\",\"\",AC31)","v":""},null,null,{"$f":"IF(AE33=\"\",\"\",AF31)","v":""},{"$f":"IF(AD31=AE31,IF(AD33>AE33,AC33,IF(AE33>AD33,AF33)),\" \")","v":false},null,"Tirs aux Buts",null,{"$f":"IF(AL33=\"\",\" \",AK31)","v":" "},null,null,{"$f":"IF(AM33=\"\",\"\",AN31)","v":""},{"$f":"IF(AL31=AM31,IF(AL33>AM33,AK33,IF(AM33>AL33,AN33)),\" \")","v":false},null,"Tirs aux Buts",null,{"$f":"IF(AT33=\"\",\"\",AS31)","v":""},null,null,{"$f":"IF(AU33=\"\",\"\",AV31)","v":""},{"$f":"IF(AT31=AU31,IF(AT33>AU33,AS33,IF(AU33>AT33,AV33)),\" \")","v":false}]
[null,"Groupe E",null,null,null,null,null,null,null,null,null,null,null,null,null,null,null,null,null,null,null,null,null,null,null,null,null,null,null,null,null,null,null,null,null,null,null,null,null,null,null,null,null,null,null,null,null,null,null,null,null,"TROISIEME",null,{"$f":"IF(BE44=\" \",BE42,BE44)","v":false}]
[null,"15 Juin","18h00","Suisse",2,1,"Equateur",{"$f":"IF(E35>F35,3,0)","v":3},{"$f":"IF(E35<F35,0,0)","v":0},{"$f":"IF(AND(E35=F35,ISNUMBER(E35),ISNUMBER(F35)),1,0)","v":0},{"$f":"IF(F35>E35,3,0)","v":0},{"$f":"IF(F35<E35,0,0)","v":0},{"$f":"IF(AND(F35=E35,ISNUMBER(F35),ISNUMBER(E35)),1,0)","v":0},null,null,{"$f":"IF(H35=3,D35,IF(K35=3,G35,IF(OR(J35,M35)=1,\"\",\"\")))","v":"Suisse"},null,null,null,"Groupe E","MJ","Pts","BP","BC",{"$f":"\"+/-\"","v":"+/-"},null,"30 Juin","18h00",{"$f":"IF(S36=1,T36,IF(S37=1,T37,IF(S38=1,T38,IF(S39=1,T39))))","v":"France"},null,null,{"$f":"IF(S44=2,T44,IF(S45=2,T45,IF(S46=2,T46,IF(S47=2,T47,\"\"))))","v":"Nigéria"},{"$f":"IF(AD35>AE35,AC35,IF(AE35>AD35,AF35,IF(AD35=AE35,\"TAB\",\" \")))","v":"TAB"},null,"5 Juillet","22h00",{"$f":"IF(AG45=\" \",AG43,AG45)","v":false},null,null,{"$f":"IF(AG49=\" \",AG47,AG49)","v":false},{"$f":"IF(AL35>AM35,AK35,IF(AM35>AL35,AN35,IF(AL35=AM35,\"TAB\",\" \")))","v":"TAB"},null,"9 Juillet","22h00",{"$f":"IF(AO41=\" \",AO39,AO41)","v":false},null,null,{"$f":"IF(AO37=\" \",AO35,AO37)","v":false},{"$f":"IF(AT35>AU35,AS35,IF(AU35>AT35,AV35,IF(AT35=AU35,\"TAB\",\" \")))","v":"TAB"}]
[null,"15 Juin","21h00","France",3,0,"Honduras",3,0,0,0,0,{"$f":"IF(AND(F36=E36,ISNUMBER(F36),ISNUMBER(E36)),1,0)","v":0},{"$f":"RANK(V36,$V$36:$V$39)","v":1},null,{"$f":"IF(H36=3,D36,IF(K36=3,G36,IF(OR(J36,M36)=1,\"\",\"\")))","v":"France"},null,null,1,"France",{"$f":"SUM(IF(ISBLANK(E36),0,1),IF(ISBLANK(F37),0,1),IF(ISBLANK(F40),0,1))","v":2},{"$f":"SUM(H36:J36,K37:M37,K40:M40)","v":6},{"$f":"SUM(E36,F37,F40)","v":8},{"$f":"SUM(F36,E37,E40)","v":2},{"$f":"W36-X36","v":6},null,null,null,null,null,null,null,null,null,null,null,null,null,null,null,null,null,null,null,null,null,null,null,null,null,null,"QUATRIEME",null,{"$f":"IF(OR(BE44=BA42,BE42=BA42),BD42,BA42)","v":false}]
[null,"20 Juin","21h00","Suisse",2,5,"France",0,0,0,3,0,0,{"$f":"RANK(V37,$V$36:$V$39)","v":2},null,{"$f":"IF(H37=3,D37,IF(K37=3,G37,IF(OR(J37,M37)=1,\"\",\"\")))","v":"France"},null,null,2,"Equateur",{"$f":"SUM(IF(ISBLANK(F35),0,1),IF(ISBLANK(F38),0,1),IF(ISBLANK(E40),0,1))","v":2},{"$f":"SUM(K35:M35,K38:M38,H40:J40)","v":3},{"$f":"SUM(F35,F38,E40)","v":3},{"$f":"SUM(E35,E38,F40)","v":3},{"$f":"W37-X37","v":0},null,"Tirs aux Buts",null,{"$f":"IF(AD37=\"\",\"\",AC35)","v":""},null,null,{"$f":"IF(AE37=\"\",\"\",AF35)","v":""},{"$f":"IF(AD35=AE35,IF(AD37>AE37,AC37,IF(AE37>AD37,AF37)),\" \")","v":false},null,"Tirs aux Buts",null,{"$f":"IF(AL37=\"\",\"\",AK35)","v":""},null,null,{"$f":"IF(AM37=\"\",\"\",AN35)","v":""},{"$f":"IF(AL35=AM35,IF(AL37>AM37,AK37,IF(AM37>AL37,AN37)),\" \")","v":false},null,"Tirs aux Buts",null,{"$f":"IF(AT37=\"\",\"\",AS35)","v":""},null,null,{"$f":"IF(AU37=\"\",\"\",AV35)","v":""},{"$f":"IF(AT35=AU35,IF(AT37>AU37,AS37,IF(AU37>AT37,AV37)),\" \")","v":false}]
[null,"21 Juin","00h00","Honduras",1,2,"Equateur",0,0,0,3,0,0,2,null,"Equateur",null,null,3,"Suisse",{"$f":"SUM(IF(ISBLANK(E35),0,1),IF(ISBLANK(E37),0,1),IF(ISBLANK(F39),0,1))","v":2},{"$f":"SUM(H35:J35,H37:J37,K39:M39)","v":3},{"$f":"SUM(E35,E37,F39)","v":4},{"$f":"SUM(F35,F37,E39)","v":6},{"$f":"W38-X38","v":-2}]
[null,"25 Juin","22h00","Honduras",null,null,"Suisse",0,0,0,0,0,0,4,null,"",null,null,4,"Honduras",{"$f":"SUM(IF(ISBLANK(F36),0,1),IF(ISBLANK(E38),0,1),IF(ISBLANK(E39),0,1))","v":2},{"$f":"SUM(K36:M36,H38:J38,H39:J39)","v":0},{"$f":"SUM(F36,E38,E39)","v":1},{"$f":"SUM(E36,F38,F39)","v":5},{"$f":"W39-X39","v":-4},null,"30 Juin","22h00",{"$f":"IF(S52=1,T52,IF(S53=1,T53,IF(S54=1,T54,IF(S55=1,T55))))","v":"Allemagne"},null,null,{"$f":"IF(S60=2,T60,IF(S61=2,T61,IF(S62=2,T62,IF(S63=2,T63,\"\"))))","v":"Algérie"},{"$f":"IF(AD39>AE39,AC39,IF(AE39>AD39,AF39,IF(AD39=AE39,\"TAB\",\" \")))","v":"TAB"},null,"5 Juillet","18h00",{"$f":"IF(AG29=\" \",AG27,AG29)","v":false},null,null,{"$f":"IF(AG33=\" \",AG31,AG33)","v":false},{"$f":"IF(AL39>AM39,AK39,IF(AM39>AL39,AN39,IF(AL39=AM39,\"TAB\",\" \")))","v":"TAB"},null,null,null,null,null,null,null,null,null,"Troisième place",null,null,null,null,null,"Qualifié"]
[null,"25 Juin","22h00","Equateur",null,null,"France",0,0,{"$f":"IF(AND(E40=F40,ISNUMBER(E40),ISNUMBER(F40)),1,0)","v":0},0,0,0,null,null,{"$f":"IF(H40=3,D40,IF(K40=3,G40,IF(OR(J40,M40)=1,\"\",\"\")))","v":""}]
[null,null,null,null,null,null,null,null,null,null,null,null,null,null,null,null,null,null,null,null,null,null,null,null,null,null,"Tirs aux Buts",null,{"$f":"IF(AD41=\"\",\"\",AC39)","v":""},null,null,{"$f":"IF(AE41=\"\",\"\",AF39)","v":""},{"$f":"IF(AD39=AE39,IF(AD41>AE41,AC41,IF(AE41>AD41,AF41)),\" \")","v":false},null,"Tirs aux Buts",null,{"$f":"IF(AL41=\"\",\"\",AK39)","v":""},null,null,{"$f":"IF(AM41=\"\",\"\",AN39)","v":""},{"$f":"IF(AL39=AM39,IF(AL41>AM41,AK41,IF(AM41>AL41,AN41)),\" \")","v":false}]
[null,"Groupe F",null,null,null,null,null,null,null,null,null,null,null,null,null,null,null,null,null,null,null,null,null,null,null,null,null,null,null,null,null,null,null,null,null,null,null,null,null,null,null,null,null,null,null,null,null,null,null,null,"12 Juillet","21h00",{"$f":"IF(BA24=AS31,AV31,AS31)","v":false},2,1,{"$f":"IF(BD24=AS35,AV35,AS35)","v":false},{"$f":"IF(BB42>BC42,BA42,IF(BC42>BB42,BD42,IF(BB42=BC42,\"TAB\",\" \")))","v":false}]
[null,"16 Juin","00h00","Argentine",2,1,"Bosnie-Herzégovine",{"$f":"IF(E43>F43,3,0)","v":3},{"$f":"IF(E43<F43,0,0)","v":0},{"$f":"IF(AND(E43=F43,ISNUMBER(E43),ISNUMBER(F43)),1,0)","v":0},{"$f":"IF(F43>E43,3,0)","v":0},{"$f":"IF(F43<E43,0,0)","v":0},{"$f":"IF(AND(F43=E43,ISNUMBER(F43),ISNUMBER(E43)),1,0)","v":0},null,null,{"$f":"IF(H43=3,D43,IF(K43=3,G43,IF(OR(J43,M43)=1,\"\",\"\")))","v":"Argentine"},null,null,null,"Groupe F","MJ","Pts","BP","BC",{"$f":"\"+/-\"","v":"+/-"},null,"1er Juillet","18h00",{"$f":"IF(S44=1,T44,IF(S45=1,T45,IF(S46=1,T46,IF(S47=1,T47))))","v":"Argentine"},null,null,{"$f":"IF(S36=2,T36,IF(S37=2,T37,IF(S38=2,T38,IF(S39=2,T39,\"\"))))","v":"Equateur"},{"$f":"IF(AD43>AE43,AC43,IF(AE43>AD43,AF43,IF(AD43=AE43,\"TAB\",\" \")))","v":"TAB"}]
[null,"16 Juin","21h00","Iran",0,0,"Nigéria",0,0,1,0,0,{"$f":"IF(AND(F44=E44,ISNUMBER(F44),ISNUMBER(E44)),1,0)","v":1},{"$f":"RANK(V44,$V$44:$V$47)","v":1},null,{"$f":"IF(H44=3,D44,IF(K44=3,G44,IF(OR(J44,M44)=1,\"\",\"\")))","v":""},null,null,1,"Argentine",{"$f":"SUM(IF(ISBLANK(E43),0,1),IF(ISBLANK(E45),0,1),IF(ISBLANK(F47),0,1))","v":2},{"$f":"SUM(H43:J43,H45:J45,K47:M47)","v":6},{"$f":"SUM(E43,E45,F47)","v":3},{"$f":"SUM(F43,F45,E47)","v":1},{"$f":"W44-X44","v":2},null,null,null,null,null,null,null,null,null,null,null,null,null,null,null,null,null,null,null,null,null,null,null,null,null,"Tirs aux Buts",null,{"$f":"IF(BB44=\"\",\"\",BA42)","v":""},null,null,{"$f":"IF(BC44=\"\",\"\",BD42)","v":""},{"$f":"IF(BB42=BC42,IF(BB44>BC44,BA44,IF(BC44>BB44,BD44)),\" \")","v":" "}]
[null,"21 Juin","18h00","Argentine",1,0,"Iran",3,0,0,0,0,0,{"$f":"RANK(V45,$V$44:$V$47)","v":2},null,{"$f":"IF(H45=3,D45,IF(K45=3,G45,IF(OR(J45,M45)=1,\"\",\"\")))","v":"Argentine"},null,null,2,"Nigéria",{"$f":"SUM(IF(ISBLANK(F44),0,1),IF(ISBLANK(E46),0,1),IF(ISBLANK(E47),0,1))","v":2},{"$f":"SUM(K44:M44,H46:J46,H47:J47)","v":4},{"$f":"SUM(F44,E46,E47)","v":1},{"$f":"SUM(E44,F46,F47)","v":0},{"$f":"W45-X45","v":1},null,"Tirs aux Buts",null,{"$f":"IF(AD45=\"\",\"\",AC43)","v":""},null,null,{"$f":"IF(AE45=\"\",\"\",AF43)","v":""},{"$f":"IF(AD43=AE43,IF(AD45>AE45,AC45,IF(AE45>AD45,AF45)),\" \")","v":false}]
[null,"22 Juin","00h00","Nigéria",1,0,"Bosnie-Herzégovine",3,0,0,0,0,0,3,null,"Nigéria",null,null,3,"Iran",{"$f":"SUM(IF(ISBLANK(E44),0,1),IF(ISBLANK(F45),0,1),IF(ISBLANK(F48),0,1))","v":2},{"$f":"SUM(H44:J44,K45:M45,K48:M48)","v":1},{"$f":"SUM(E44,F45,F48)","v":0},{"$f":"SUM(F44,E45,E48)","v":1},{"$f":"W46-X46","v":-1}]
[null,"25 Juin","18h00","Nigéria",null,null,"Argentine",0,0,0,0,0,0,4,null,"",null,null,4,"Bosnie-Herzégovine",{"$f":"SUM(IF(ISBLANK(F43),0,1),IF(ISBLANK(F46),0,1),IF(ISBLANK(E48),0,1))","v":2},{"$f":"SUM(K43:M43,K46:M46,H48:J48)","v":0},{"$f":"SUM(F43,F46,E48)","v":1},{"$f":"SUM(E43,E46,F48)","v":3},{"$f":"W47-X47","v":-2},null,"1er Juillet","22h00",{"$f":"IF(S60=1,T60,IF(S61=1,T61,IF(S62=1,T62,IF(S63=1,T63))))","v":"Belgique"},null,null,{"$f":"IF(S52=2,T52,IF(S53=2,T53,IF(S54=2,T54,IF(S55=2,T55,\"\"))))","v":"Etats-Unis"},{"$f":"IF(AD47>AE47,AC47,IF(AE47>AD47,AF47,IF(AD47=AE47,\"TAB\",\" \")))","v":"TAB"}]
[null,"25 Juin","18h00","Bosnie-Herzégovine",null,null,"Iran",0,0,{"$f":"IF(AND(E48=F48,ISNUMBER(E48),ISNUMBER(F48)),1,0)","v":0},0,0,0,null,null,{"$f":"IF(H48=3,D48,IF(K48=3,G48,IF(OR(J48,M48)=1,\"\",\"\")))","v":""}]
[null,null,null,null,null,null,null,null,null,null,null,null,null,null,null,null,null,null,null,null,null,null,null,null,null,null,"Tirs aux Buts",null,{"$f":"IF(AD49=\"\",\"\",AC47)","v":""},null,null,{"$f":"IF(AE49=\"\",\"\",AF47)","v":""},{"$f":"IF(AD47=AE47,IF(AD49>AE49,AC49,IF(AE49>AD49,AF49)),\" \")","v":false}]
[null,"Groupe G"]
[null,"16 Juin","18h00","Allemagne",4,0,"Portugal",{"$f":"IF(E51>F51,3,0)","v":3},{"$f":"IF(E51<F51,0,0)","v":0},{"$f":"IF(AND(E51=F51,ISNUMBER(E51),ISNUMBER(F51)),1,0)","v":0},{"$f":"IF(F51>E51,3,0)","v":0},{"$f":"IF(F51<E51,0,0)","v":0},{"$f":"IF(AND(F51=E51,ISNUMBER(F51),ISNUMBER(E51)),1,0)","v":0},null,null,{"$f":"IF(H51=3,D51,IF(K51=3,G51,IF(OR(J51,M51)=1,\"\",\"\")))","v":"Allemagne"},null,null,null,"Groupe G","MJ","Pts","BP","BC",{"$f":"\"+/-\"","v":"+/-"}]
[null,"17 Juin","00h00","Ghana",1,2,"Etats-Unis",0,0,0,3,0,{"$f":"IF(AND(F52=E52,ISNUMBER(F52),ISNUMBER(E52)),1,0)","v":0},{"$f":"RANK(V52,$V$52:$V$55)","v":1},null,{"$f":"IF(H52=3,D52,IF(K52=3,G52,IF(OR(J52,M52)=1,\"\",\"\")))","v":"Etats-Unis"},null,null,1,"Allemagne",{"$f":"SUM(IF(ISBLANK(E51),0,1),IF(ISBLANK(E53),0,1),IF(ISBLANK(F55),0,1))","v":2},{"$f":"SUM(H51:J51,H53:J53,K55:M55)","v":4},{"$f":"SUM(E51,E53,F55)","v":6},{"$f":"SUM(F51,F53,E55)","v":2},{"$f":"W52-X52","v":4}]
[null,"21 Juin","21h00","Allemagne",2,2,"Ghana",0,0,1,0,0,1,{"$f":"RANK(V53,$V$52:$V$55)","v":1},null,{"$f":"IF(H53=3,D53,IF(K53=3,G53,IF(OR(J53,M53)=1,\"\",\"\")))","v":""},null,null,2,"Etats-Unis",{"$f":"SUM(IF(ISBLANK(F52),0,1),IF(ISBLANK(E54),0,1),IF(ISBLANK(E55),0,1))","v":2},{"$f":"SUM(K52:M52,H54:J54,H55:J55)","v":4},{"$f":"SUM(F52,E54,E55)","v":4},{"$f":"SUM(E52,F54,F55)","v":3},{"$f":"W53-X53","v":1}]
[null,"22 Juin","21h00","Etats-Unis",2,2,"Portugal",0,0,1,0,0,1,3,null,"",null,null,3,"Ghana",{"$f":"SUM(IF(ISBLANK(E52),0,1),IF(ISBLANK(F53),0,1),IF(ISBLANK(F56),0,1))","v":2},{"$f":"SUM(H52:J52,K53:M53,K56:M56)","v":1},{"$f":"SUM(E52,F53,F56)","v":3},{"$f":"SUM(F52,E53,F56)","v":4},{"$f":"W54-X54","v":-1}]
[null,"26 Juin","18h00","Etats-Unis",null,null,"Allemagne",0,0,0,0,0,0,3,null,"",null,null,4,"Portugal",{"$f":"SUM(IF(ISBLANK(F51),0,1),IF(ISBLANK(F54),0,1),IF(ISBLANK(E56),0,1))","v":2},{"$f":"SUM(K51:M51,K54:M54,H56:J56)","v":1},{"$f":"SUM(F51,F54,E56)","v":2},{"$f":"SUM(E51,E54,F56)","v":6},{"$f":"W55-X55","v":-4}]
[null,"26 Juin","18h00","Portugal",null,null,"Ghana",0,0,{"$f":"IF(AND(E56=F56,ISNUMBER(E56),ISNUMBER(F56)),1,0)","v":0},0,0,0,null,null,{"$f":"IF(H56=3,D56,IF(K56=3,G56,IF(OR(J56,M56)=1,\"\",\"\")))","v":""}]
[]
[null,"Groupe H"]
[null,"17 Juin","18h00","Belgique",2,1,"Algérie",{"$f":"IF(E59>F59,3,0)","v":3},{"$f":"IF(E59<F59,0,0)","v":0},{"$f":"IF(AND(E59=F59,ISNUMBER(E59),ISNUMBER(F59)),1,0)","v":0},{"$f":"IF(F59>E59,3,0)","v":0},{"$f":"IF(F59<E59,0,0)","v":0},{"$f":"IF(AND(F59=E59,ISNUMBER(F59),ISNUMBER(E59)),1,0)","v":0},null,null,{"$f":"IF(H59=3,D59,IF(K59=3,G59,IF(OR(J59,M59)=1,\"\",\"\")))","v":"Belgique"},null,null,null,"Groupe H","MJ","Pts","BP","BC",{"$f":"\"+/-\"","v":"+/-"}]
[null,"18 Juin","00h00","Russie",1,1,"Corée du Sud",0,0,1,0,0,{"$f":"IF(AND(F60=E60,ISNUMBER(F60),ISNUMBER(E60)),1,0)","v":1},{"$f":"RANK(V60,$V$60:$V$63)","v":1},null,{"$f":"IF(H60=3,D60,IF(K60=3,G60,IF(OR(J60,M60)=1,\"\",\"\")))","v":""},null,null,1,"Belgique",{"$f":"SUM(IF(ISBLANK(E59),0,1),IF(ISBLANK(E61),0,1),IF(ISBLANK(F63),0,1))","v":2},{"$f":"SUM(H59:J59,H61:J61,K63:M63)","v":6},{"$f":"SUM(E59,E61,F63)","v":3},{"$f":"SUM(F59,F61,E63)","v":1},{"$f":"W60-X60","v":2}]
[null,"23 Juin","00h00","Belgique",1,0,"Russie",3,0,0,0,0,0,{"$f":"RANK(V61,$V$60:$V$63)","v":2},null,{"$f":"IF(H61=3,D61,IF(K61=3,G61,IF(OR(J61,M61)=1,\"\",\"\")))","v":"Belgique"},null,null,2,"Algérie",{"$f":"SUM(IF(ISBLANK(F59),0,1),IF(ISBLANK(F62),0,1),IF(ISBLANK(E64),0,1))","v":2},{"$f":"SUM(K59:M59,K62:M62,H64:J64)","v":3},{"$f":"SUM(F59,F62,E64)","v":5},{"$f":"SUM(E59,E62,F64)","v":4},{"$f":"W61-X61","v":1}]
[null,"22 Juin","18h00","Corée du Sud",2,4,"Algérie",0,0,0,3,0,0,{"$f":"RANK(V62,$V$60:$V$63)","v":3},null,"Algérie",null,null,3,"Russie",{"$f":"SUM(IF(ISBLANK(E60),0,1),IF(ISBLANK(F61),0,1),IF(ISBLANK(F64),0,1))","v":2},{"$f":"SUM(H60:J60,K61:M61,K64:M64)","v":1},{"$f":"SUM(E60,F61,F64)","v":1},{"$f":"SUM(F60,E61,E64)","v":2},{"$f":"W62-X62","v":-1}]
[null,"26 Juin","22h00","Corée du Sud",null,null,"Belgique",0,0,0,0,0,0,{"$f":"RANK(V63,$V$60:$V$63)","v":3},null,"",null,null,4,"Corée du Sud",{"$f":"SUM(IF(ISBLANK(F60),0,1),IF(ISBLANK(E62),0,1),IF(ISBLANK(E63),0,1))","v":2},{"$f":"SUM(K60:M60,H62:J62,H63:J63)","v":1},{"$f":"SUM(F60,E62,E63)","v":3},{"$f":"SUM(E60,F62,F63)","v":5},{"$f":"W63-X63","v":-2}]
[null,"26 Juin","22h00","Algérie",null,null,"Russie",0,0,{"$f":"IF(AND(E64=F64,ISNUMBER(E64),ISNUMBER(F64)),1,0)","v":0},0,0,0,null,null,{"$f":"IF(H64=3,D64,IF(K64=3,G64,IF(OR(J64,M64)=1,\"\",\"\")))","v":""}]